asterixdb-dev mailing list archives

Site index · List index
Message view « Date » · « Thread »
Top « Date » · « Thread »
From Asterix build server <jenk...@asterix-jenkins.ics.uci.edu>
Subject Build failed in Jenkins: asterix-integration-tests e0e85a39
Date Fri, 28 Apr 2017 19:47:36 GMT
See <https://asterix-jenkins.ics.uci.edu/job/asterix-integration-tests/656/changes>

Changes:

[Michael Blow] Cleanup Logging, Report Joined Nodes, Misc Cleanup

------------------------------------------
[...truncated 650935 lines...]
[INFO] hyracks-ecosystem-full-stack
[INFO] hyracks
[INFO] hyracks-util
[INFO] hyracks-ipc
[INFO] hyracks-api
[INFO] hyracks-net
[INFO] hyracks-comm
[INFO] hyracks-control
[INFO] hyracks-control-common
[INFO] hyracks-http
[INFO] hyracks-control-cc
[INFO] hyracks-control-nc
[INFO] hyracks-client
[INFO] hyracks-data
[INFO] hyracks-data-std
[INFO] hyracks-dataflow-common
[INFO] hyracks-dataflow-std
[INFO] hyracks-nc-service
[INFO] hyracks-storage-common
[INFO] hyracks-storage-am-common
[INFO] hyracks-storage-am-bloomfilter
[INFO] hyracks-storage-am-btree
[INFO] hyracks-storage-am-lsm-common
[INFO] hyracks-storage-am-lsm-invertedindex
[INFO] hyracks-storage-am-lsm-btree
[INFO] hyracks-storage-am-rtree
[INFO] hyracks-storage-am-lsm-rtree
[INFO] hyracks-test-support
[INFO] hyracks-tests
[INFO] hyracks-storage-common-test
[INFO] hyracks-storage-am-btree-test
[INFO] hyracks-storage-am-rtree-test
[INFO] hyracks-storage-am-lsm-common-test
[INFO] hyracks-storage-am-lsm-btree-test
[INFO] hyracks-storage-am-lsm-rtree-test
[INFO] hyracks-storage-am-lsm-invertedindex-test
[INFO] hyracks-storage-am-bloomfilter-test
[INFO] hyracks-server
[INFO] hyracks-examples
[INFO] tpch-example
[INFO] tpchclient
[INFO] tpchserver
[INFO] text-example
[INFO] texthelper
[INFO] textclient
[INFO] hyracks-maven-plugins
[INFO] Hyracks VirtualCluster Maven Plugin
[INFO] textserver
[INFO] btree-example
[INFO] btreehelper
[INFO] btreeclient
[INFO] btreeserver
[INFO] hyracks-integration-tests
[INFO] hyracks-shutdown-test
[INFO] hyracks-documentation
[INFO] license-automation-plugin
[INFO] hyracks-hdfs
[INFO] hyracks-hdfs-1.x
[INFO] hyracks-hdfs-2.x
[INFO] hyracks-hdfs-core
[INFO] hyracks-dist
[INFO] algebricks
[INFO] algebricks-common
[INFO] algebricks-data
[INFO] algebricks-runtime
[INFO] algebricks-core
[INFO] algebricks-compiler
[INFO] algebricks-rewriter
[INFO] algebricks-tests
[INFO] algebricks-examples
[INFO] piglet-example
[INFO] hyracks-fullstack-license
[INFO] apache-asterixdb
[INFO] asterix-common
[INFO] asterix-om
[INFO] asterix-fuzzyjoin
[INFO] asterix-maven-plugins
[INFO] record-manager-generator-maven-plugin
[INFO] asterix-transactions
[INFO] asterix-runtime
[INFO] asterix-events
[INFO] asterix-active
[INFO] asterix-hivecompat
[INFO] lexer-generator-maven-plugin
[INFO] asterix-external-data
[INFO] asterix-metadata
[INFO] asterix-lang-common
[INFO] asterix-lang-aql
[INFO] asterix-lang-sqlpp
[INFO] asterix-grammar-extension-maven-plugin
[INFO] asterix-evaluator-generator-maven-plugin
[INFO] asterix-algebra
[INFO] asterix-test-framework
[INFO] asterix-replication
[INFO] asterix-test-datagenerator-maven-plugin
[INFO] asterix-app
[INFO] asterix-tools
[INFO] asterix-examples
[INFO] asterix-client-helper
[INFO] asterix-server
[INFO] asterix-doc
[INFO] asterix-benchmark
[INFO] asterix-coverage
[INFO] asterix-license
[INFO] asterix-installer
[INFO] asterix-yarn
[INFO] asterix-experiments
[INFO] hyracks-asterix
[WARNING] The POM for org.eclipse.m2e:lifecycle-mapping:jar:1.0.0 is missing, no dependency
information available
[WARNING] Failed to retrieve plugin descriptor for org.eclipse.m2e:lifecycle-mapping:1.0.0:
Plugin org.eclipse.m2e:lifecycle-mapping:1.0.0 or one of its dependencies could not be resolved:
Failure to find org.eclipse.m2e:lifecycle-mapping:jar:1.0.0 in https://repo.maven.apache.org/maven2
was cached in the local repository, resolution will not be reattempted until the update interval
of central has elapsed or updates are forced
[INFO]                                                                         
[INFO] ------------------------------------------------------------------------
[INFO] Building hyracks-asterix 0.9.1
[INFO] ------------------------------------------------------------------------
[INFO] 
[INFO] --- sonar-maven-plugin:3.2:sonar (default-cli) @ apache-asterixdb-fullstack ---
[INFO] User cache: /home/jenkins/.sonar/cache
[ERROR] SonarQube server [https://asterix-sonar.ics.uci.edu] can not be reached
[INFO] ------------------------------------------------------------------------
[INFO] Reactor Summary:
[INFO] 
[INFO] hyracks-ecosystem-full-stack ....................... SKIPPED
[INFO] hyracks ............................................ SKIPPED
[INFO] hyracks-util ....................................... SKIPPED
[INFO] hyracks-ipc ........................................ SKIPPED
[INFO] hyracks-api ........................................ SKIPPED
[INFO] hyracks-net ........................................ SKIPPED
[INFO] hyracks-comm ....................................... SKIPPED
[INFO] hyracks-control .................................... SKIPPED
[INFO] hyracks-control-common ............................. SKIPPED
[INFO] hyracks-http ....................................... SKIPPED
[INFO] hyracks-control-cc ................................. SKIPPED
[INFO] hyracks-control-nc ................................. SKIPPED
[INFO] hyracks-client ..................................... SKIPPED
[INFO] hyracks-data ....................................... SKIPPED
[INFO] hyracks-data-std ................................... SKIPPED
[INFO] hyracks-dataflow-common ............................ SKIPPED
[INFO] hyracks-dataflow-std ............................... SKIPPED
[INFO] hyracks-nc-service ................................. SKIPPED
[INFO] hyracks-storage-common ............................. SKIPPED
[INFO] hyracks-storage-am-common .......................... SKIPPED
[INFO] hyracks-storage-am-bloomfilter ..................... SKIPPED
[INFO] hyracks-storage-am-btree ........................... SKIPPED
[INFO] hyracks-storage-am-lsm-common ...................... SKIPPED
[INFO] hyracks-storage-am-lsm-invertedindex ............... SKIPPED
[INFO] hyracks-storage-am-lsm-btree ....................... SKIPPED
[INFO] hyracks-storage-am-rtree ........................... SKIPPED
[INFO] hyracks-storage-am-lsm-rtree ....................... SKIPPED
[INFO] hyracks-test-support ............................... SKIPPED
[INFO] hyracks-tests ...................................... SKIPPED
[INFO] hyracks-storage-common-test ........................ SKIPPED
[INFO] hyracks-storage-am-btree-test ...................... SKIPPED
[INFO] hyracks-storage-am-rtree-test ...................... SKIPPED
[INFO] hyracks-storage-am-lsm-common-test ................. SKIPPED
[INFO] hyracks-storage-am-lsm-btree-test .................. SKIPPED
[INFO] hyracks-storage-am-lsm-rtree-test .................. SKIPPED
[INFO] hyracks-storage-am-lsm-invertedindex-test .......... SKIPPED
[INFO] hyracks-storage-am-bloomfilter-test ................ SKIPPED
[INFO] hyracks-server ..................................... SKIPPED
[INFO] hyracks-examples ................................... SKIPPED
[INFO] tpch-example ....................................... SKIPPED
[INFO] tpchclient ......................................... SKIPPED
[INFO] tpchserver ......................................... SKIPPED
[INFO] text-example ....................................... SKIPPED
[INFO] texthelper ......................................... SKIPPED
[INFO] textclient ......................................... SKIPPED
[INFO] hyracks-maven-plugins .............................. SKIPPED
[INFO] Hyracks VirtualCluster Maven Plugin ................ SKIPPED
[INFO] textserver ......................................... SKIPPED
[INFO] btree-example ...................................... SKIPPED
[INFO] btreehelper ........................................ SKIPPED
[INFO] btreeclient ........................................ SKIPPED
[INFO] btreeserver ........................................ SKIPPED
[INFO] hyracks-integration-tests .......................... SKIPPED
[INFO] hyracks-shutdown-test .............................. SKIPPED
[INFO] hyracks-documentation .............................. SKIPPED
[INFO] license-automation-plugin .......................... SKIPPED
[INFO] hyracks-hdfs ....................................... SKIPPED
[INFO] hyracks-hdfs-1.x ................................... SKIPPED
[INFO] hyracks-hdfs-2.x ................................... SKIPPED
[INFO] hyracks-hdfs-core .................................. SKIPPED
[INFO] hyracks-dist ....................................... SKIPPED
[INFO] algebricks ......................................... SKIPPED
[INFO] algebricks-common .................................. SKIPPED
[INFO] algebricks-data .................................... SKIPPED
[INFO] algebricks-runtime ................................. SKIPPED
[INFO] algebricks-core .................................... SKIPPED
[INFO] algebricks-compiler ................................ SKIPPED
[INFO] algebricks-rewriter ................................ SKIPPED
[INFO] algebricks-tests ................................... SKIPPED
[INFO] algebricks-examples ................................ SKIPPED
[INFO] piglet-example ..................................... SKIPPED
[INFO] hyracks-fullstack-license .......................... SKIPPED
[INFO] apache-asterixdb ................................... SKIPPED
[INFO] asterix-common ..................................... SKIPPED
[INFO] asterix-om ......................................... SKIPPED
[INFO] asterix-fuzzyjoin .................................. SKIPPED
[INFO] asterix-maven-plugins .............................. SKIPPED
[INFO] record-manager-generator-maven-plugin .............. SKIPPED
[INFO] asterix-transactions ............................... SKIPPED
[INFO] asterix-runtime .................................... SKIPPED
[INFO] asterix-events ..................................... SKIPPED
[INFO] asterix-active ..................................... SKIPPED
[INFO] asterix-hivecompat ................................. SKIPPED
[INFO] lexer-generator-maven-plugin ....................... SKIPPED
[INFO] asterix-external-data .............................. SKIPPED
[INFO] asterix-metadata ................................... SKIPPED
[INFO] asterix-lang-common ................................ SKIPPED
[INFO] asterix-lang-aql ................................... SKIPPED
[INFO] asterix-lang-sqlpp ................................. SKIPPED
[INFO] asterix-grammar-extension-maven-plugin ............. SKIPPED
[INFO] asterix-evaluator-generator-maven-plugin ........... SKIPPED
[INFO] asterix-algebra .................................... SKIPPED
[INFO] asterix-test-framework ............................. SKIPPED
[INFO] asterix-replication ................................ SKIPPED
[INFO] asterix-test-datagenerator-maven-plugin ............ SKIPPED
[INFO] asterix-app ........................................ SKIPPED
[INFO] asterix-tools ...................................... SKIPPED
[INFO] asterix-examples ................................... SKIPPED
[INFO] asterix-client-helper .............................. SKIPPED
[INFO] asterix-server ..................................... SKIPPED
[INFO] asterix-doc ........................................ SKIPPED
[INFO] asterix-benchmark .................................. SKIPPED
[INFO] asterix-coverage ................................... SKIPPED
[INFO] asterix-license .................................... SKIPPED
[INFO] asterix-installer .................................. SKIPPED
[INFO] asterix-yarn ....................................... SKIPPED
[INFO] asterix-experiments ................................ SKIPPED
[INFO] hyracks-asterix .................................... FAILURE [  3.396 s]
[INFO] ------------------------------------------------------------------------
[INFO] BUILD FAILURE
[INFO] ------------------------------------------------------------------------
[INFO] Total time: 5.097 s
[INFO] Finished at: 2017-04-28T19:47:20+00:00
[INFO] Final Memory: 62M/434M
[INFO] ------------------------------------------------------------------------
[ERROR] Failed to execute goal org.sonarsource.scanner.maven:sonar-maven-plugin:3.2:sonar
(default-cli) on project apache-asterixdb-fullstack: Unable to execute SonarQube: Fail to
download libraries from server: Status returned by url [https://asterix-sonar.ics.uci.edu/batch_bootstrap/index]
is not valid: [503] -> [Help 1]
[ERROR] 
[ERROR] To see the full stack trace of the errors, re-run Maven with the -e switch.
[ERROR] Re-run Maven using the -X switch to enable full debug logging.
[ERROR] 
[ERROR] For more information about the errors and possible solutions, please read the following
articles:
[ERROR] [Help 1] http://cwiki.apache.org/confluence/display/MAVEN/MojoExecutionException
[ERROR] 
[ERROR] After correcting the problems, you can resume the build with the command
[ERROR]   mvn <goals> -rf :apache-asterixdb-fullstack
Build step 'Invoke top-level Maven targets' marked build as failure
Archiving artifacts
Injecting SonarQube environment variables using the configuration: asterix-sonarqube

Mime
View raw message