asterixdb-dev mailing list archives

Site index · List index
Message view « Date » · « Thread »
Top « Date » · « Thread »
From Asterix build server <jenk...@asterix-jenkins.ics.uci.edu>
Subject Build failed in Jenkins: asterix-integration-tests eb199d3a
Date Thu, 22 Dec 2016 07:34:07 GMT
See <https://asterix-jenkins.ics.uci.edu/job/asterix-integration-tests/430/changes>

Changes:

[Yingyi Bu] ASTERIXDB-1754: fix NPE in CopyLimitDownRule.

------------------------------------------
[...truncated 5708556 lines...]
[INFO] Sensor JavaSquidSensor (done) | time=380ms
[INFO] Sensor Lines Sensor
[INFO] Sensor Lines Sensor (done) | time=0ms
[INFO] Sensor QProfileSensor
[INFO] Sensor QProfileSensor (done) | time=0ms
[INFO] Sensor org.sonar.plugins.findbugs.FindbugsSensor
[INFO] Execute Findbugs 3.0.1...
07:31:24.005 [main] INFO  o.s.p.findbugs.FindbugsExecutor - Findbugs output report: <https://asterix-jenkins.ics.uci.edu/job/asterix-integration-tests/ws/asterixdb/asterix-client-helper/target/sonar/findbugs-result.xml>
[INFO] Execute Findbugs 3.0.1 done: 444 ms
[INFO] Sensor org.sonar.plugins.findbugs.FindbugsSensor (done) | time=446ms
[INFO] Sensor SurefireSensor
[INFO] parsing <https://asterix-jenkins.ics.uci.edu/job/asterix-integration-tests/ws/asterixdb/asterix-client-helper/target/surefire-reports>
[INFO] Sensor SurefireSensor (done) | time=0ms
[INFO] Sensor JaCoCoSensor
[INFO] Analysing <https://asterix-jenkins.ics.uci.edu/job/asterix-integration-tests/ws/target/jacoco-merged.exec>
[INFO] No information about coverage per test.
[INFO] Sensor JaCoCoSensor (done) | time=10ms
[INFO] Sensor JaCoCoOverallSensor
[INFO] Analysing <https://asterix-jenkins.ics.uci.edu/job/asterix-integration-tests/ws/target/jacoco-merged.exec>
[INFO] Analysing <https://asterix-jenkins.ics.uci.edu/job/asterix-integration-tests/ws/asterixdb/asterix-client-helper/target/sonar/jacoco-overall.exec>
[INFO] No information about coverage per test.
[INFO] Sensor JaCoCoOverallSensor (done) | time=24ms
[INFO] Sensor CheckstyleSensor
[INFO] Execute Checkstyle 6.12.1...
[INFO] Checkstyle configuration: <https://asterix-jenkins.ics.uci.edu/job/asterix-integration-tests/ws/asterixdb/asterix-client-helper/target/sonar/checkstyle.xml>
[INFO] Checkstyle charset: UTF-8
[INFO] Execute Checkstyle 6.12.1 done: 53 ms
[INFO] Sensor CheckstyleSensor (done) | time=53ms
[INFO] Sensor SCM Sensor
[INFO] Sensor SCM Sensor (done) | time=0ms
[INFO] Sensor Code Colorizer Sensor
[INFO] Sensor Code Colorizer Sensor (done) | time=1ms
[INFO] Sensor CPD Sensor
[INFO] JavaCpdIndexer is used for java
[INFO] Sensor CPD Sensor (done) | time=4ms
[INFO] -------------  Scan apache-asterixdb
[INFO] Base dir: <https://asterix-jenkins.ics.uci.edu/job/asterix-integration-tests/ws/asterixdb>
[INFO] Working dir: <https://asterix-jenkins.ics.uci.edu/job/asterix-integration-tests/ws/asterixdb/target/sonar>
[INFO] Source encoding: UTF-8, default locale: en_US
[INFO] JaCoCoItSensor: JaCoCo IT report not found: <https://asterix-jenkins.ics.uci.edu/job/asterix-integration-tests/ws/asterixdb/target/jacoco-it.exec>
[INFO] Sensor Lines Sensor
[INFO] Sensor Lines Sensor (done) | time=1ms
[INFO] Sensor SCM Sensor
[INFO] Sensor SCM Sensor (done) | time=0ms
[INFO] Sensor Code Colorizer Sensor
[INFO] Sensor Code Colorizer Sensor (done) | time=0ms
[INFO] Sensor CPD Sensor
[INFO] Sensor CPD Sensor (done) | time=0ms
[INFO] -------------  Scan hyracks-asterix
[INFO] Base dir: <https://asterix-jenkins.ics.uci.edu/job/asterix-integration-tests/ws/>
[INFO] Working dir: <https://asterix-jenkins.ics.uci.edu/job/asterix-integration-tests/ws/target/sonar>
[INFO] Source encoding: UTF-8, default locale: en_US
[INFO] JaCoCoSensor: JaCoCo report not found : <https://asterix-jenkins.ics.uci.edu/job/asterix-integration-tests/ws/target/jacoco.exec>
[INFO] JaCoCoItSensor: JaCoCo IT report not found: <https://asterix-jenkins.ics.uci.edu/job/asterix-integration-tests/ws/target/jacoco-it.exec>
[INFO] Sensor Lines Sensor
[INFO] Sensor Lines Sensor (done) | time=0ms
[INFO] Sensor SCM Sensor
[INFO] Sensor SCM Sensor (done) | time=0ms
[INFO] Sensor Code Colorizer Sensor
[INFO] Sensor Code Colorizer Sensor (done) | time=0ms
[INFO] Sensor CPD Sensor
[INFO] Sensor CPD Sensor (done) | time=0ms
[INFO] Analysis report generated in 4984ms, dir size=48 MB
[INFO] Analysis reports compressed in 10242ms, zip size=20 MB
[INFO] Analysis report uploaded in 65625ms
[INFO] ANALYSIS SUCCESSFUL, you can browse https://asterix-sonar.ics.uci.edu/dashboard/index/org.apache:apache-asterixdb-fullstack
[INFO] Note that you will be able to access the updated dashboard once the server has processed
the submitted analysis report
[INFO] More about the report processing at https://asterix-sonar.ics.uci.edu/api/ce/task?id=AVklcx1CknZ2VWQpBKuX
[INFO] ------------------------------------------------------------------------
[INFO] Reactor Summary:
[INFO] 
[INFO] hyracks-ecosystem-full-stack ....................... SKIPPED
[INFO] hyracks ............................................ SKIPPED
[INFO] hyracks-util ....................................... SKIPPED
[INFO] hyracks-ipc ........................................ SKIPPED
[INFO] hyracks-api ........................................ SKIPPED
[INFO] hyracks-net ........................................ SKIPPED
[INFO] hyracks-comm ....................................... SKIPPED
[INFO] hyracks-control .................................... SKIPPED
[INFO] hyracks-control-common ............................. SKIPPED
[INFO] hyracks-control-cc ................................. SKIPPED
[INFO] hyracks-control-nc ................................. SKIPPED
[INFO] hyracks-client ..................................... SKIPPED
[INFO] hyracks-data ....................................... SKIPPED
[INFO] hyracks-data-std ................................... SKIPPED
[INFO] hyracks-dataflow-common ............................ SKIPPED
[INFO] hyracks-dataflow-std ............................... SKIPPED
[INFO] hyracks-nc-service ................................. SKIPPED
[INFO] hyracks-storage-common ............................. SKIPPED
[INFO] hyracks-storage-am-common .......................... SKIPPED
[INFO] hyracks-storage-am-bloomfilter ..................... SKIPPED
[INFO] hyracks-storage-am-btree ........................... SKIPPED
[INFO] hyracks-storage-am-lsm-common ...................... SKIPPED
[INFO] hyracks-storage-am-lsm-invertedindex ............... SKIPPED
[INFO] hyracks-storage-am-lsm-btree ....................... SKIPPED
[INFO] hyracks-storage-am-rtree ........................... SKIPPED
[INFO] hyracks-storage-am-lsm-rtree ....................... SKIPPED
[INFO] hyracks-test-support ............................... SKIPPED
[INFO] hyracks-tests ...................................... SKIPPED
[INFO] hyracks-storage-common-test ........................ SKIPPED
[INFO] hyracks-storage-am-btree-test ...................... SKIPPED
[INFO] hyracks-storage-am-rtree-test ...................... SKIPPED
[INFO] hyracks-storage-am-lsm-common-test ................. SKIPPED
[INFO] hyracks-storage-am-lsm-btree-test .................. SKIPPED
[INFO] hyracks-storage-am-lsm-rtree-test .................. SKIPPED
[INFO] hyracks-storage-am-lsm-invertedindex-test .......... SKIPPED
[INFO] hyracks-storage-am-bloomfilter-test ................ SKIPPED
[INFO] hyracks-server ..................................... SKIPPED
[INFO] hyracks-examples ................................... SKIPPED
[INFO] tpch-example ....................................... SKIPPED
[INFO] tpchclient ......................................... SKIPPED
[INFO] tpchserver ......................................... SKIPPED
[INFO] text-example ....................................... SKIPPED
[INFO] texthelper ......................................... SKIPPED
[INFO] textclient ......................................... SKIPPED
[INFO] hyracks-maven-plugins .............................. SKIPPED
[INFO] Hyracks VirtualCluster Maven Plugin ................ SKIPPED
[INFO] textserver ......................................... SKIPPED
[INFO] btree-example ...................................... SKIPPED
[INFO] btreehelper ........................................ SKIPPED
[INFO] btreeclient ........................................ SKIPPED
[INFO] btreeserver ........................................ SKIPPED
[INFO] hyracks-integration-tests .......................... SKIPPED
[INFO] hyracks-shutdown-test .............................. SKIPPED
[INFO] hyracks-documentation .............................. SKIPPED
[INFO] hyracks-hdfs ....................................... SKIPPED
[INFO] hyracks-hdfs-1.x ................................... SKIPPED
[INFO] hyracks-hdfs-2.x ................................... SKIPPED
[INFO] hyracks-hdfs-core .................................. SKIPPED
[INFO] hyracks-dist ....................................... SKIPPED
[INFO] algebricks ......................................... SKIPPED
[INFO] algebricks-common .................................. SKIPPED
[INFO] algebricks-data .................................... SKIPPED
[INFO] algebricks-runtime ................................. SKIPPED
[INFO] algebricks-core .................................... SKIPPED
[INFO] algebricks-compiler ................................ SKIPPED
[INFO] algebricks-rewriter ................................ SKIPPED
[INFO] algebricks-tests ................................... SKIPPED
[INFO] algebricks-examples ................................ SKIPPED
[INFO] piglet-example ..................................... SKIPPED
[INFO] apache-asterixdb ................................... SKIPPED
[INFO] asterix-test-framework ............................. SKIPPED
[INFO] asterix-common ..................................... SKIPPED
[INFO] asterix-maven-plugins .............................. SKIPPED
[INFO] record-manager-generator-maven-plugin .............. SKIPPED
[INFO] asterix-transactions ............................... SKIPPED
[INFO] asterix-om ......................................... SKIPPED
[INFO] asterix-fuzzyjoin .................................. SKIPPED
[INFO] asterix-runtime .................................... SKIPPED
[INFO] asterix-events ..................................... SKIPPED
[INFO] asterix-active ..................................... SKIPPED
[INFO] lexer-generator-maven-plugin ....................... SKIPPED
[INFO] asterix-external-data .............................. SKIPPED
[INFO] asterix-metadata ................................... SKIPPED
[INFO] asterix-lang-common ................................ SKIPPED
[INFO] asterix-lang-aql ................................... SKIPPED
[INFO] asterix-lang-sqlpp ................................. SKIPPED
[INFO] asterix-evaluator-generator-maven-plugin ........... SKIPPED
[INFO] asterix-algebra .................................... SKIPPED
[INFO] asterix-replication ................................ SKIPPED
[INFO] asterix-test-datagenerator-maven-plugin ............ SKIPPED
[INFO] asterix-app ........................................ SKIPPED
[INFO] asterix-tools ...................................... SKIPPED
[INFO] asterix-examples ................................... SKIPPED
[INFO] asterix-grammar-extension-maven-plugin ............. SKIPPED
[INFO] asterix-client-helper .............................. SKIPPED
[INFO] asterix-server ..................................... SKIPPED
[INFO] asterix-installer .................................. SKIPPED
[INFO] asterix-doc ........................................ SKIPPED
[INFO] asterix-yarn ....................................... SKIPPED
[INFO] asterix-experiments ................................ SKIPPED
[INFO] asterix-coverage ................................... SKIPPED
[INFO] hyracks-asterix .................................... SUCCESS [09:59 min]
[INFO] ------------------------------------------------------------------------
[INFO] BUILD SUCCESS
[INFO] ------------------------------------------------------------------------
[INFO] Total time: 10:01 min
[INFO] Finished at: 2016-12-22T07:32:50+00:00
[INFO] Final Memory: 104M/1641M
[INFO] ------------------------------------------------------------------------
ERROR: Failed to parse POMs
java.io.IOException: java.io.IOException: Failed to extract <https://asterix-jenkins.ics.uci.edu/job/asterix-integration-tests/ws/asterixdb/asterix-experiments/transfer>
of 3 files
	at hudson.FilePath.readFromTar(FilePath.java:2300)
	at hudson.FilePath.copyRecursiveTo(FilePath.java:2209)
	at jenkins.model.StandardArtifactManager.archive(StandardArtifactManager.java:61)
	at hudson.maven.MavenBuild$ProxyImpl.performArchiving(MavenBuild.java:483)
	at hudson.maven.MavenModuleSetBuild$MavenModuleSetBuildExecution.doRun(MavenModuleSetBuild.java:855)
	at hudson.model.AbstractBuild$AbstractBuildExecution.run(AbstractBuild.java:534)
	at hudson.model.Run.execute(Run.java:1738)
	at hudson.maven.MavenModuleSetBuild.run(MavenModuleSetBuild.java:531)
	at hudson.model.ResourceController.execute(ResourceController.java:98)
	at hudson.model.Executor.run(Executor.java:410)
Caused by: java.io.IOException: java.lang.InterruptedException
	at hudson.remoting.FastPipedInputStream.read(FastPipedInputStream.java:177)
	at hudson.util.HeadBufferingStream.read(HeadBufferingStream.java:61)
	at com.jcraft.jzlib.InflaterInputStream.fill(InflaterInputStream.java:175)
	at com.jcraft.jzlib.InflaterInputStream.read(InflaterInputStream.java:106)
	at org.apache.commons.compress.archivers.tar.TarArchiveInputStream.read(TarArchiveInputStream.java:614)
	at java.io.InputStream.read(InputStream.java:101)
	at org.apache.commons.io.IOUtils.copyLarge(IOUtils.java:1792)
	at org.apache.commons.io.IOUtils.copyLarge(IOUtils.java:1769)
	at org.apache.commons.io.IOUtils.copy(IOUtils.java:1744)
	at hudson.util.IOUtils.copy(IOUtils.java:40)
	at hudson.FilePath.readFromTar(FilePath.java:2290)
	... 9 more
Caused by: java.lang.InterruptedException
	at java.lang.Object.wait(Native Method)
	at hudson.remoting.FastPipedInputStream.read(FastPipedInputStream.java:175)
	... 19 more

	at hudson.FilePath.copyRecursiveTo(FilePath.java:2216)
	at jenkins.model.StandardArtifactManager.archive(StandardArtifactManager.java:61)
	at hudson.maven.MavenBuild$ProxyImpl.performArchiving(MavenBuild.java:483)
	at hudson.maven.MavenModuleSetBuild$MavenModuleSetBuildExecution.doRun(MavenModuleSetBuild.java:855)
	at hudson.model.AbstractBuild$AbstractBuildExecution.run(AbstractBuild.java:534)
	at hudson.model.Run.execute(Run.java:1738)
	at hudson.maven.MavenModuleSetBuild.run(MavenModuleSetBuild.java:531)
	at hudson.model.ResourceController.execute(ResourceController.java:98)
	at hudson.model.Executor.run(Executor.java:410)
Caused by: java.util.concurrent.ExecutionException: java.io.IOException: This archives contains
unclosed entries.
	at hudson.remoting.Channel$2.adapt(Channel.java:813)
	at hudson.remoting.Channel$2.adapt(Channel.java:808)
	at hudson.remoting.FutureAdapter.get(FutureAdapter.java:59)
	at hudson.FilePath.copyRecursiveTo(FilePath.java:2212)
	... 8 more
Caused by: java.io.IOException: This archives contains unclosed entries.
	at org.apache.commons.compress.archivers.tar.TarArchiveOutputStream.finish(TarArchiveOutputStream.java:225)
	at org.apache.commons.compress.archivers.tar.TarArchiveOutputStream.close(TarArchiveOutputStream.java:241)
	at hudson.util.io.TarArchiver.close(TarArchiver.java:111)
	at hudson.FilePath.writeToTar(FilePath.java:2263)
	at hudson.FilePath.access$2100(FilePath.java:190)
	at hudson.FilePath$45.invoke(FilePath.java:2202)
	at hudson.FilePath$45.invoke(FilePath.java:2198)
	at hudson.FilePath$FileCallableWrapper.call(FilePath.java:2719)
	at hudson.remoting.UserRequest.perform(UserRequest.java:120)
	at hudson.remoting.UserRequest.perform(UserRequest.java:48)
	at hudson.remoting.Request$2.run(Request.java:326)
	at hudson.remoting.InterceptingExecutorService$1.call(InterceptingExecutorService.java:68)
	at java.util.concurrent.FutureTask.run(FutureTask.java:266)
	at java.util.concurrent.ThreadPoolExecutor.runWorker(ThreadPoolExecutor.java:1142)
	at java.util.concurrent.ThreadPoolExecutor$Worker.run(ThreadPoolExecutor.java:617)
	at java.lang.Thread.run(Thread.java:745)
	at ......remote call to cb-jenkins-2(Native Method)
	at hudson.remoting.Channel.attachCallSiteStackTrace(Channel.java:1416)
	at hudson.remoting.UserResponse.retrieve(UserRequest.java:220)
	at hudson.remoting.Channel$2.adapt(Channel.java:811)
	... 11 more
Archiving artifacts
Injecting SonarQube environment variables using the configuration: asterix-sonarqube

Mime
View raw message