asterixdb-dev mailing list archives

Site index · List index
Message view « Date » · « Thread »
Top « Date » · « Thread »
From abdullah alamoudi <bamou...@gmail.com>
Subject Re: Error compiling incubator-asterixdb
Date Wed, 06 Jan 2016 03:54:20 GMT
Namrata,
You don't need to add anything. Can you show us your maven version/java
version?

Cheers,
Abdullah.

Amoudi, Abdullah.

On Wed, Jan 6, 2016 at 3:11 AM, Malarout, Namrata (398M-Affiliate) <
Namrata.Malarout@jpl.nasa.gov> wrote:

> Hi,
>
>
> I have already compiled and installed asterixdb-hyracks (from
> https://github.com/apache/incubator-asterixdb-hyracks).
>
> Now, I am trying to install incubator-asterixdb (from
> https://github.com/apache/incubator-asterixdb). But when I do mvn
> compile, I get the following:
>
>
> [INFO] Building asterix-transactions 0.8.8-SNAPSHOT
>
> [INFO]
> ------------------------------------------------------------------------
>
> [INFO]
> ------------------------------------------------------------------------
>
> [INFO] Reactor Summary:
>
> [INFO]
>
> [INFO] asterix ............................................ SUCCESS [
> 7.333 s]
>
> [INFO] asterix-test-framework ............................. SUCCESS [
> 9.059 s]
>
> [INFO] asterix-common ..................................... SUCCESS [
> 7.908 s]
>
> [INFO] asterix-maven-plugins .............................. SUCCESS [
> 0.057 s]
>
> [INFO] record-manager-generator-maven-plugin .............. SUCCESS [
> 2.796 s]
>
> [INFO] asterix-transactions ............................... FAILURE [
> 0.002 s]
>
> [INFO] asterix-om ......................................... SKIPPED
>
> [INFO] asterix-fuzzyjoin .................................. SKIPPED
>
> [INFO] asterix-runtime .................................... SKIPPED
>
> [INFO] asterix-events ..................................... SKIPPED
>
> [INFO] lexer-generator-maven-plugin ....................... SKIPPED
>
> [INFO] asterix-external-data .............................. SKIPPED
>
> [INFO] asterix-metadata ................................... SKIPPED
>
> [INFO] asterix-lang-common ................................ SKIPPED
>
> [INFO] asterix-lang-aql ................................... SKIPPED
>
> [INFO] asterix-lang-sqlpp ................................. SKIPPED
>
> [INFO] asterix-algebra .................................... SKIPPED
>
> [INFO] asterix-tools ...................................... SKIPPED
>
> [INFO] asterix-replication ................................ SKIPPED
>
> [INFO] asterix-app ........................................ SKIPPED
>
> [INFO] asterix-examples ................................... SKIPPED
>
> [INFO] asterix-server ..................................... SKIPPED
>
> [INFO] asterix-installer .................................. SKIPPED
>
> [INFO] asterix-doc ........................................ SKIPPED
>
> [INFO] asterix-yarn ....................................... SKIPPED
>
> [INFO]
> ------------------------------------------------------------------------
>
> [INFO] BUILD FAILURE
>
> [INFO]
> ------------------------------------------------------------------------
>
> [INFO] Total time: 30.534 s
>
> [INFO] Finished at: 2016-01-05T15:07:01-08:00
>
> [INFO] Final Memory: 64M/448M
>
> [INFO]
> ------------------------------------------------------------------------
>
> [ERROR] Failed to parse plugin descriptor for
> org.apache.asterix:record-manager-generator-maven-plugin:0.8.8-SNAPSHOT
> (/Users/malarout/latest
> asterix/incubator-asterixdb/asterix-maven-plugins/record-manager-generator-maven-plugin/target/classes):
> No plugin descriptor found at META-INF/maven/plugin.xml -> [Help 1]
>
> org.apache.maven.plugin.PluginDescriptorParsingException: Failed to parse
> plugin descriptor for
> org.apache.asterix:record-manager-generator-maven-plugin:0.8.8-SNAPSHOT
> (/Users/malarout/latest
> asterix/incubator-asterixdb/asterix-maven-plugins/record-manager-generator-maven-plugin/target/classes):
> No plugin descriptor found at META-INF/maven/plugin.xml
>
> at
> org.apache.maven.plugin.internal.DefaultMavenPluginManager.extractPluginDescriptor(DefaultMavenPluginManager.java:249)
>
> at
> org.apache.maven.plugin.internal.DefaultMavenPluginManager.getPluginDescriptor(DefaultMavenPluginManager.java:184)
>
> at
> org.apache.maven.plugin.internal.DefaultMavenPluginManager.getMojoDescriptor(DefaultMavenPluginManager.java:298)
>
> at
> org.apache.maven.plugin.DefaultBuildPluginManager.getMojoDescriptor(DefaultBuildPluginManager.java:241)
>
> at
> org.apache.maven.lifecycle.internal.DefaultLifecycleExecutionPlanCalculator.setupMojoExecution(DefaultLifecycleExecutionPlanCalculator.java:169)
>
> at
> org.apache.maven.lifecycle.internal.DefaultLifecycleExecutionPlanCalculator.setupMojoExecutions(DefaultLifecycleExecutionPlanCalculator.java:155)
>
> at
> org.apache.maven.lifecycle.internal.DefaultLifecycleExecutionPlanCalculator.calculateExecutionPlan(DefaultLifecycleExecutionPlanCalculator.java:131)
>
> at
> org.apache.maven.lifecycle.internal.DefaultLifecycleExecutionPlanCalculator.calculateExecutionPlan(DefaultLifecycleExecutionPlanCalculator.java:145)
>
> at
> org.apache.maven.lifecycle.internal.builder.BuilderCommon.resolveBuildPlan(BuilderCommon.java:96)
>
> at
> org.apache.maven.lifecycle.internal.LifecycleModuleBuilder.buildProject(LifecycleModuleBuilder.java:109)
>
> at
> org.apache.maven.lifecycle.internal.LifecycleModuleBuilder.buildProject(LifecycleModuleBuilder.java:80)
>
> at
> org.apache.maven.lifecycle.internal.builder.singlethreaded.SingleThreadedBuilder.build(SingleThreadedBuilder.java:51)
>
> at
> org.apache.maven.lifecycle.internal.LifecycleStarter.execute(LifecycleStarter.java:128)
>
> at org.apache.maven.DefaultMaven.doExecute(DefaultMaven.java:307)
>
> at org.apache.maven.DefaultMaven.doExecute(DefaultMaven.java:193)
>
> at org.apache.maven.DefaultMaven.execute(DefaultMaven.java:106)
>
> at org.apache.maven.cli.MavenCli.execute(MavenCli.java:862)
>
> at org.apache.maven.cli.MavenCli.doMain(MavenCli.java:286)
>
> at org.apache.maven.cli.MavenCli.main(MavenCli.java:197)
>
> at sun.reflect.NativeMethodAccessorImpl.invoke0(Native Method)
>
> at
> sun.reflect.NativeMethodAccessorImpl.invoke(NativeMethodAccessorImpl.java:62)
>
> at
> sun.reflect.DelegatingMethodAccessorImpl.invoke(DelegatingMethodAccessorImpl.java:43)
>
> at java.lang.reflect.Method.invoke(Method.java:497)
>
> at
> org.codehaus.plexus.classworlds.launcher.Launcher.launchEnhanced(Launcher.java:289)
>
> at
> org.codehaus.plexus.classworlds.launcher.Launcher.launch(Launcher.java:229)
>
> at
> org.codehaus.plexus.classworlds.launcher.Launcher.mainWithExitCode(Launcher.java:415)
>
> at
> org.codehaus.plexus.classworlds.launcher.Launcher.main(Launcher.java:356)
>
> Caused by: java.io.IOException: No plugin descriptor found at
> META-INF/maven/plugin.xml
>
> at
> org.apache.maven.plugin.internal.DefaultMavenPluginManager.extractPluginDescriptor(DefaultMavenPluginManager.java:244)
>
> ... 26 more
>
>
> Is there something I need to add to plugin.xml? I would appreciate it if
> someone could help me out with this.
>
> Thanks,
>
> Namrata
>

Mime
  • Unnamed multipart/alternative (inline, None, 0 bytes)
View raw message