aries-dev mailing list archives

Site index · List index
Message view « Date » · « Thread »
Top « Date » · « Thread »
From Apache Jenkins Server <jenk...@builds.apache.org>
Subject Build failed in Jenkins: AriesWithSnapshotDependencies #517
Date Mon, 30 Jun 2014 15:40:09 GMT
See <https://builds.apache.org/job/AriesWithSnapshotDependencies/517/changes>

Changes:

[gnodet] [maven-release-plugin] prepare for next development iteration

[gnodet] [maven-release-plugin] prepare release org.apache.aries.blueprint.api-1.0.1

[gnodet] Upgrade to parent 2.0.0

[gnodet] [maven-release-plugin] prepare for next development iteration

[gnodet] [maven-release-plugin] prepare release org.apache.aries.proxy.impl-1.0.3

[gnodet] Update to parent 2.0.0

[gnodet] [maven-release-plugin] prepare for next development iteration

[gnodet] [maven-release-plugin] prepare release org.apache.aries.proxy.api-1.0.1

[gnodet] Upgrade proxy-api to parent 2.0.0

[gnodet] [maven-release-plugin] prepare for next development iteration

[gnodet] [maven-release-plugin] prepare release parent-2.0.0

------------------------------------------
[...truncated 8140 lines...]
	at org.sonatype.aether.impl.internal.DefaultArtifactResolver.resolveArtifacts(DefaultArtifactResolver.java:220)
	at org.sonatype.aether.impl.internal.DefaultArtifactResolver.resolveArtifact(DefaultArtifactResolver.java:197)
	at org.sonatype.aether.impl.internal.DefaultRepositorySystem.resolveArtifact(DefaultRepositorySystem.java:323)
	at org.apache.maven.project.ProjectModelResolver.resolveModel(ProjectModelResolver.java:155)
	... 24 more
Caused by: org.sonatype.aether.transfer.ArtifactNotFoundException: Could not find artifact
org.apache.aries:parent:pom:2.0.0-SNAPSHOT
	at org.sonatype.aether.impl.internal.DefaultArtifactResolver.resolve(DefaultArtifactResolver.java:531)
	... 28 more
[ERROR]   
[ERROR]   The project org.apache.aries.subsystem:subsystem:1.0.0-SNAPSHOT (/x1/jenkins/jenkins-slave/workspace/AriesWithSnapshotDependencies/aries-current-snapshots/subsystem/pom.xml)
has 1 error
[ERROR]     Non-resolvable parent POM: Could not find artifact org.apache.aries:parent:pom:2.0.0-SNAPSHOT
and 'parent.relativePath' points at wrong local POM @ line 24, column 13 -> [Help 2]
org.apache.maven.model.resolution.UnresolvableModelException: Could not find artifact org.apache.aries:parent:pom:2.0.0-SNAPSHOT
	at org.apache.maven.project.ProjectModelResolver.resolveModel(ProjectModelResolver.java:159)
	at org.apache.maven.model.building.DefaultModelBuilder.readParentExternally(DefaultModelBuilder.java:819)
	at org.apache.maven.model.building.DefaultModelBuilder.readParent(DefaultModelBuilder.java:670)
	at org.apache.maven.model.building.DefaultModelBuilder.build(DefaultModelBuilder.java:308)
	at org.apache.maven.model.building.DefaultModelBuilder.build(DefaultModelBuilder.java:232)
	at org.apache.maven.project.DefaultProjectBuilder.build(DefaultProjectBuilder.java:386)
	at org.apache.maven.project.DefaultProjectBuilder.build(DefaultProjectBuilder.java:355)
	at org.apache.maven.project.DefaultProjectBuilder.build(DefaultProjectBuilder.java:471)
	at org.apache.maven.project.DefaultProjectBuilder.build(DefaultProjectBuilder.java:355)
	at org.apache.maven.project.DefaultProjectBuilder.build(DefaultProjectBuilder.java:319)
	at org.apache.maven.DefaultMaven.collectProjects(DefaultMaven.java:632)
	at org.apache.maven.DefaultMaven.getProjectsForMavenReactor(DefaultMaven.java:581)
	at org.apache.maven.DefaultMaven.doExecute(DefaultMaven.java:233)
	at org.apache.maven.DefaultMaven.execute(DefaultMaven.java:156)
	at org.apache.maven.cli.MavenCli.execute(MavenCli.java:537)
	at org.apache.maven.cli.MavenCli.doMain(MavenCli.java:196)
	at org.apache.maven.cli.MavenCli.main(MavenCli.java:141)
	at sun.reflect.NativeMethodAccessorImpl.invoke0(Native Method)
	at sun.reflect.NativeMethodAccessorImpl.invoke(NativeMethodAccessorImpl.java:57)
	at sun.reflect.DelegatingMethodAccessorImpl.invoke(DelegatingMethodAccessorImpl.java:43)
	at java.lang.reflect.Method.invoke(Method.java:606)
	at org.codehaus.plexus.classworlds.launcher.Launcher.launchEnhanced(Launcher.java:290)
	at org.codehaus.plexus.classworlds.launcher.Launcher.launch(Launcher.java:230)
	at org.codehaus.plexus.classworlds.launcher.Launcher.mainWithExitCode(Launcher.java:409)
	at org.codehaus.plexus.classworlds.launcher.Launcher.main(Launcher.java:352)
Caused by: org.sonatype.aether.resolution.ArtifactResolutionException: Could not find artifact
org.apache.aries:parent:pom:2.0.0-SNAPSHOT
	at org.sonatype.aether.impl.internal.DefaultArtifactResolver.resolve(DefaultArtifactResolver.java:541)
	at org.sonatype.aether.impl.internal.DefaultArtifactResolver.resolveArtifacts(DefaultArtifactResolver.java:220)
	at org.sonatype.aether.impl.internal.DefaultArtifactResolver.resolveArtifact(DefaultArtifactResolver.java:197)
	at org.sonatype.aether.impl.internal.DefaultRepositorySystem.resolveArtifact(DefaultRepositorySystem.java:323)
	at org.apache.maven.project.ProjectModelResolver.resolveModel(ProjectModelResolver.java:155)
	... 24 more
Caused by: org.sonatype.aether.transfer.ArtifactNotFoundException: Could not find artifact
org.apache.aries:parent:pom:2.0.0-SNAPSHOT
	at org.sonatype.aether.impl.internal.DefaultArtifactResolver.resolve(DefaultArtifactResolver.java:531)
	... 28 more
[ERROR]   
[ERROR]   The project org.apache.aries.ejb:ejb:1.0.0-SNAPSHOT (/x1/jenkins/jenkins-slave/workspace/AriesWithSnapshotDependencies/aries-current-snapshots/ejb/pom.xml)
has 1 error
[ERROR]     Non-resolvable parent POM: Could not find artifact org.apache.aries:parent:pom:2.0.0-SNAPSHOT
and 'parent.relativePath' points at wrong local POM @ line 24, column 13 -> [Help 2]
org.apache.maven.model.resolution.UnresolvableModelException: Could not find artifact org.apache.aries:parent:pom:2.0.0-SNAPSHOT
	at org.apache.maven.project.ProjectModelResolver.resolveModel(ProjectModelResolver.java:159)
	at org.apache.maven.model.building.DefaultModelBuilder.readParentExternally(DefaultModelBuilder.java:819)
	at org.apache.maven.model.building.DefaultModelBuilder.readParent(DefaultModelBuilder.java:670)
	at org.apache.maven.model.building.DefaultModelBuilder.build(DefaultModelBuilder.java:308)
	at org.apache.maven.model.building.DefaultModelBuilder.build(DefaultModelBuilder.java:232)
	at org.apache.maven.project.DefaultProjectBuilder.build(DefaultProjectBuilder.java:386)
	at org.apache.maven.project.DefaultProjectBuilder.build(DefaultProjectBuilder.java:355)
	at org.apache.maven.project.DefaultProjectBuilder.build(DefaultProjectBuilder.java:471)
	at org.apache.maven.project.DefaultProjectBuilder.build(DefaultProjectBuilder.java:355)
	at org.apache.maven.project.DefaultProjectBuilder.build(DefaultProjectBuilder.java:319)
	at org.apache.maven.DefaultMaven.collectProjects(DefaultMaven.java:632)
	at org.apache.maven.DefaultMaven.getProjectsForMavenReactor(DefaultMaven.java:581)
	at org.apache.maven.DefaultMaven.doExecute(DefaultMaven.java:233)
	at org.apache.maven.DefaultMaven.execute(DefaultMaven.java:156)
	at org.apache.maven.cli.MavenCli.execute(MavenCli.java:537)
	at org.apache.maven.cli.MavenCli.doMain(MavenCli.java:196)
	at org.apache.maven.cli.MavenCli.main(MavenCli.java:141)
	at sun.reflect.NativeMethodAccessorImpl.invoke0(Native Method)
	at sun.reflect.NativeMethodAccessorImpl.invoke(NativeMethodAccessorImpl.java:57)
	at sun.reflect.DelegatingMethodAccessorImpl.invoke(DelegatingMethodAccessorImpl.java:43)
	at java.lang.reflect.Method.invoke(Method.java:606)
	at org.codehaus.plexus.classworlds.launcher.Launcher.launchEnhanced(Launcher.java:290)
	at org.codehaus.plexus.classworlds.launcher.Launcher.launch(Launcher.java:230)
	at org.codehaus.plexus.classworlds.launcher.Launcher.mainWithExitCode(Launcher.java:409)
	at org.codehaus.plexus.classworlds.launcher.Launcher.main(Launcher.java:352)
Caused by: org.sonatype.aether.resolution.ArtifactResolutionException: Could not find artifact
org.apache.aries:parent:pom:2.0.0-SNAPSHOT
	at org.sonatype.aether.impl.internal.DefaultArtifactResolver.resolve(DefaultArtifactResolver.java:541)
	at org.sonatype.aether.impl.internal.DefaultArtifactResolver.resolveArtifacts(DefaultArtifactResolver.java:220)
	at org.sonatype.aether.impl.internal.DefaultArtifactResolver.resolveArtifact(DefaultArtifactResolver.java:197)
	at org.sonatype.aether.impl.internal.DefaultRepositorySystem.resolveArtifact(DefaultRepositorySystem.java:323)
	at org.apache.maven.project.ProjectModelResolver.resolveModel(ProjectModelResolver.java:155)
	... 24 more
Caused by: org.sonatype.aether.transfer.ArtifactNotFoundException: Could not find artifact
org.apache.aries:parent:pom:2.0.0-SNAPSHOT
	at org.sonatype.aether.impl.internal.DefaultArtifactResolver.resolve(DefaultArtifactResolver.java:531)
	... 28 more
[ERROR]   
[ERROR]   The project org.apache.aries.jmx:jmx:1.1.0-SNAPSHOT (/x1/jenkins/jenkins-slave/workspace/AriesWithSnapshotDependencies/aries-current-snapshots/jmx/pom.xml)
has 1 error
[ERROR]     Non-resolvable parent POM: Could not find artifact org.apache.aries:parent:pom:2.0.0-SNAPSHOT
and 'parent.relativePath' points at wrong local POM @ line 24, column 13 -> [Help 2]
org.apache.maven.model.resolution.UnresolvableModelException: Could not find artifact org.apache.aries:parent:pom:2.0.0-SNAPSHOT
	at org.apache.maven.project.ProjectModelResolver.resolveModel(ProjectModelResolver.java:159)
	at org.apache.maven.model.building.DefaultModelBuilder.readParentExternally(DefaultModelBuilder.java:819)
	at org.apache.maven.model.building.DefaultModelBuilder.readParent(DefaultModelBuilder.java:670)
	at org.apache.maven.model.building.DefaultModelBuilder.build(DefaultModelBuilder.java:308)
	at org.apache.maven.model.building.DefaultModelBuilder.build(DefaultModelBuilder.java:232)
	at org.apache.maven.project.DefaultProjectBuilder.build(DefaultProjectBuilder.java:386)
	at org.apache.maven.project.DefaultProjectBuilder.build(DefaultProjectBuilder.java:355)
	at org.apache.maven.project.DefaultProjectBuilder.build(DefaultProjectBuilder.java:471)
	at org.apache.maven.project.DefaultProjectBuilder.build(DefaultProjectBuilder.java:355)
	at org.apache.maven.project.DefaultProjectBuilder.build(DefaultProjectBuilder.java:319)
	at org.apache.maven.DefaultMaven.collectProjects(DefaultMaven.java:632)
	at org.apache.maven.DefaultMaven.getProjectsForMavenReactor(DefaultMaven.java:581)
	at org.apache.maven.DefaultMaven.doExecute(DefaultMaven.java:233)
	at org.apache.maven.DefaultMaven.execute(DefaultMaven.java:156)
	at org.apache.maven.cli.MavenCli.execute(MavenCli.java:537)
	at org.apache.maven.cli.MavenCli.doMain(MavenCli.java:196)
	at org.apache.maven.cli.MavenCli.main(MavenCli.java:141)
	at sun.reflect.NativeMethodAccessorImpl.invoke0(Native Method)
	at sun.reflect.NativeMethodAccessorImpl.invoke(NativeMethodAccessorImpl.java:57)
	at sun.reflect.DelegatingMethodAccessorImpl.invoke(DelegatingMethodAccessorImpl.java:43)
	at java.lang.reflect.Method.invoke(Method.java:606)
	at org.codehaus.plexus.classworlds.launcher.Launcher.launchEnhanced(Launcher.java:290)
	at org.codehaus.plexus.classworlds.launcher.Launcher.launch(Launcher.java:230)
	at org.codehaus.plexus.classworlds.launcher.Launcher.mainWithExitCode(Launcher.java:409)
	at org.codehaus.plexus.classworlds.launcher.Launcher.main(Launcher.java:352)
Caused by: org.sonatype.aether.resolution.ArtifactResolutionException: Could not find artifact
org.apache.aries:parent:pom:2.0.0-SNAPSHOT
	at org.sonatype.aether.impl.internal.DefaultArtifactResolver.resolve(DefaultArtifactResolver.java:541)
	at org.sonatype.aether.impl.internal.DefaultArtifactResolver.resolveArtifacts(DefaultArtifactResolver.java:220)
	at org.sonatype.aether.impl.internal.DefaultArtifactResolver.resolveArtifact(DefaultArtifactResolver.java:197)
	at org.sonatype.aether.impl.internal.DefaultRepositorySystem.resolveArtifact(DefaultRepositorySystem.java:323)
	at org.apache.maven.project.ProjectModelResolver.resolveModel(ProjectModelResolver.java:155)
	... 24 more
Caused by: org.sonatype.aether.transfer.ArtifactNotFoundException: Could not find artifact
org.apache.aries:parent:pom:2.0.0-SNAPSHOT
	at org.sonatype.aether.impl.internal.DefaultArtifactResolver.resolve(DefaultArtifactResolver.java:531)
	... 28 more
[ERROR]   
[ERROR]   The project org.apache.aries.jpa:jpa:1.0.0-SNAPSHOT (/x1/jenkins/jenkins-slave/workspace/AriesWithSnapshotDependencies/aries-current-snapshots/jpa/pom.xml)
has 1 error
[ERROR]     Non-resolvable parent POM: Could not find artifact org.apache.aries:parent:pom:2.0.0-SNAPSHOT
and 'parent.relativePath' points at wrong local POM @ line 24, column 13 -> [Help 2]
org.apache.maven.model.resolution.UnresolvableModelException: Could not find artifact org.apache.aries:parent:pom:2.0.0-SNAPSHOT
	at org.apache.maven.project.ProjectModelResolver.resolveModel(ProjectModelResolver.java:159)
	at org.apache.maven.model.building.DefaultModelBuilder.readParentExternally(DefaultModelBuilder.java:819)
	at org.apache.maven.model.building.DefaultModelBuilder.readParent(DefaultModelBuilder.java:670)
	at org.apache.maven.model.building.DefaultModelBuilder.build(DefaultModelBuilder.java:308)
	at org.apache.maven.model.building.DefaultModelBuilder.build(DefaultModelBuilder.java:232)
	at org.apache.maven.project.DefaultProjectBuilder.build(DefaultProjectBuilder.java:386)
	at org.apache.maven.project.DefaultProjectBuilder.build(DefaultProjectBuilder.java:355)
	at org.apache.maven.project.DefaultProjectBuilder.build(DefaultProjectBuilder.java:471)
	at org.apache.maven.project.DefaultProjectBuilder.build(DefaultProjectBuilder.java:355)
	at org.apache.maven.project.DefaultProjectBuilder.build(DefaultProjectBuilder.java:319)
	at org.apache.maven.DefaultMaven.collectProjects(DefaultMaven.java:632)
	at org.apache.maven.DefaultMaven.getProjectsForMavenReactor(DefaultMaven.java:581)
	at org.apache.maven.DefaultMaven.doExecute(DefaultMaven.java:233)
	at org.apache.maven.DefaultMaven.execute(DefaultMaven.java:156)
	at org.apache.maven.cli.MavenCli.execute(MavenCli.java:537)
	at org.apache.maven.cli.MavenCli.doMain(MavenCli.java:196)
	at org.apache.maven.cli.MavenCli.main(MavenCli.java:141)
	at sun.reflect.NativeMethodAccessorImpl.invoke0(Native Method)
	at sun.reflect.NativeMethodAccessorImpl.invoke(NativeMethodAccessorImpl.java:57)
	at sun.reflect.DelegatingMethodAccessorImpl.invoke(DelegatingMethodAccessorImpl.java:43)
	at java.lang.reflect.Method.invoke(Method.java:606)
	at org.codehaus.plexus.classworlds.launcher.Launcher.launchEnhanced(Launcher.java:290)
	at org.codehaus.plexus.classworlds.launcher.Launcher.launch(Launcher.java:230)
	at org.codehaus.plexus.classworlds.launcher.Launcher.mainWithExitCode(Launcher.java:409)
	at org.codehaus.plexus.classworlds.launcher.Launcher.main(Launcher.java:352)
Caused by: org.sonatype.aether.resolution.ArtifactResolutionException: Could not find artifact
org.apache.aries:parent:pom:2.0.0-SNAPSHOT
	at org.sonatype.aether.impl.internal.DefaultArtifactResolver.resolve(DefaultArtifactResolver.java:541)
	at org.sonatype.aether.impl.internal.DefaultArtifactResolver.resolveArtifacts(DefaultArtifactResolver.java:220)
	at org.sonatype.aether.impl.internal.DefaultArtifactResolver.resolveArtifact(DefaultArtifactResolver.java:197)
	at org.sonatype.aether.impl.internal.DefaultRepositorySystem.resolveArtifact(DefaultRepositorySystem.java:323)
	at org.apache.maven.project.ProjectModelResolver.resolveModel(ProjectModelResolver.java:155)
	... 24 more
Caused by: org.sonatype.aether.transfer.ArtifactNotFoundException: Could not find artifact
org.apache.aries:parent:pom:2.0.0-SNAPSHOT
	at org.sonatype.aether.impl.internal.DefaultArtifactResolver.resolve(DefaultArtifactResolver.java:531)
	... 28 more
[ERROR]   
[ERROR]   The project org.apache.aries.spifly:spifly:1.0.0-SNAPSHOT (/x1/jenkins/jenkins-slave/workspace/AriesWithSnapshotDependencies/aries-current-snapshots/spi-fly/pom.xml)
has 1 error
[ERROR]     Non-resolvable parent POM: Could not find artifact org.apache.aries:parent:pom:2.0.0-SNAPSHOT
and 'parent.relativePath' points at wrong local POM @ line 24, column 13 -> [Help 2]
org.apache.maven.model.resolution.UnresolvableModelException: Could not find artifact org.apache.aries:parent:pom:2.0.0-SNAPSHOT
	at org.apache.maven.project.ProjectModelResolver.resolveModel(ProjectModelResolver.java:159)
	at org.apache.maven.model.building.DefaultModelBuilder.readParentExternally(DefaultModelBuilder.java:819)
	at org.apache.maven.model.building.DefaultModelBuilder.readParent(DefaultModelBuilder.java:670)
	at org.apache.maven.model.building.DefaultModelBuilder.build(DefaultModelBuilder.java:308)
	at org.apache.maven.model.building.DefaultModelBuilder.build(DefaultModelBuilder.java:232)
	at org.apache.maven.project.DefaultProjectBuilder.build(DefaultProjectBuilder.java:386)
	at org.apache.maven.project.DefaultProjectBuilder.build(DefaultProjectBuilder.java:355)
	at org.apache.maven.project.DefaultProjectBuilder.build(DefaultProjectBuilder.java:471)
	at org.apache.maven.project.DefaultProjectBuilder.build(DefaultProjectBuilder.java:355)
	at org.apache.maven.project.DefaultProjectBuilder.build(DefaultProjectBuilder.java:319)
	at org.apache.maven.DefaultMaven.collectProjects(DefaultMaven.java:632)
	at org.apache.maven.DefaultMaven.getProjectsForMavenReactor(DefaultMaven.java:581)
	at org.apache.maven.DefaultMaven.doExecute(DefaultMaven.java:233)
	at org.apache.maven.DefaultMaven.execute(DefaultMaven.java:156)
	at org.apache.maven.cli.MavenCli.execute(MavenCli.java:537)
	at org.apache.maven.cli.MavenCli.doMain(MavenCli.java:196)
	at org.apache.maven.cli.MavenCli.main(MavenCli.java:141)
	at sun.reflect.NativeMethodAccessorImpl.invoke0(Native Method)
	at sun.reflect.NativeMethodAccessorImpl.invoke(NativeMethodAccessorImpl.java:57)
	at sun.reflect.DelegatingMethodAccessorImpl.invoke(DelegatingMethodAccessorImpl.java:43)
	at java.lang.reflect.Method.invoke(Method.java:606)
	at org.codehaus.plexus.classworlds.launcher.Launcher.launchEnhanced(Launcher.java:290)
	at org.codehaus.plexus.classworlds.launcher.Launcher.launch(Launcher.java:230)
	at org.codehaus.plexus.classworlds.launcher.Launcher.mainWithExitCode(Launcher.java:409)
	at org.codehaus.plexus.classworlds.launcher.Launcher.main(Launcher.java:352)
Caused by: org.sonatype.aether.resolution.ArtifactResolutionException: Could not find artifact
org.apache.aries:parent:pom:2.0.0-SNAPSHOT
	at org.sonatype.aether.impl.internal.DefaultArtifactResolver.resolve(DefaultArtifactResolver.java:541)
	at org.sonatype.aether.impl.internal.DefaultArtifactResolver.resolveArtifacts(DefaultArtifactResolver.java:220)
	at org.sonatype.aether.impl.internal.DefaultArtifactResolver.resolveArtifact(DefaultArtifactResolver.java:197)
	at org.sonatype.aether.impl.internal.DefaultRepositorySystem.resolveArtifact(DefaultRepositorySystem.java:323)
	at org.apache.maven.project.ProjectModelResolver.resolveModel(ProjectModelResolver.java:155)
	... 24 more
Caused by: org.sonatype.aether.transfer.ArtifactNotFoundException: Could not find artifact
org.apache.aries:parent:pom:2.0.0-SNAPSHOT
	at org.sonatype.aether.impl.internal.DefaultArtifactResolver.resolve(DefaultArtifactResolver.java:531)
	... 28 more
[ERROR]   
[ERROR]   The project org.apache.aries.samples:samples:1.0.1-SNAPSHOT (/x1/jenkins/jenkins-slave/workspace/AriesWithSnapshotDependencies/aries-current-snapshots/samples/pom.xml)
has 1 error
[ERROR]     Non-resolvable parent POM: Could not find artifact org.apache.aries:parent:pom:2.0.0-SNAPSHOT
and 'parent.relativePath' points at wrong local POM @ line 24, column 13 -> [Help 2]
org.apache.maven.model.resolution.UnresolvableModelException: Could not find artifact org.apache.aries:parent:pom:2.0.0-SNAPSHOT
	at org.apache.maven.project.ProjectModelResolver.resolveModel(ProjectModelResolver.java:159)
	at org.apache.maven.model.building.DefaultModelBuilder.readParentExternally(DefaultModelBuilder.java:819)
	at org.apache.maven.model.building.DefaultModelBuilder.readParent(DefaultModelBuilder.java:670)
	at org.apache.maven.model.building.DefaultModelBuilder.build(DefaultModelBuilder.java:308)
	at org.apache.maven.model.building.DefaultModelBuilder.build(DefaultModelBuilder.java:232)
	at org.apache.maven.project.DefaultProjectBuilder.build(DefaultProjectBuilder.java:386)
	at org.apache.maven.project.DefaultProjectBuilder.build(DefaultProjectBuilder.java:355)
	at org.apache.maven.project.DefaultProjectBuilder.build(DefaultProjectBuilder.java:471)
	at org.apache.maven.project.DefaultProjectBuilder.build(DefaultProjectBuilder.java:355)
	at org.apache.maven.project.DefaultProjectBuilder.build(DefaultProjectBuilder.java:319)
	at org.apache.maven.DefaultMaven.collectProjects(DefaultMaven.java:632)
	at org.apache.maven.DefaultMaven.getProjectsForMavenReactor(DefaultMaven.java:581)
	at org.apache.maven.DefaultMaven.doExecute(DefaultMaven.java:233)
	at org.apache.maven.DefaultMaven.execute(DefaultMaven.java:156)
	at org.apache.maven.cli.MavenCli.execute(MavenCli.java:537)
	at org.apache.maven.cli.MavenCli.doMain(MavenCli.java:196)
	at org.apache.maven.cli.MavenCli.main(MavenCli.java:141)
	at sun.reflect.NativeMethodAccessorImpl.invoke0(Native Method)
	at sun.reflect.NativeMethodAccessorImpl.invoke(NativeMethodAccessorImpl.java:57)
	at sun.reflect.DelegatingMethodAccessorImpl.invoke(DelegatingMethodAccessorImpl.java:43)
	at java.lang.reflect.Method.invoke(Method.java:606)
	at org.codehaus.plexus.classworlds.launcher.Launcher.launchEnhanced(Launcher.java:290)
	at org.codehaus.plexus.classworlds.launcher.Launcher.launch(Launcher.java:230)
	at org.codehaus.plexus.classworlds.launcher.Launcher.mainWithExitCode(Launcher.java:409)
	at org.codehaus.plexus.classworlds.launcher.Launcher.main(Launcher.java:352)
Caused by: org.sonatype.aether.resolution.ArtifactResolutionException: Could not find artifact
org.apache.aries:parent:pom:2.0.0-SNAPSHOT
	at org.sonatype.aether.impl.internal.DefaultArtifactResolver.resolve(DefaultArtifactResolver.java:541)
	at org.sonatype.aether.impl.internal.DefaultArtifactResolver.resolveArtifacts(DefaultArtifactResolver.java:220)
	at org.sonatype.aether.impl.internal.DefaultArtifactResolver.resolveArtifact(DefaultArtifactResolver.java:197)
	at org.sonatype.aether.impl.internal.DefaultRepositorySystem.resolveArtifact(DefaultRepositorySystem.java:323)
	at org.apache.maven.project.ProjectModelResolver.resolveModel(ProjectModelResolver.java:155)
	... 24 more
Caused by: org.sonatype.aether.transfer.ArtifactNotFoundException: Could not find artifact
org.apache.aries:parent:pom:2.0.0-SNAPSHOT
	at org.sonatype.aether.impl.internal.DefaultArtifactResolver.resolve(DefaultArtifactResolver.java:531)
	... 28 more
[ERROR] 
[ERROR] Re-run Maven using the -X switch to enable full debug logging.
[ERROR] 
[ERROR] For more information about the errors and possible solutions, please read the following
articles:
[ERROR] [Help 1] http://cwiki.apache.org/confluence/display/MAVEN/ProjectBuildingException
[ERROR] [Help 2] http://cwiki.apache.org/confluence/display/MAVEN/UnresolvableModelException
Build step 'Invoke top-level Maven targets' marked build as failure

Mime
View raw message