aries-commits mailing list archives

Site index · List index
Message view « Date » · « Thread »
Top « Date » · « Thread »
From cummi...@apache.org
Subject svn commit: r1352320 [2/7] - in /aries/site/trunk/content: development/ downloads/ct/1.0.0/
Date Wed, 20 Jun 2012 21:07:13 GMT
Added: aries/site/trunk/content/downloads/ct/1.0.0/org.osgi.test.cases.blueprint.html
URL: http://svn.apache.org/viewvc/aries/site/trunk/content/downloads/ct/1.0.0/org.osgi.test.cases.blueprint.html?rev=1352320&view=auto
==============================================================================
--- aries/site/trunk/content/downloads/ct/1.0.0/org.osgi.test.cases.blueprint.html (added)
+++ aries/site/trunk/content/downloads/ct/1.0.0/org.osgi.test.cases.blueprint.html Wed Jun 20 21:07:12 2012
@@ -0,0 +1,3294 @@
+<html>
+<head>
+<META http-equiv="Content-Type" content="text/html; charset=UTF-8">
+<title>Test</title>
+<link rel="stylesheet" href="http://www.osgi.org/www/osgi.css" type="text/css">
+<style type="text/css">
+					.code { font-family: Courier,
+					sans-serif; }
+					.error,.ok, .info,
+					.warning {
+					background-position: 4 4;
+					background-repeat:no-repeat;
+					width:10px; }
+					.ok {
+					background-image:url("http://www.osgi.org/www/greenball.png"); }
+					.warning {
+					background-image:url("http://www.osgi.org/www/orangeball.png"); }
+					.error {
+					background-image:url("http://www.osgi.org/www/redball.png"); }
+					.info {
+					background-image:url("http://www.osgi.org/www/info.png"); }
+					.class { padding-top:20px; padding-bottom: 10px; font-size:12;
+					font-weight:bold; }
+
+					h2 { margin-top : 20px; margin-bottom:10px; }
+					table, th, td { border: 1px solid black; padding:5px; }
+					table {
+					border-collapse:collapse; width:100%; margin-top:20px;}
+					th { height:20px; }
+					} 
+				</style>
+<script language="javascript">
+					function toggle(name) {
+					var el =
+					document.getElementById(name);
+					if ( el.style.display != 'none' ) {
+					el.style.display = 'none';
+					}
+					else {
+					el.style.display = '';
+					}
+					}				
+				</script>
+</head>
+<body style="width:800px">
+<h2>Summary</h2>
+<p>The following table provides a sumary of the test information.</p>
+<table>
+<tr>
+<th>Property Key</th><th>Property Value</th>
+</tr>
+<tr>
+<td width="50%">Target</td><td>/Users/holly/Documents/aries/ct/jar/org.osgi.test.cases.blueprint-4.2.0.jar</td>
+</tr>
+<tr>
+<td width="50%">Framework</td><td>org.eclipse.osgi.launch.Equinox@20968fda</td>
+</tr>
+<tr>
+<td width="50%">Testrun</td><td>Tue Jun 19 22:41:02 BST 2012</td>
+</tr>
+<tr>
+<th colspan="2">Bundles</th>
+</tr>
+<tr>
+<td>org.eclipse.osgi</td><td>3.5.0.v20090520</td>
+</tr>
+<tr>
+<td>osgi.cmpn</td><td>4.2.0.200908310645</td>
+</tr>
+<tr>
+<td>org.eclipse.equinox.cm</td><td>3.2.0.v20070116</td>
+</tr>
+<tr>
+<td>org.eclipse.equinox.event</td><td>1.1.100.v20090513</td>
+</tr>
+<tr>
+<td>org.ops4j.pax.logging.pax-logging-api</td><td>1.5.0</td>
+</tr>
+<tr>
+<td>org.apache.aries.util</td><td>1.0.0.SNAPSHOT</td>
+</tr>
+<tr>
+<td>org.apache.aries.proxy</td><td>1.0.0.SNAPSHOT</td>
+</tr>
+<tr>
+<td>org.apache.aries.blueprint</td><td>1.0.0.SNAPSHOT</td>
+</tr>
+<tr>
+<td>org.osgi.test.cases.blueprint</td><td>4.2.0.201004301237</td>
+</tr>
+</table>
+<h2>Testcases</h2>
+<p>The following table shows the results of each test. A red icon indicates that the 
+					test failed or had an error. A green icon
+					indicates success. Any errors or failure messages 
+					will be displayed as a list beneath the test name. To see the 
+					exception, click on the info icon on the right.</p>
+<table width="100%">
+<tr>
+<th width="15px"><img src="http://www.osgi.org/www/colorball.png" title="Status. red=bad, orange=almost good, green is perfect"></th><th>Test</th><th>Failures</th><th>Error</th><th>Info</th>
+</tr>
+<tr>
+<td width="15px" class="
+                                        ok
+                                    "></td><td class="code">testSignature</td><td>0</td><td>0</td><td></td>
+</tr>
+<tr>
+<td width="15px" class="
+                                        ok
+                                    "></td><td class="code">testConstructorInjection</td><td>0</td><td>0</td><td></td>
+</tr>
+<tr>
+<td width="15px" class="
+                                        ok
+                                    "></td><td class="code">testInstanceFactoryConstructorInjection</td><td>0</td><td>0</td><td></td>
+</tr>
+<tr>
+<td width="15px" class="
+                                        ok
+                                    "></td><td class="code">testStaticFactoryConstructorInjection</td><td>0</td><td>0</td><td></td>
+</tr>
+<tr>
+<td width="15px" class="
+                                        ok
+                                    "></td><td class="code">testPropertyInjection</td><td>0</td><td>0</td><td></td>
+</tr>
+<tr>
+<td width="15px" class="
+                                        ok
+                                    "></td><td class="code">testInstanceFactoryPropertyInjection</td><td>0</td><td>0</td><td></td>
+</tr>
+<tr>
+<td width="15px" class="
+                                        ok
+                                    "></td><td class="code">testStaticFactoryPropertyInjection</td><td>0</td><td>0</td><td></td>
+</tr>
+<tr>
+<td width="15px" class="
+                                        ok
+                                    "></td><td class="code">testCompoundProperty</td><td>0</td><td>0</td><td></td>
+</tr>
+<tr>
+<td width="15px" class="
+                                        ok
+                                    "></td><td class="code">testCompoundPropertyMissingName</td><td>0</td><td>0</td><td></td>
+</tr>
+<tr>
+<td width="15px" class="
+                                        ok
+                                    "></td><td class="code">testCompoundPropertyMissingValue</td><td>0</td><td>0</td><td></td>
+</tr>
+<tr>
+<td width="15px" class="
+                                        ok
+                                    "></td><td class="code">testServicePropertiesReevaluation</td><td>0</td><td>0</td><td></td>
+</tr>
+<tr>
+<td width="15px" class="
+                                        ok
+                                    "></td><td class="code">testComponentDirectDependency</td><td>0</td><td>0</td><td></td>
+</tr>
+<tr>
+<td width="15px" class="
+                                        ok
+                                    "></td><td class="code">testComponentDependsOnDependency</td><td>0</td><td>0</td><td></td>
+</tr>
+<tr>
+<td width="15px" class="
+                                        ok
+                                    "></td><td class="code">testServiceDependsOnDependency</td><td>0</td><td>0</td><td></td>
+</tr>
+<tr>
+<td width="15px" class="
+                                        ok
+                                    "></td><td class="code">testComponentWaitingDependency</td><td>0</td><td>0</td><td></td>
+</tr>
+<tr>
+<td width="15px" class="
+                                        ok
+                                    "></td><td class="code">testMultipleGracePeriod</td><td>0</td><td>0</td><td></td>
+</tr>
+<tr>
+<td width="15px" class="
+                                        ok
+                                    "></td><td class="code">testComponentNowaitDependency</td><td>0</td><td>0</td><td></td>
+</tr>
+<tr>
+<td width="15px" class="
+                                        ok
+                                    "></td><td class="code">testComponentTimeoutDependency</td><td>0</td><td>0</td><td></td>
+</tr>
+<tr>
+<td width="15px" class="
+                                        ok
+                                    "></td><td class="code">testInfiniteComponentTimeoutDependency</td><td>0</td><td>0</td><td></td>
+</tr>
+<tr>
+<td width="15px" class="
+                                        ok
+                                    "></td><td class="code">testServiceRequestInitialization</td><td>0</td><td>0</td><td></td>
+</tr>
+<tr>
+<td width="15px" class="
+                                        ok
+                                    "></td><td class="code">testServiceRequestActivation</td><td>0</td><td>0</td><td></td>
+</tr>
+<tr>
+<td width="15px" class="
+                                        ok
+                                    "></td><td class="code">testEagerServiceRequestInitialization</td><td>0</td><td>0</td><td></td>
+</tr>
+<tr>
+<td width="15px" class="
+                                        ok
+                                    "></td><td class="code">testServiceReferenceExport</td><td>0</td><td>0</td><td></td>
+</tr>
+<tr>
+<td width="15px" class="
+                                        ok
+                                    "></td><td class="code">testInlineServiceReferenceExport</td><td>0</td><td>0</td><td></td>
+</tr>
+<tr>
+<td width="15px" class="
+                                        ok
+                                    "></td><td class="code">testIndirectServiceReferenceExport</td><td>0</td><td>0</td><td></td>
+</tr>
+<tr>
+<td width="15px" class="
+                                        ok
+                                    "></td><td class="code">testCustomTypeInjection</td><td>0</td><td>0</td><td></td>
+</tr>
+<tr>
+<td width="15px" class="
+                                        ok
+                                    "></td><td class="code">testMultiRegisteredConverter</td><td>0</td><td>0</td><td></td>
+</tr>
+<tr>
+<td width="15px" class="
+                                        ok
+                                    "></td><td class="code">testCustomBooleanConverter</td><td>0</td><td>0</td><td></td>
+</tr>
+<tr>
+<td width="15px" class="
+                                        ok
+                                    "></td><td class="code">testServiceBooleanConverter</td><td>0</td><td>0</td><td></td>
+</tr>
+<tr>
+<td width="15px" class="
+                                        ok
+                                    "></td><td class="code">testSubclassConverterInstead</td><td>0</td><td>0</td><td></td>
+</tr>
+<tr>
+<td width="15px" class="
+                                        ok
+                                    "></td><td class="code">testConverterCalled</td><td>0</td><td>0</td><td></td>
+</tr>
+<tr>
+<td width="15px" class="
+                                        ok
+                                    "></td><td class="code">testConversionServiceInjection</td><td>0</td><td>0</td><td></td>
+</tr>
+<tr>
+<td width="15px" class="
+                                        ok
+                                    "></td><td class="code">testConversionServiceInjectionOverride</td><td>0</td><td>0</td><td></td>
+</tr>
+<tr>
+<td width="15px" class="
+                                        ok
+                                    "></td><td class="code">testConstructorShortArgs</td><td>0</td><td>0</td><td></td>
+</tr>
+<tr>
+<td width="15px" class="
+                                        ok
+                                    "></td><td class="code">testConstructorLongArgs</td><td>0</td><td>0</td><td></td>
+</tr>
+<tr>
+<td width="15px" class="
+                                        ok
+                                    "></td><td class="code">testStaticFactoryShortArgs</td><td>0</td><td>0</td><td></td>
+</tr>
+<tr>
+<td width="15px" class="
+                                        ok
+                                    "></td><td class="code">testStaticFactoryLongArgs</td><td>0</td><td>0</td><td></td>
+</tr>
+<tr>
+<td width="15px" class="
+                                        ok
+                                    "></td><td class="code">testInstanceFactoryShortArgs</td><td>0</td><td>0</td><td></td>
+</tr>
+<tr>
+<td width="15px" class="
+                                        ok
+                                    "></td><td class="code">testInstanceFactoryLongArgs</td><td>0</td><td>0</td><td></td>
+</tr>
+<tr>
+<td width="15px" class="
+                                        ok
+                                    "></td><td class="code">testStringTypeConstructor</td><td>0</td><td>0</td><td></td>
+</tr>
+<tr>
+<td width="15px" class="
+                                        ok
+                                    "></td><td class="code">testWrapperPrimitiveAmbiguity</td><td>0</td><td>0</td><td></td>
+</tr>
+<tr>
+<td width="15px" class="
+                                        ok
+                                    "></td><td class="code">testInstanceWrapperPrimitiveAmbiguity</td><td>0</td><td>0</td><td></td>
+</tr>
+<tr>
+<td width="15px" class="
+                                        ok
+                                    "></td><td class="code">testStaticWrapperPrimitiveAmbiguity</td><td>0</td><td>0</td><td></td>
+</tr>
+<tr>
+<td width="15px" class="
+                                        ok
+                                    "></td><td class="code">testPrimitiveWrapperAmbiguity</td><td>0</td><td>0</td><td></td>
+</tr>
+<tr>
+<td width="15px" class="
+                                        ok
+                                    "></td><td class="code">testInstancePrimitiveWrapperAmbiguity</td><td>0</td><td>0</td><td></td>
+</tr>
+<tr>
+<td width="15px" class="
+                                        ok
+                                    "></td><td class="code">testStaticPrimitiveWrapperAmbiguity</td><td>0</td><td>0</td><td></td>
+</tr>
+<tr>
+<td width="15px" class="
+                                        ok
+                                    "></td><td class="code">testAssignabilityAmbiguity</td><td>0</td><td>0</td><td></td>
+</tr>
+<tr>
+<td width="15px" class="
+                                        ok
+                                    "></td><td class="code">testInstanceAssignabilityAmbiguity</td><td>0</td><td>0</td><td></td>
+</tr>
+<tr>
+<td width="15px" class="
+                                        ok
+                                    "></td><td class="code">testStaticAssignabilityAmbiguity</td><td>0</td><td>0</td><td></td>
+</tr>
+<tr>
+<td width="15px" class="
+                                        ok
+                                    "></td><td class="code">testStringConversionAmbiguity</td><td>0</td><td>0</td><td></td>
+</tr>
+<tr>
+<td width="15px" class="
+                                        ok
+                                    "></td><td class="code">testInstanceStringConversionAmbiguity</td><td>0</td><td>0</td><td></td>
+</tr>
+<tr>
+<td width="15px" class="
+                                        ok
+                                    "></td><td class="code">testStaticStringConversionAmbiguity</td><td>0</td><td>0</td><td></td>
+</tr>
+<tr>
+<td width="15px" class="
+                                        ok
+                                    "></td><td class="code">testCollectionConversionAmbiguity</td><td>0</td><td>0</td><td></td>
+</tr>
+<tr>
+<td width="15px" class="
+                                        ok
+                                    "></td><td class="code">testInstanceCollectionConversionAmbiguity</td><td>0</td><td>0</td><td></td>
+</tr>
+<tr>
+<td width="15px" class="
+                                        ok
+                                    "></td><td class="code">testStaticCollectionConversionAmbiguity</td><td>0</td><td>0</td><td></td>
+</tr>
+<tr>
+<td width="15px" class="
+                                        ok
+                                    "></td><td class="code">testMapConversionAmbiguity</td><td>0</td><td>0</td><td></td>
+</tr>
+<tr>
+<td width="15px" class="
+                                        ok
+                                    "></td><td class="code">testInstanceMapConversionAmbiguity</td><td>0</td><td>0</td><td></td>
+</tr>
+<tr>
+<td width="15px" class="
+                                        ok
+                                    "></td><td class="code">testStaticMapConversionAmbiguity</td><td>0</td><td>0</td><td></td>
+</tr>
+<tr>
+<td width="15px" class="
+                                        ok
+                                    "></td><td class="code">testExtenderStart</td><td>0</td><td>0</td><td></td>
+</tr>
+<tr>
+<td width="15px" class="
+                                        warning
+                                    "></td><td class="code">testExtenderStop<ul>
+<li>Unexpected event BlueprintContainerEvent org/osgi/test/cases/blueprint/BlueprintContainer/FAILURE for bundle org.osgi.test.cases.blueprint.circular_ref_one with properties: [bundle.id=76, bundle.version=4.2.0, cause=org.osgi.service.blueprint.container.ComponentDefinitionException: Error setting property: PropertyDescriptor &lt;name: two, getter: null, setter: [class org.osgi.test.cases.blueprint.components.serviceimport.ServiceProxyChecker.setTwo(interface org.osgi.test.cases.blueprint.services.TestServiceTwo], event=org.osgi.service.blueprint.container.BlueprintEvent@6cb910c6, event.topics=org/osgi/test/cases/blueprint/BlueprintContainer/FAILURE, bundle=org.osgi.test.cases.blueprint.circular_ref_one_4.2.0 [76], bundle.symbolicName=org.osgi.test.cases.blueprint.circular_ref_one, extender.bundle=org.apache.aries.blueprint_1.0.0.SNAPSHOT [7] ] was received:</li>
+</ul>
+<pre id="testExtenderStop" style="display:none">
+<div class="code">
+
+junit.framework.AssertionFailedError: Unexpected event BlueprintContainerEvent org/osgi/test/cases/blueprint/BlueprintContainer/FAILURE for bundle org.osgi.test.cases.blueprint.circular_ref_one with properties: [bundle.id=76, bundle.version=4.2.0, cause=org.osgi.service.blueprint.container.ComponentDefinitionException: Error setting property: PropertyDescriptor &lt;name: two, getter: null, setter: [class org.osgi.test.cases.blueprint.components.serviceimport.ServiceProxyChecker.setTwo(interface org.osgi.test.cases.blueprint.services.TestServiceTwo], event=org.osgi.service.blueprint.container.BlueprintEvent@6cb910c6, event.topics=org/osgi/test/cases/blueprint/BlueprintContainer/FAILURE, bundle=org.osgi.test.cases.blueprint.circular_ref_one_4.2.0 [76], bundle.symbolicName=org.osgi.test.cases.blueprint.circular_ref_one, extender.bundle=org.apache.aries.blueprint_1.0.0.SNAPSHOT [7] ] was received:
+	at org.osgi.test.cases.blueprint.framework.AdminTestEvent.failUnexpected(AdminTestEvent.java:99)
+	at org.osgi.test.cases.blueprint.framework.TestPhase.checkEventResults(TestPhase.java:184)
+	at org.osgi.test.cases.blueprint.framework.TestPhase.runTest(TestPhase.java:245)
+	at org.osgi.test.cases.blueprint.framework.BaseTestController.runTest(BaseTestController.java:294)
+	at org.osgi.test.cases.blueprint.framework.BaseTestController.run(BaseTestController.java:407)
+	at org.osgi.test.cases.blueprint.tests.TestExtenderLifeCycle.testExtenderStop(TestExtenderLifeCycle.java:172)
+	at sun.reflect.NativeMethodAccessorImpl.invoke0(Native Method)
+	at sun.reflect.NativeMethodAccessorImpl.invoke(NativeMethodAccessorImpl.java:39)
+	at sun.reflect.DelegatingMethodAccessorImpl.invoke(DelegatingMethodAccessorImpl.java:25)
+	at java.lang.reflect.Method.invoke(Method.java:597)
+	at junit.framework.TestCase.runTest(TestCase.java:164)
+	at junit.framework.TestCase.runBare(TestCase.java:130)
+	at junit.framework.TestResult$1.protect(TestResult.java:106)
+	at junit.framework.TestResult.runProtected(TestResult.java:124)
+	at junit.framework.TestResult.run(TestResult.java:109)
+	at junit.framework.TestCase.run(TestCase.java:120)
+	at junit.framework.TestSuite.runTest(TestSuite.java:230)
+	at junit.framework.TestSuite.run(TestSuite.java:225)
+	at junit.framework.TestSuite.runTest(TestSuite.java:230)
+	at junit.framework.TestSuite.run(TestSuite.java:225)
+	at aQute.junit.runtime.Target.doTesting(Target.java:234)
+	at aQute.junit.runtime.Target.run(Target.java:57)
+	at aQute.junit.runtime.Target.main(Target.java:37)
+Caused by: org.osgi.service.blueprint.container.ComponentDefinitionException: Error setting property: PropertyDescriptor &lt;name: two, getter: null, setter: [class org.osgi.test.cases.blueprint.components.serviceimport.ServiceProxyChecker.setTwo(interface org.osgi.test.cases.blueprint.services.TestServiceTwo]
+	at org.apache.aries.blueprint.container.BeanRecipe.setProperty(BeanRecipe.java:937)
+	at org.apache.aries.blueprint.container.BeanRecipe.setProperties(BeanRecipe.java:903)
+	at org.apache.aries.blueprint.container.BeanRecipe.setProperties(BeanRecipe.java:884)
+	at org.apache.aries.blueprint.container.BeanRecipe.internalCreate2(BeanRecipe.java:816)
+	at org.apache.aries.blueprint.container.BeanRecipe.internalCreate(BeanRecipe.java:783)
+	at org.apache.aries.blueprint.di.AbstractRecipe$1.call(AbstractRecipe.java:79)
+	at java.util.concurrent.FutureTask$Sync.innerRun(FutureTask.java:303)
+	at java.util.concurrent.FutureTask.run(FutureTask.java:138)
+	at org.apache.aries.blueprint.di.AbstractRecipe.create(AbstractRecipe.java:88)
+	at org.apache.aries.blueprint.container.BlueprintRepository.createInstances(BlueprintRepository.java:245)
+	at org.apache.aries.blueprint.container.BlueprintRepository.createAll(BlueprintRepository.java:183)
+	at org.apache.aries.blueprint.container.BlueprintContainerImpl.instantiateEagerComponents(BlueprintContainerImpl.java:648)
+	at org.apache.aries.blueprint.container.BlueprintContainerImpl.doRun(BlueprintContainerImpl.java:340)
+	at org.apache.aries.blueprint.container.BlueprintContainerImpl.run(BlueprintContainerImpl.java:242)
+	at org.apache.aries.blueprint.utils.threading.impl.DiscardableRunnable.run(DiscardableRunnable.java:48)
+	at java.util.concurrent.Executors$RunnableAdapter.call(Executors.java:441)
+	at java.util.concurrent.FutureTask$Sync.innerRun(FutureTask.java:303)
+	at java.util.concurrent.FutureTask.run(FutureTask.java:138)
+	at java.util.concurrent.ScheduledThreadPoolExecutor$ScheduledFutureTask.access$301(ScheduledThreadPoolExecutor.java:98)
+	at java.util.concurrent.ScheduledThreadPoolExecutor$ScheduledFutureTask.run(ScheduledThreadPoolExecutor.java:206)
+	at java.util.concurrent.ThreadPoolExecutor$Worker.runTask(ThreadPoolExecutor.java:886)
+	at java.util.concurrent.ThreadPoolExecutor$Worker.run(ThreadPoolExecutor.java:908)
+	at java.lang.Thread.run(Thread.java:680)
+Caused by: org.osgi.service.blueprint.container.ServiceUnavailableException: No matching service for optional OSGi service reference: (&amp;(objectClass=org.osgi.test.cases.blueprint.services.TestServiceTwo)(osgi.service.blueprint.compname=ServiceTwoCircular))
+	at org.apache.aries.blueprint.container.ReferenceRecipe.getService(ReferenceRecipe.java:228)
+	at org.apache.aries.blueprint.container.ReferenceRecipe.access$100(ReferenceRecipe.java:56)
+	at org.apache.aries.blueprint.container.ReferenceRecipe$ServiceDispatcher.call(ReferenceRecipe.java:294)
+	at org.apache.aries.proxy.impl.ProxyHandler$1.invoke(ProxyHandler.java:54)
+	at org.apache.aries.proxy.impl.ProxyHandler.invoke(ProxyHandler.java:119)
+	at $Proxy3.testTwo(Unknown Source)
+	at org.osgi.test.cases.blueprint.components.serviceimport.ServiceProxyChecker.setTwo(ServiceProxyChecker.java:58)
+	at sun.reflect.NativeMethodAccessorImpl.invoke0(Native Method)
+	at sun.reflect.NativeMethodAccessorImpl.invoke(NativeMethodAccessorImpl.java:39)
+	at sun.reflect.DelegatingMethodAccessorImpl.invoke(DelegatingMethodAccessorImpl.java:25)
+	at java.lang.reflect.Method.invoke(Method.java:597)
+	at org.apache.aries.blueprint.utils.ReflectionUtils$MethodPropertyDescriptor.internalSet(ReflectionUtils.java:568)
+	at org.apache.aries.blueprint.utils.ReflectionUtils$PropertyDescriptor.set(ReflectionUtils.java:319)
+	at org.apache.aries.blueprint.container.BeanRecipe.setProperty(BeanRecipe.java:935)
+	... 22 more
+
+ </div>
+</pre>
+</td><td>1</td><td>0</td><td><img src="http://www.osgi.org/www/info.png" onclick="toggle('testExtenderStop')" title="Show Exceptions"></td>
+</tr>
+<tr>
+<td width="15px" class="
+                                        warning
+                                    "></td><td class="code">testExtenderRankedStop<ul>
+<li>Unexpected event BlueprintContainerEvent org/osgi/test/cases/blueprint/BlueprintContainer/FAILURE for bundle org.osgi.test.cases.blueprint.circular_ref_two with properties: [bundle.id=82, bundle.version=4.2.0, cause=org.osgi.service.blueprint.container.ComponentDefinitionException: Error setting property: PropertyDescriptor &lt;name: one, getter: null, setter: [class org.osgi.test.cases.blueprint.components.serviceimport.ServiceProxyChecker.setOne(interface org.osgi.test.cases.blueprint.services.TestServiceOne], event=org.osgi.service.blueprint.container.BlueprintEvent@63ae2c6f, event.topics=org/osgi/test/cases/blueprint/BlueprintContainer/FAILURE, bundle=org.osgi.test.cases.blueprint.circular_ref_two_4.2.0 [82], bundle.symbolicName=org.osgi.test.cases.blueprint.circular_ref_two, extender.bundle=org.apache.aries.blueprint_1.0.0.SNAPSHOT [7] ] was received:</li>
+</ul>
+<pre id="testExtenderRankedStop" style="display:none">
+<div class="code">
+
+junit.framework.AssertionFailedError: Unexpected event BlueprintContainerEvent org/osgi/test/cases/blueprint/BlueprintContainer/FAILURE for bundle org.osgi.test.cases.blueprint.circular_ref_two with properties: [bundle.id=82, bundle.version=4.2.0, cause=org.osgi.service.blueprint.container.ComponentDefinitionException: Error setting property: PropertyDescriptor &lt;name: one, getter: null, setter: [class org.osgi.test.cases.blueprint.components.serviceimport.ServiceProxyChecker.setOne(interface org.osgi.test.cases.blueprint.services.TestServiceOne], event=org.osgi.service.blueprint.container.BlueprintEvent@63ae2c6f, event.topics=org/osgi/test/cases/blueprint/BlueprintContainer/FAILURE, bundle=org.osgi.test.cases.blueprint.circular_ref_two_4.2.0 [82], bundle.symbolicName=org.osgi.test.cases.blueprint.circular_ref_two, extender.bundle=org.apache.aries.blueprint_1.0.0.SNAPSHOT [7] ] was received:
+	at org.osgi.test.cases.blueprint.framework.AdminTestEvent.failUnexpected(AdminTestEvent.java:99)
+	at org.osgi.test.cases.blueprint.framework.TestPhase.checkEventResults(TestPhase.java:184)
+	at org.osgi.test.cases.blueprint.framework.TestPhase.runTest(TestPhase.java:245)
+	at org.osgi.test.cases.blueprint.framework.BaseTestController.runTest(BaseTestController.java:294)
+	at org.osgi.test.cases.blueprint.framework.BaseTestController.run(BaseTestController.java:407)
+	at org.osgi.test.cases.blueprint.tests.TestExtenderLifeCycle.testExtenderRankedStop(TestExtenderLifeCycle.java:274)
+	at sun.reflect.NativeMethodAccessorImpl.invoke0(Native Method)
+	at sun.reflect.NativeMethodAccessorImpl.invoke(NativeMethodAccessorImpl.java:39)
+	at sun.reflect.DelegatingMethodAccessorImpl.invoke(DelegatingMethodAccessorImpl.java:25)
+	at java.lang.reflect.Method.invoke(Method.java:597)
+	at junit.framework.TestCase.runTest(TestCase.java:164)
+	at junit.framework.TestCase.runBare(TestCase.java:130)
+	at junit.framework.TestResult$1.protect(TestResult.java:106)
+	at junit.framework.TestResult.runProtected(TestResult.java:124)
+	at junit.framework.TestResult.run(TestResult.java:109)
+	at junit.framework.TestCase.run(TestCase.java:120)
+	at junit.framework.TestSuite.runTest(TestSuite.java:230)
+	at junit.framework.TestSuite.run(TestSuite.java:225)
+	at junit.framework.TestSuite.runTest(TestSuite.java:230)
+	at junit.framework.TestSuite.run(TestSuite.java:225)
+	at aQute.junit.runtime.Target.doTesting(Target.java:234)
+	at aQute.junit.runtime.Target.run(Target.java:57)
+	at aQute.junit.runtime.Target.main(Target.java:37)
+Caused by: org.osgi.service.blueprint.container.ComponentDefinitionException: Error setting property: PropertyDescriptor &lt;name: one, getter: null, setter: [class org.osgi.test.cases.blueprint.components.serviceimport.ServiceProxyChecker.setOne(interface org.osgi.test.cases.blueprint.services.TestServiceOne]
+	at org.apache.aries.blueprint.container.BeanRecipe.setProperty(BeanRecipe.java:937)
+	at org.apache.aries.blueprint.container.BeanRecipe.setProperties(BeanRecipe.java:903)
+	at org.apache.aries.blueprint.container.BeanRecipe.setProperties(BeanRecipe.java:884)
+	at org.apache.aries.blueprint.container.BeanRecipe.internalCreate2(BeanRecipe.java:816)
+	at org.apache.aries.blueprint.container.BeanRecipe.internalCreate(BeanRecipe.java:783)
+	at org.apache.aries.blueprint.di.AbstractRecipe$1.call(AbstractRecipe.java:79)
+	at java.util.concurrent.FutureTask$Sync.innerRun(FutureTask.java:303)
+	at java.util.concurrent.FutureTask.run(FutureTask.java:138)
+	at org.apache.aries.blueprint.di.AbstractRecipe.create(AbstractRecipe.java:88)
+	at org.apache.aries.blueprint.container.BlueprintRepository.createInstances(BlueprintRepository.java:245)
+	at org.apache.aries.blueprint.container.BlueprintRepository.createAll(BlueprintRepository.java:183)
+	at org.apache.aries.blueprint.container.BlueprintContainerImpl.instantiateEagerComponents(BlueprintContainerImpl.java:648)
+	at org.apache.aries.blueprint.container.BlueprintContainerImpl.doRun(BlueprintContainerImpl.java:340)
+	at org.apache.aries.blueprint.container.BlueprintContainerImpl.run(BlueprintContainerImpl.java:242)
+	at org.apache.aries.blueprint.utils.threading.impl.DiscardableRunnable.run(DiscardableRunnable.java:48)
+	at java.util.concurrent.Executors$RunnableAdapter.call(Executors.java:441)
+	at java.util.concurrent.FutureTask$Sync.innerRun(FutureTask.java:303)
+	at java.util.concurrent.FutureTask.run(FutureTask.java:138)
+	at java.util.concurrent.ScheduledThreadPoolExecutor$ScheduledFutureTask.access$301(ScheduledThreadPoolExecutor.java:98)
+	at java.util.concurrent.ScheduledThreadPoolExecutor$ScheduledFutureTask.run(ScheduledThreadPoolExecutor.java:206)
+	at java.util.concurrent.ThreadPoolExecutor$Worker.runTask(ThreadPoolExecutor.java:886)
+	at java.util.concurrent.ThreadPoolExecutor$Worker.run(ThreadPoolExecutor.java:908)
+	at java.lang.Thread.run(Thread.java:680)
+Caused by: org.osgi.service.blueprint.container.ServiceUnavailableException: No matching service for optional OSGi service reference: (&amp;(objectClass=org.osgi.test.cases.blueprint.services.TestServiceOne)(osgi.service.blueprint.compname=ServiceOneCircular))
+	at org.apache.aries.blueprint.container.ReferenceRecipe.getService(ReferenceRecipe.java:228)
+	at org.apache.aries.blueprint.container.ReferenceRecipe.access$100(ReferenceRecipe.java:56)
+	at org.apache.aries.blueprint.container.ReferenceRecipe$ServiceDispatcher.call(ReferenceRecipe.java:294)
+	at org.apache.aries.proxy.impl.ProxyHandler$1.invoke(ProxyHandler.java:54)
+	at org.apache.aries.proxy.impl.ProxyHandler.invoke(ProxyHandler.java:119)
+	at $Proxy0.testOne(Unknown Source)
+	at org.osgi.test.cases.blueprint.components.serviceimport.ServiceProxyChecker.setOne(ServiceProxyChecker.java:46)
+	at sun.reflect.NativeMethodAccessorImpl.invoke0(Native Method)
+	at sun.reflect.NativeMethodAccessorImpl.invoke(NativeMethodAccessorImpl.java:39)
+	at sun.reflect.DelegatingMethodAccessorImpl.invoke(DelegatingMethodAccessorImpl.java:25)
+	at java.lang.reflect.Method.invoke(Method.java:597)
+	at org.apache.aries.blueprint.utils.ReflectionUtils$MethodPropertyDescriptor.internalSet(ReflectionUtils.java:568)
+	at org.apache.aries.blueprint.utils.ReflectionUtils$PropertyDescriptor.set(ReflectionUtils.java:319)
+	at org.apache.aries.blueprint.container.BeanRecipe.setProperty(BeanRecipe.java:935)
+	... 22 more
+
+ </div>
+</pre>
+</td><td>1</td><td>0</td><td><img src="http://www.osgi.org/www/info.png" onclick="toggle('testExtenderRankedStop')" title="Show Exceptions"></td>
+</tr>
+<tr>
+<td width="15px" class="
+                                        ok
+                                    "></td><td class="code">testSingleInterfaceExport</td><td>0</td><td>0</td><td></td>
+</tr>
+<tr>
+<td width="15px" class="
+                                        ok
+                                    "></td><td class="code">testNoGracePeriod</td><td>0</td><td>0</td><td></td>
+</tr>
+<tr>
+<td width="15px" class="
+                                        ok
+                                    "></td><td class="code">testReferenceDependsOn</td><td>0</td><td>0</td><td></td>
+</tr>
+<tr>
+<td width="15px" class="
+                                        ok
+                                    "></td><td class="code">testSingleInterfacePrototypeExport</td><td>0</td><td>0</td><td></td>
+</tr>
+<tr>
+<td width="15px" class="
+                                        ok
+                                    "></td><td class="code">testComponentQualifier</td><td>0</td><td>0</td><td></td>
+</tr>
+<tr>
+<td width="15px" class="
+                                        ok
+                                    "></td><td class="code">testRankingExport</td><td>0</td><td>0</td><td></td>
+</tr>
+<tr>
+<td width="15px" class="
+                                        ok
+                                    "></td><td class="code">testRankingImport</td><td>0</td><td>0</td><td></td>
+</tr>
+<tr>
+<td width="15px" class="
+                                        ok
+                                    "></td><td class="code">testServicePropertyQualifier</td><td>0</td><td>0</td><td></td>
+</tr>
+<tr>
+<td width="15px" class="
+                                        ok
+                                    "></td><td class="code">testComplexServiceProperty</td><td>0</td><td>0</td><td></td>
+</tr>
+<tr>
+<td width="15px" class="
+                                        ok
+                                    "></td><td class="code">testDependsOnQualifier</td><td>0</td><td>0</td><td></td>
+</tr>
+<tr>
+<td width="15px" class="
+                                        ok
+                                    "></td><td class="code">testMultipleInterface</td><td>0</td><td>0</td><td></td>
+</tr>
+<tr>
+<td width="15px" class="
+                                        ok
+                                    "></td><td class="code">testRegistrationListenerImport</td><td>0</td><td>0</td><td></td>
+</tr>
+<tr>
+<td width="15px" class="
+                                        ok
+                                    "></td><td class="code">testInlineRegistrationListenerImport</td><td>0</td><td>0</td><td></td>
+</tr>
+<tr>
+<td width="15px" class="
+                                        ok
+                                    "></td><td class="code">testConcreteInterface</td><td>0</td><td>0</td><td></td>
+</tr>
+<tr>
+<td width="15px" class="
+                                        ok
+                                    "></td><td class="code">testAutoInterface</td><td>0</td><td>0</td><td></td>
+</tr>
+<tr>
+<td width="15px" class="
+                                        ok
+                                    "></td><td class="code">testAutoHierarchy</td><td>0</td><td>0</td><td></td>
+</tr>
+<tr>
+<td width="15px" class="
+                                        ok
+                                    "></td><td class="code">testConcreteClassImport</td><td>0</td><td>0</td><td></td>
+</tr>
+<tr>
+<td width="15px" class="
+                                        ok
+                                    "></td><td class="code">testAutoAll</td><td>0</td><td>0</td><td></td>
+</tr>
+<tr>
+<td width="15px" class="
+                                        warning
+                                    "></td><td class="code">testFactoryExport<ul>
+<li>Unexpected event BlueprintContainerEvent org/osgi/test/cases/blueprint/BlueprintContainer/FAILURE for bundle org.osgi.test.cases.blueprint.ServiceOne_property_import with properties: [bundle.id=118, bundle.version=4.2.0, cause=org.osgi.service.blueprint.container.ComponentDefinitionException: Error setting property: PropertyDescriptor &lt;name: one, getter: null, setter: [class org.osgi.test.cases.blueprint.components.serviceimport.ServiceReferenceChecker.setOne(interface org.osgi.test.cases.blueprint.services.TestServiceOne], event=org.osgi.service.blueprint.container.BlueprintEvent@7519ca2c, event.topics=org/osgi/test/cases/blueprint/BlueprintContainer/FAILURE, bundle=org.osgi.test.cases.blueprint.ServiceOne_property_import_4.2.0 [118], bundle.symbolicName=org.osgi.test.cases.blueprint.ServiceOne_property_import, extender.bundle=org.apache.aries.blueprint_1.0.0.SNAPSHOT [7] ] was received:</li>
+</ul>
+<pre id="testFactoryExport" style="display:none">
+<div class="code">
+
+junit.framework.AssertionFailedError: Unexpected event BlueprintContainerEvent org/osgi/test/cases/blueprint/BlueprintContainer/FAILURE for bundle org.osgi.test.cases.blueprint.ServiceOne_property_import with properties: [bundle.id=118, bundle.version=4.2.0, cause=org.osgi.service.blueprint.container.ComponentDefinitionException: Error setting property: PropertyDescriptor &lt;name: one, getter: null, setter: [class org.osgi.test.cases.blueprint.components.serviceimport.ServiceReferenceChecker.setOne(interface org.osgi.test.cases.blueprint.services.TestServiceOne], event=org.osgi.service.blueprint.container.BlueprintEvent@7519ca2c, event.topics=org/osgi/test/cases/blueprint/BlueprintContainer/FAILURE, bundle=org.osgi.test.cases.blueprint.ServiceOne_property_import_4.2.0 [118], bundle.symbolicName=org.osgi.test.cases.blueprint.ServiceOne_property_import, extender.bundle=org.apache.aries.blueprint_1.0.0.SNAPSHOT [7] ] was received:
+	at org.osgi.test.cases.blueprint.framework.AdminTestEvent.failUnexpected(AdminTestEvent.java:99)
+	at org.osgi.test.cases.blueprint.framework.TestPhase.checkEventResults(TestPhase.java:184)
+	at org.osgi.test.cases.blueprint.framework.TestPhase.runTest(TestPhase.java:245)
+	at org.osgi.test.cases.blueprint.framework.BaseTestController.runTest(BaseTestController.java:294)
+	at org.osgi.test.cases.blueprint.framework.BaseTestController.run(BaseTestController.java:407)
+	at org.osgi.test.cases.blueprint.tests.TestServiceImportExport.testFactoryExport(TestServiceImportExport.java:1147)
+	at sun.reflect.NativeMethodAccessorImpl.invoke0(Native Method)
+	at sun.reflect.NativeMethodAccessorImpl.invoke(NativeMethodAccessorImpl.java:39)
+	at sun.reflect.DelegatingMethodAccessorImpl.invoke(DelegatingMethodAccessorImpl.java:25)
+	at java.lang.reflect.Method.invoke(Method.java:597)
+	at junit.framework.TestCase.runTest(TestCase.java:164)
+	at junit.framework.TestCase.runBare(TestCase.java:130)
+	at junit.framework.TestResult$1.protect(TestResult.java:106)
+	at junit.framework.TestResult.runProtected(TestResult.java:124)
+	at junit.framework.TestResult.run(TestResult.java:109)
+	at junit.framework.TestCase.run(TestCase.java:120)
+	at junit.framework.TestSuite.runTest(TestSuite.java:230)
+	at junit.framework.TestSuite.run(TestSuite.java:225)
+	at junit.framework.TestSuite.runTest(TestSuite.java:230)
+	at junit.framework.TestSuite.run(TestSuite.java:225)
+	at aQute.junit.runtime.Target.doTesting(Target.java:234)
+	at aQute.junit.runtime.Target.run(Target.java:57)
+	at aQute.junit.runtime.Target.main(Target.java:37)
+Caused by: org.osgi.service.blueprint.container.ComponentDefinitionException: Error setting property: PropertyDescriptor &lt;name: one, getter: null, setter: [class org.osgi.test.cases.blueprint.components.serviceimport.ServiceReferenceChecker.setOne(interface org.osgi.test.cases.blueprint.services.TestServiceOne]
+	at org.apache.aries.blueprint.container.BeanRecipe.setProperty(BeanRecipe.java:937)
+	at org.apache.aries.blueprint.container.BeanRecipe.setProperties(BeanRecipe.java:903)
+	at org.apache.aries.blueprint.container.BeanRecipe.setProperties(BeanRecipe.java:884)
+	at org.apache.aries.blueprint.container.BeanRecipe.internalCreate2(BeanRecipe.java:816)
+	at org.apache.aries.blueprint.container.BeanRecipe.internalCreate(BeanRecipe.java:783)
+	at org.apache.aries.blueprint.di.AbstractRecipe$1.call(AbstractRecipe.java:79)
+	at java.util.concurrent.FutureTask$Sync.innerRun(FutureTask.java:303)
+	at java.util.concurrent.FutureTask.run(FutureTask.java:138)
+	at org.apache.aries.blueprint.di.AbstractRecipe.create(AbstractRecipe.java:88)
+	at org.apache.aries.blueprint.container.BlueprintRepository.createInstances(BlueprintRepository.java:245)
+	at org.apache.aries.blueprint.container.BlueprintRepository.createAll(BlueprintRepository.java:183)
+	at org.apache.aries.blueprint.container.BlueprintContainerImpl.instantiateEagerComponents(BlueprintContainerImpl.java:648)
+	at org.apache.aries.blueprint.container.BlueprintContainerImpl.doRun(BlueprintContainerImpl.java:340)
+	at org.apache.aries.blueprint.container.BlueprintContainerImpl.run(BlueprintContainerImpl.java:242)
+	at org.apache.aries.blueprint.utils.threading.impl.DiscardableRunnable.run(DiscardableRunnable.java:48)
+	at java.util.concurrent.Executors$RunnableAdapter.call(Executors.java:441)
+	at java.util.concurrent.FutureTask$Sync.innerRun(FutureTask.java:303)
+	at java.util.concurrent.FutureTask.run(FutureTask.java:138)
+	at java.util.concurrent.ScheduledThreadPoolExecutor$ScheduledFutureTask.access$301(ScheduledThreadPoolExecutor.java:98)
+	at java.util.concurrent.ScheduledThreadPoolExecutor$ScheduledFutureTask.run(ScheduledThreadPoolExecutor.java:206)
+	at java.util.concurrent.ThreadPoolExecutor$Worker.runTask(ThreadPoolExecutor.java:886)
+	at java.util.concurrent.ThreadPoolExecutor$Worker.run(ThreadPoolExecutor.java:908)
+	at java.lang.Thread.run(Thread.java:680)
+Caused by: java.lang.IllegalStateException: getService() returned null for {org.osgi.test.cases.blueprint.services.TestServiceOne}={osgi.service.blueprint.compname=ServiceOneFactory, service.id=347}
+	at org.apache.aries.blueprint.container.ReferenceRecipe.getService(ReferenceRecipe.java:245)
+	at org.apache.aries.blueprint.container.ReferenceRecipe.access$100(ReferenceRecipe.java:56)
+	at org.apache.aries.blueprint.container.ReferenceRecipe$ServiceDispatcher.call(ReferenceRecipe.java:294)
+	at org.apache.aries.proxy.impl.ProxyHandler$1.invoke(ProxyHandler.java:54)
+	at org.apache.aries.proxy.impl.ProxyHandler.invoke(ProxyHandler.java:119)
+	at $Proxy0.testOne(Unknown Source)
+	at org.osgi.test.cases.blueprint.components.serviceimport.ServiceReferenceChecker.setOne(ServiceReferenceChecker.java:115)
+	at sun.reflect.NativeMethodAccessorImpl.invoke0(Native Method)
+	at sun.reflect.NativeMethodAccessorImpl.invoke(NativeMethodAccessorImpl.java:39)
+	at sun.reflect.DelegatingMethodAccessorImpl.invoke(DelegatingMethodAccessorImpl.java:25)
+	at java.lang.reflect.Method.invoke(Method.java:597)
+	at org.apache.aries.blueprint.utils.ReflectionUtils$MethodPropertyDescriptor.internalSet(ReflectionUtils.java:568)
+	at org.apache.aries.blueprint.utils.ReflectionUtils$PropertyDescriptor.set(ReflectionUtils.java:319)
+	at org.apache.aries.blueprint.container.BeanRecipe.setProperty(BeanRecipe.java:935)
+	... 22 more
+
+ </div>
+</pre>
+</td><td>1</td><td>0</td><td><img src="http://www.osgi.org/www/info.png" onclick="toggle('testFactoryExport')" title="Show Exceptions"></td>
+</tr>
+<tr>
+<td width="15px" class="
+                                        warning
+                                    "></td><td class="code">testPrototypeFactoryExport<ul>
+<li>Unexpected event org/osgi/test/cases/blueprint/BEAN_CREATED for ServiceOneFactory was received: null</li>
+</ul>
+<pre id="testPrototypeFactoryExport" style="display:none">
+<div class="code">
+
+junit.framework.AssertionFailedError: Unexpected event org/osgi/test/cases/blueprint/BEAN_CREATED for ServiceOneFactory was received: null
+	at org.osgi.test.cases.blueprint.framework.ComponentAssertion.failUnexpected(ComponentAssertion.java:221)
+	at org.osgi.test.cases.blueprint.framework.TestPhase.checkEventResults(TestPhase.java:184)
+	at org.osgi.test.cases.blueprint.framework.TestPhase.runTest(TestPhase.java:245)
+	at org.osgi.test.cases.blueprint.framework.BaseTestController.runTest(BaseTestController.java:294)
+	at org.osgi.test.cases.blueprint.framework.BaseTestController.run(BaseTestController.java:407)
+	at org.osgi.test.cases.blueprint.tests.TestServiceImportExport.testPrototypeFactoryExport(TestServiceImportExport.java:1213)
+	at sun.reflect.NativeMethodAccessorImpl.invoke0(Native Method)
+	at sun.reflect.NativeMethodAccessorImpl.invoke(NativeMethodAccessorImpl.java:39)
+	at sun.reflect.DelegatingMethodAccessorImpl.invoke(DelegatingMethodAccessorImpl.java:25)
+	at java.lang.reflect.Method.invoke(Method.java:597)
+	at junit.framework.TestCase.runTest(TestCase.java:164)
+	at junit.framework.TestCase.runBare(TestCase.java:130)
+	at junit.framework.TestResult$1.protect(TestResult.java:106)
+	at junit.framework.TestResult.runProtected(TestResult.java:124)
+	at junit.framework.TestResult.run(TestResult.java:109)
+	at junit.framework.TestCase.run(TestCase.java:120)
+	at junit.framework.TestSuite.runTest(TestSuite.java:230)
+	at junit.framework.TestSuite.run(TestSuite.java:225)
+	at junit.framework.TestSuite.runTest(TestSuite.java:230)
+	at junit.framework.TestSuite.run(TestSuite.java:225)
+	at aQute.junit.runtime.Target.doTesting(Target.java:234)
+	at aQute.junit.runtime.Target.run(Target.java:57)
+	at aQute.junit.runtime.Target.main(Target.java:37)
+
+ </div>
+</pre>
+</td><td>1</td><td>0</td><td><img src="http://www.osgi.org/www/info.png" onclick="toggle('testPrototypeFactoryExport')" title="Show Exceptions"></td>
+</tr>
+<tr>
+<td width="15px" class="
+                                        ok
+                                    "></td><td class="code">testRegistrationInjection</td><td>0</td><td>0</td><td></td>
+</tr>
+<tr>
+<td width="15px" class="
+                                        ok
+                                    "></td><td class="code">testInlineRegistrationInjection</td><td>0</td><td>0</td><td></td>
+</tr>
+<tr>
+<td width="15px" class="
+                                        ok
+                                    "></td><td class="code">testDependencyWait</td><td>0</td><td>0</td><td></td>
+</tr>
+<tr>
+<td width="15px" class="
+                                        ok
+                                    "></td><td class="code">testListenerExport</td><td>0</td><td>0</td><td></td>
+</tr>
+<tr>
+<td width="15px" class="
+                                        ok
+                                    "></td><td class="code">testRegistrationListenerSingletonSignature</td><td>0</td><td>0</td><td></td>
+</tr>
+<tr>
+<td width="15px" class="
+                                        ok
+                                    "></td><td class="code">testListenerRegisteredExport</td><td>0</td><td>0</td><td></td>
+</tr>
+<tr>
+<td width="15px" class="
+                                        ok
+                                    "></td><td class="code">testListenerUnregisteredExport</td><td>0</td><td>0</td><td></td>
+</tr>
+<tr>
+<td width="15px" class="
+                                        ok
+                                    "></td><td class="code">testPrototypeListenerExport</td><td>0</td><td>0</td><td></td>
+</tr>
+<tr>
+<td width="15px" class="
+                                        ok
+                                    "></td><td class="code">testInlineListenerExport</td><td>0</td><td>0</td><td></td>
+</tr>
+<tr>
+<td width="15px" class="
+                                        ok
+                                    "></td><td class="code">testCircularListenerExport</td><td>0</td><td>0</td><td></td>
+</tr>
+<tr>
+<td width="15px" class="
+                                        ok
+                                    "></td><td class="code">testMultipleListenerExport</td><td>0</td><td>0</td><td></td>
+</tr>
+<tr>
+<td width="15px" class="
+                                        ok
+                                    "></td><td class="code">testMultipleListenerMethodExport</td><td>0</td><td>0</td><td></td>
+</tr>
+<tr>
+<td width="15px" class="
+                                        ok
+                                    "></td><td class="code">testServiceImportedListenerImport</td><td>0</td><td>0</td><td></td>
+</tr>
+<tr>
+<td width="15px" class="
+                                        ok
+                                    "></td><td class="code">testInlineServiceImportedListenerImport</td><td>0</td><td>0</td><td></td>
+</tr>
+<tr>
+<td width="15px" class="
+                                        ok
+                                    "></td><td class="code">testReferenceListenerBindOnly</td><td>0</td><td>0</td><td></td>
+</tr>
+<tr>
+<td width="15px" class="
+                                        ok
+                                    "></td><td class="code">testReferenceListenerUnbindOnly</td><td>0</td><td>0</td><td></td>
+</tr>
+<tr>
+<td width="15px" class="
+                                        ok
+                                    "></td><td class="code">testCircularServiceListenerImport</td><td>0</td><td>0</td><td></td>
+</tr>
+<tr>
+<td width="15px" class="
+                                        ok
+                                    "></td><td class="code">testServiceMultipleListenerImport</td><td>0</td><td>0</td><td></td>
+</tr>
+<tr>
+<td width="15px" class="
+                                        ok
+                                    "></td><td class="code">testServiceMultipleListenerMethodImport</td><td>0</td><td>0</td><td></td>
+</tr>
+<tr>
+<td width="15px" class="
+                                        ok
+                                    "></td><td class="code">testServiceListenerReferenceMethodImport</td><td>0</td><td>0</td><td></td>
+</tr>
+<tr>
+<td width="15px" class="
+                                        ok
+                                    "></td><td class="code">testServiceListenerNoMapMethodImport</td><td>0</td><td>0</td><td></td>
+</tr>
+<tr>
+<td width="15px" class="
+                                        ok
+                                    "></td><td class="code">testUnregisteredServiceDependency</td><td>0</td><td>0</td><td></td>
+</tr>
+<tr>
+<td width="15px" class="
+                                        ok
+                                    "></td><td class="code">testReplacementServiceDependency</td><td>0</td><td>0</td><td></td>
+</tr>
+<tr>
+<td width="15px" class="
+                                        ok
+                                    "></td><td class="code">testWaitingServiceDependency</td><td>0</td><td>0</td><td></td>
+</tr>
+<tr>
+<td width="15px" class="
+                                        ok
+                                    "></td><td class="code">testUnavailableServiceDependency</td><td>0</td><td>0</td><td></td>
+</tr>
+<tr>
+<td width="15px" class="
+                                        ok
+                                    "></td><td class="code">testUnavailableServiceDefaultDependency</td><td>0</td><td>0</td><td></td>
+</tr>
+<tr>
+<td width="15px" class="
+                                        ok
+                                    "></td><td class="code">testServiceRebind</td><td>0</td><td>0</td><td></td>
+</tr>
+<tr>
+<td width="15px" class="
+                                        ok
+                                    "></td><td class="code">testServiceRankingRebind</td><td>0</td><td>0</td><td></td>
+</tr>
+<tr>
+<td width="15px" class="
+                                        ok
+                                    "></td><td class="code">testServiceRegistrationProxy</td><td>0</td><td>0</td><td></td>
+</tr>
+<tr>
+<td width="15px" class="
+                                        ok
+                                    "></td><td class="code">testLazyServiceRegistration</td><td>0</td><td>0</td><td></td>
+</tr>
+<tr>
+<td width="15px" class="
+                                        ok
+                                    "></td><td class="code">testLazyReference</td><td>0</td><td>0</td><td></td>
+</tr>
+<tr>
+<td width="15px" class="
+                                        warning
+                                    "></td><td class="code">testLazyServiceGet<ul>
+<li>Unexpected event BlueprintContainerEvent org/osgi/test/cases/blueprint/BlueprintContainer/FAILURE for bundle org.osgi.test.cases.blueprint.ServiceOne_factory_export with properties: [bundle.id=173, bundle.version=4.2.0, cause=org.osgi.service.blueprint.container.ComponentDefinitionException: org.osgi.service.blueprint.container.ComponentDefinitionException: The service implementation does not implement the required interfaces: [org.osgi.test.cases.blueprint.services.TestServiceOne], event=org.osgi.service.blueprint.container.BlueprintEvent@1c90a278, event.topics=org/osgi/test/cases/blueprint/BlueprintContainer/FAILURE, bundle=org.osgi.test.cases.blueprint.ServiceOne_factory_export_4.2.0 [173], bundle.symbolicName=org.osgi.test.cases.blueprint.ServiceOne_factory_export, extender.bundle=org.apache.aries.blueprint_1.0.0.SNAPSHOT [7] ] was received:</li>
+</ul>
+<pre id="testLazyServiceGet" style="display:none">
+<div class="code">
+
+junit.framework.AssertionFailedError: Unexpected event BlueprintContainerEvent org/osgi/test/cases/blueprint/BlueprintContainer/FAILURE for bundle org.osgi.test.cases.blueprint.ServiceOne_factory_export with properties: [bundle.id=173, bundle.version=4.2.0, cause=org.osgi.service.blueprint.container.ComponentDefinitionException: org.osgi.service.blueprint.container.ComponentDefinitionException: The service implementation does not implement the required interfaces: [org.osgi.test.cases.blueprint.services.TestServiceOne], event=org.osgi.service.blueprint.container.BlueprintEvent@1c90a278, event.topics=org/osgi/test/cases/blueprint/BlueprintContainer/FAILURE, bundle=org.osgi.test.cases.blueprint.ServiceOne_factory_export_4.2.0 [173], bundle.symbolicName=org.osgi.test.cases.blueprint.ServiceOne_factory_export, extender.bundle=org.apache.aries.blueprint_1.0.0.SNAPSHOT [7] ] was received:
+	at org.osgi.test.cases.blueprint.framework.AdminTestEvent.failUnexpected(AdminTestEvent.java:99)
+	at org.osgi.test.cases.blueprint.framework.TestPhase.checkEventResults(TestPhase.java:184)
+	at org.osgi.test.cases.blueprint.framework.TestPhase.runTest(TestPhase.java:245)
+	at org.osgi.test.cases.blueprint.framework.BaseTestController.runTest(BaseTestController.java:294)
+	at org.osgi.test.cases.blueprint.framework.BaseTestController.run(BaseTestController.java:407)
+	at org.osgi.test.cases.blueprint.tests.TestServiceImportExport.testLazyServiceGet(TestServiceImportExport.java:2557)
+	at sun.reflect.NativeMethodAccessorImpl.invoke0(Native Method)
+	at sun.reflect.NativeMethodAccessorImpl.invoke(NativeMethodAccessorImpl.java:39)
+	at sun.reflect.DelegatingMethodAccessorImpl.invoke(DelegatingMethodAccessorImpl.java:25)
+	at java.lang.reflect.Method.invoke(Method.java:597)
+	at junit.framework.TestCase.runTest(TestCase.java:164)
+	at junit.framework.TestCase.runBare(TestCase.java:130)
+	at junit.framework.TestResult$1.protect(TestResult.java:106)
+	at junit.framework.TestResult.runProtected(TestResult.java:124)
+	at junit.framework.TestResult.run(TestResult.java:109)
+	at junit.framework.TestCase.run(TestCase.java:120)
+	at junit.framework.TestSuite.runTest(TestSuite.java:230)
+	at junit.framework.TestSuite.run(TestSuite.java:225)
+	at junit.framework.TestSuite.runTest(TestSuite.java:230)
+	at junit.framework.TestSuite.run(TestSuite.java:225)
+	at aQute.junit.runtime.Target.doTesting(Target.java:234)
+	at aQute.junit.runtime.Target.run(Target.java:57)
+	at aQute.junit.runtime.Target.main(Target.java:37)
+Caused by: org.osgi.service.blueprint.container.ComponentDefinitionException: org.osgi.service.blueprint.container.ComponentDefinitionException: The service implementation does not implement the required interfaces: [org.osgi.test.cases.blueprint.services.TestServiceOne]
+	at org.apache.aries.blueprint.container.ServiceRecipe.createService(ServiceRecipe.java:295)
+	at org.apache.aries.blueprint.container.ServiceRecipe.internalGetService(ServiceRecipe.java:247)
+	at org.apache.aries.blueprint.container.ServiceRecipe.internalCreate(ServiceRecipe.java:147)
+	at org.apache.aries.blueprint.di.AbstractRecipe$1.call(AbstractRecipe.java:79)
+	at java.util.concurrent.FutureTask$Sync.innerRun(FutureTask.java:303)
+	at java.util.concurrent.FutureTask.run(FutureTask.java:138)
+	at org.apache.aries.blueprint.di.AbstractRecipe.create(AbstractRecipe.java:88)
+	at org.apache.aries.blueprint.di.RefRecipe.internalCreate(RefRecipe.java:62)
+	at org.apache.aries.blueprint.di.AbstractRecipe.create(AbstractRecipe.java:106)
+	at org.apache.aries.blueprint.container.BeanRecipe.setProperty(BeanRecipe.java:929)
+	at org.apache.aries.blueprint.container.BeanRecipe.setProperties(BeanRecipe.java:903)
+	at org.apache.aries.blueprint.container.BeanRecipe.setProperties(BeanRecipe.java:884)
+	at org.apache.aries.blueprint.container.BeanRecipe.internalCreate2(BeanRecipe.java:816)
+	at org.apache.aries.blueprint.container.BeanRecipe.internalCreate(BeanRecipe.java:783)
+	at org.apache.aries.blueprint.di.AbstractRecipe$1.call(AbstractRecipe.java:79)
+	at java.util.concurrent.FutureTask$Sync.innerRun(FutureTask.java:303)
+	at java.util.concurrent.FutureTask.run(FutureTask.java:138)
+	at org.apache.aries.blueprint.di.AbstractRecipe.create(AbstractRecipe.java:88)
+	at org.apache.aries.blueprint.container.BlueprintRepository.createInstances(BlueprintRepository.java:245)
+	at org.apache.aries.blueprint.container.BlueprintRepository.createAll(BlueprintRepository.java:183)
+	at org.apache.aries.blueprint.container.BlueprintContainerImpl.instantiateEagerComponents(BlueprintContainerImpl.java:648)
+	at org.apache.aries.blueprint.container.BlueprintContainerImpl.doRun(BlueprintContainerImpl.java:340)
+	at org.apache.aries.blueprint.container.BlueprintContainerImpl.run(BlueprintContainerImpl.java:242)
+	at org.apache.aries.blueprint.utils.threading.impl.DiscardableRunnable.run(DiscardableRunnable.java:48)
+	at java.util.concurrent.Executors$RunnableAdapter.call(Executors.java:441)
+	at java.util.concurrent.FutureTask$Sync.innerRun(FutureTask.java:303)
+	at java.util.concurrent.FutureTask.run(FutureTask.java:138)
+	at java.util.concurrent.ScheduledThreadPoolExecutor$ScheduledFutureTask.access$301(ScheduledThreadPoolExecutor.java:98)
+	at java.util.concurrent.ScheduledThreadPoolExecutor$ScheduledFutureTask.run(ScheduledThreadPoolExecutor.java:206)
+	at java.util.concurrent.ThreadPoolExecutor$Worker.runTask(ThreadPoolExecutor.java:886)
+	at java.util.concurrent.ThreadPoolExecutor$Worker.run(ThreadPoolExecutor.java:908)
+	at java.lang.Thread.run(Thread.java:680)
+Caused by: org.osgi.service.blueprint.container.ComponentDefinitionException: The service implementation does not implement the required interfaces: [org.osgi.test.cases.blueprint.services.TestServiceOne]
+	at org.apache.aries.blueprint.container.ServiceRecipe.validateClasses(ServiceRecipe.java:338)
+	at org.apache.aries.blueprint.container.ServiceRecipe.createService(ServiceRecipe.java:287)
+	... 31 more
+
+ </div>
+</pre>
+</td><td>1</td><td>0</td><td><img src="http://www.osgi.org/www/info.png" onclick="toggle('testLazyServiceGet')" title="Show Exceptions"></td>
+</tr>
+<tr>
+<td width="15px" class="
+                                        warning
+                                    "></td><td class="code">testInterfacelessReference<ul>
+<li>Unexpected event BlueprintContainerEvent org/osgi/test/cases/blueprint/BlueprintContainer/FAILURE for bundle org.osgi.test.cases.blueprint.ServiceOne_factory_export with properties: [bundle.id=175, bundle.version=4.2.0, cause=org.osgi.service.blueprint.container.ComponentDefinitionException: org.osgi.service.blueprint.container.ComponentDefinitionException: The service implementation does not implement the required interfaces: [org.osgi.test.cases.blueprint.services.TestServiceOne], event=org.osgi.service.blueprint.container.BlueprintEvent@6ff4ff23, event.topics=org/osgi/test/cases/blueprint/BlueprintContainer/FAILURE, bundle=org.osgi.test.cases.blueprint.ServiceOne_factory_export_4.2.0 [175], bundle.symbolicName=org.osgi.test.cases.blueprint.ServiceOne_factory_export, extender.bundle=org.apache.aries.blueprint_1.0.0.SNAPSHOT [7] ] was received:</li>
+</ul>
+<pre id="testInterfacelessReference" style="display:none">
+<div class="code">
+
+junit.framework.AssertionFailedError: Unexpected event BlueprintContainerEvent org/osgi/test/cases/blueprint/BlueprintContainer/FAILURE for bundle org.osgi.test.cases.blueprint.ServiceOne_factory_export with properties: [bundle.id=175, bundle.version=4.2.0, cause=org.osgi.service.blueprint.container.ComponentDefinitionException: org.osgi.service.blueprint.container.ComponentDefinitionException: The service implementation does not implement the required interfaces: [org.osgi.test.cases.blueprint.services.TestServiceOne], event=org.osgi.service.blueprint.container.BlueprintEvent@6ff4ff23, event.topics=org/osgi/test/cases/blueprint/BlueprintContainer/FAILURE, bundle=org.osgi.test.cases.blueprint.ServiceOne_factory_export_4.2.0 [175], bundle.symbolicName=org.osgi.test.cases.blueprint.ServiceOne_factory_export, extender.bundle=org.apache.aries.blueprint_1.0.0.SNAPSHOT [7] ] was received:
+	at org.osgi.test.cases.blueprint.framework.AdminTestEvent.failUnexpected(AdminTestEvent.java:99)
+	at org.osgi.test.cases.blueprint.framework.TestPhase.checkEventResults(TestPhase.java:184)
+	at org.osgi.test.cases.blueprint.framework.TestPhase.runTest(TestPhase.java:245)
+	at org.osgi.test.cases.blueprint.framework.BaseTestController.runTest(BaseTestController.java:294)
+	at org.osgi.test.cases.blueprint.framework.BaseTestController.run(BaseTestController.java:407)
+	at org.osgi.test.cases.blueprint.tests.TestServiceImportExport.testInterfacelessReference(TestServiceImportExport.java:2630)
+	at sun.reflect.NativeMethodAccessorImpl.invoke0(Native Method)
+	at sun.reflect.NativeMethodAccessorImpl.invoke(NativeMethodAccessorImpl.java:39)
+	at sun.reflect.DelegatingMethodAccessorImpl.invoke(DelegatingMethodAccessorImpl.java:25)
+	at java.lang.reflect.Method.invoke(Method.java:597)
+	at junit.framework.TestCase.runTest(TestCase.java:164)
+	at junit.framework.TestCase.runBare(TestCase.java:130)
+	at junit.framework.TestResult$1.protect(TestResult.java:106)
+	at junit.framework.TestResult.runProtected(TestResult.java:124)
+	at junit.framework.TestResult.run(TestResult.java:109)
+	at junit.framework.TestCase.run(TestCase.java:120)
+	at junit.framework.TestSuite.runTest(TestSuite.java:230)
+	at junit.framework.TestSuite.run(TestSuite.java:225)
+	at junit.framework.TestSuite.runTest(TestSuite.java:230)
+	at junit.framework.TestSuite.run(TestSuite.java:225)
+	at aQute.junit.runtime.Target.doTesting(Target.java:234)
+	at aQute.junit.runtime.Target.run(Target.java:57)
+	at aQute.junit.runtime.Target.main(Target.java:37)
+Caused by: org.osgi.service.blueprint.container.ComponentDefinitionException: org.osgi.service.blueprint.container.ComponentDefinitionException: The service implementation does not implement the required interfaces: [org.osgi.test.cases.blueprint.services.TestServiceOne]
+	at org.apache.aries.blueprint.container.ServiceRecipe.createService(ServiceRecipe.java:295)
+	at org.apache.aries.blueprint.container.ServiceRecipe.internalGetService(ServiceRecipe.java:247)
+	at org.apache.aries.blueprint.container.ServiceRecipe.internalCreate(ServiceRecipe.java:147)
+	at org.apache.aries.blueprint.di.AbstractRecipe$1.call(AbstractRecipe.java:79)
+	at java.util.concurrent.FutureTask$Sync.innerRun(FutureTask.java:303)
+	at java.util.concurrent.FutureTask.run(FutureTask.java:138)
+	at org.apache.aries.blueprint.di.AbstractRecipe.create(AbstractRecipe.java:88)
+	at org.apache.aries.blueprint.di.RefRecipe.internalCreate(RefRecipe.java:62)
+	at org.apache.aries.blueprint.di.AbstractRecipe.create(AbstractRecipe.java:106)
+	at org.apache.aries.blueprint.container.BeanRecipe.setProperty(BeanRecipe.java:929)
+	at org.apache.aries.blueprint.container.BeanRecipe.setProperties(BeanRecipe.java:903)
+	at org.apache.aries.blueprint.container.BeanRecipe.setProperties(BeanRecipe.java:884)
+	at org.apache.aries.blueprint.container.BeanRecipe.internalCreate2(BeanRecipe.java:816)
+	at org.apache.aries.blueprint.container.BeanRecipe.internalCreate(BeanRecipe.java:783)
+	at org.apache.aries.blueprint.di.AbstractRecipe$1.call(AbstractRecipe.java:79)
+	at java.util.concurrent.FutureTask$Sync.innerRun(FutureTask.java:303)
+	at java.util.concurrent.FutureTask.run(FutureTask.java:138)
+	at org.apache.aries.blueprint.di.AbstractRecipe.create(AbstractRecipe.java:88)
+	at org.apache.aries.blueprint.container.BlueprintRepository.createInstances(BlueprintRepository.java:245)
+	at org.apache.aries.blueprint.container.BlueprintRepository.createAll(BlueprintRepository.java:183)
+	at org.apache.aries.blueprint.container.BlueprintContainerImpl.instantiateEagerComponents(BlueprintContainerImpl.java:648)
+	at org.apache.aries.blueprint.container.BlueprintContainerImpl.doRun(BlueprintContainerImpl.java:340)
+	at org.apache.aries.blueprint.container.BlueprintContainerImpl.run(BlueprintContainerImpl.java:242)
+	at org.apache.aries.blueprint.utils.threading.impl.DiscardableRunnable.run(DiscardableRunnable.java:48)
+	at java.util.concurrent.Executors$RunnableAdapter.call(Executors.java:441)
+	at java.util.concurrent.FutureTask$Sync.innerRun(FutureTask.java:303)
+	at java.util.concurrent.FutureTask.run(FutureTask.java:138)
+	at java.util.concurrent.ScheduledThreadPoolExecutor$ScheduledFutureTask.access$301(ScheduledThreadPoolExecutor.java:98)
+	at java.util.concurrent.ScheduledThreadPoolExecutor$ScheduledFutureTask.run(ScheduledThreadPoolExecutor.java:206)
+	at java.util.concurrent.ThreadPoolExecutor$Worker.runTask(ThreadPoolExecutor.java:886)
+	at java.util.concurrent.ThreadPoolExecutor$Worker.run(ThreadPoolExecutor.java:908)
+	at java.lang.Thread.run(Thread.java:680)
+Caused by: org.osgi.service.blueprint.container.ComponentDefinitionException: The service implementation does not implement the required interfaces: [org.osgi.test.cases.blueprint.services.TestServiceOne]
+	at org.apache.aries.blueprint.container.ServiceRecipe.validateClasses(ServiceRecipe.java:338)
+	at org.apache.aries.blueprint.container.ServiceRecipe.createService(ServiceRecipe.java:287)
+	... 31 more
+
+ </div>
+</pre>
+</td><td>1</td><td>0</td><td><img src="http://www.osgi.org/www/info.png" onclick="toggle('testInterfacelessReference')" title="Show Exceptions"></td>
+</tr>
+<tr>
+<td width="15px" class="
+                                        ok
+                                    "></td><td class="code">testRegistrationListenerInitialState</td><td>0</td><td>0</td><td></td>
+</tr>
+<tr>
+<td width="15px" class="
+                                        ok
+                                    "></td><td class="code">testStartComponentDefault</td><td>0</td><td>0</td><td></td>
+</tr>
+<tr>
+<td width="15px" class="
+                                        ok
+                                    "></td><td class="code">testWildcardHeader</td><td>0</td><td>0</td><td></td>
+</tr>
+<tr>
+<td width="15px" class="
+                                        ok
+                                    "></td><td class="code">testStartComponentMultiple</td><td>0</td><td>0</td><td></td>
+</tr>
+<tr>
+<td width="15px" class="
+                                        ok
+                                    "></td><td class="code">testStartComponentExplicit</td><td>0</td><td>0</td><td></td>
+</tr>
+<tr>
+<td width="15px" class="
+                                        ok
+                                    "></td><td class="code">testStartComponentAttributes</td><td>0</td><td>0</td><td></td>
+</tr>
+<tr>
+<td width="15px" class="
+                                        ok
+                                    "></td><td class="code">testSinglePathMultipleDir</td><td>0</td><td>0</td><td></td>
+</tr>
+<tr>
+<td width="15px" class="
+                                        ok
+                                    "></td><td class="code">testMultiplePathMultipleDir</td><td>0</td><td>0</td><td></td>
+</tr>
+<tr>
+<td width="15px" class="
+                                        ok
+                                    "></td><td class="code">testStartComponentAttributes2</td><td>0</td><td>0</td><td></td>
+</tr>
+<tr>
+<td width="15px" class="
+                                        ok
+                                    "></td><td class="code">testStartComponentDifferentDir</td><td>0</td><td>0</td><td></td>
+</tr>
+<tr>
+<td width="15px" class="
+                                        ok
+                                    "></td><td class="code">testStartComponentDirOnly</td><td>0</td><td>0</td><td></td>
+</tr>
+<tr>
+<td width="15px" class="
+                                        ok
+                                    "></td><td class="code">testNoNameDefault</td><td>0</td><td>0</td><td></td>
+</tr>
+<tr>
+<td width="15px" class="
+                                        ok
+                                    "></td><td class="code">testInitDestroy</td><td>0</td><td>0</td><td></td>
+</tr>
+<tr>
+<td width="15px" class="
+                                        ok
+                                    "></td><td class="code">testStaticFactory</td><td>0</td><td>0</td><td></td>
+</tr>
+<tr>
+<td width="15px" class="
+                                        ok
+                                    "></td><td class="code">testPrimitiveStaticFactory</td><td>0</td><td>0</td><td></td>
+</tr>
+<tr>
+<td width="15px" class="
+                                        ok
+                                    "></td><td class="code">testComponentFactory</td><td>0</td><td>0</td><td></td>
+</tr>
+<tr>
+<td width="15px" class="
+                                        ok
+                                    "></td><td class="code">testServiceFactory</td><td>0</td><td>0</td><td></td>
+</tr>
+<tr>
+<td width="15px" class="
+                                        ok
+                                    "></td><td class="code">testPrimitiveInstanceFactory</td><td>0</td><td>0</td><td></td>
+</tr>
+<tr>
+<td width="15px" class="
+                                        ok
+                                    "></td><td class="code">testModuleContextAware</td><td>0</td><td>0</td><td></td>
+</tr>
+<tr>
+<td width="15px" class="
+                                        ok
+                                    "></td><td class="code">testComponentIdCase</td><td>0</td><td>0</td><td></td>
+</tr>
+<tr>
+<td width="15px" class="
+                                        ok
+                                    "></td><td class="code">testBlueprintId</td><td>0</td><td>0</td><td></td>
+</tr>
+<tr>
+<td width="15px" class="
+                                        ok
+                                    "></td><td class="code">testNonBlueprintBundle</td><td>0</td><td>0</td><td></td>
+</tr>
+<tr>
+<td width="15px" class="
+                                        ok
+                                    "></td><td class="code">testNonBlueprintBundleEmptyDir</td><td>0</td><td>0</td><td></td>
+</tr>
+<tr>
+<td width="15px" class="
+                                        ok
+                                    "></td><td class="code">testBlueprintBundleWildcardNoMatch</td><td>0</td><td>0</td><td></td>
+</tr>
+<tr>
+<td width="15px" class="
+                                        ok
+                                    "></td><td class="code">testEmptyBlueprintBundleHeader</td><td>0</td><td>0</td><td></td>
+</tr>
+<tr>
+<td width="15px" class="
+                                        ok
+                                    "></td><td class="code">testIncompatibleVersion</td><td>0</td><td>0</td><td></td>
+</tr>
+<tr>
+<td width="15px" class="
+                                        ok
+                                    "></td><td class="code">testBlueprintListenerReplay</td><td>0</td><td>0</td><td></td>
+</tr>
+<tr>
+<td width="15px" class="
+                                        ok
+                                    "></td><td class="code">testFragmentDefault</td><td>0</td><td>0</td><td></td>
+</tr>
+<tr>
+<td width="15px" class="
+                                        ok
+                                    "></td><td class="code">testConcreteClassImport</td><td>0</td><td>0</td><td></td>
+</tr>
+<tr>
+<td width="15px" class="
+                                        ok
+                                    "></td><td class="code">testNoConfigFile</td><td>0</td><td>0</td><td></td>
+</tr>
+<tr>
+<td width="15px" class="
+                                        ok
+                                    "></td><td class="code">testMissingConfigFile</td><td>0</td><td>0</td><td></td>
+</tr>
+<tr>
+<td width="15px" class="
+                                        ok
+                                    "></td><td class="code">testDuplicateComponentName</td><td>0</td><td>0</td><td></td>
+</tr>
+<tr>
+<td width="15px" class="
+                                        ok
+                                    "></td><td class="code">testMissingComponentClass</td><td>0</td><td>0</td><td></td>
+</tr>
+<tr>
+<td width="15px" class="
+                                        ok
+                                    "></td><td class="code">testNoComponentClass</td><td>0</td><td>0</td><td></td>
+</tr>
+<tr>
+<td width="15px" class="
+                                        ok
+                                    "></td><td class="code">testStaticFactoryMissingClass</td><td>0</td><td>0</td><td></td>
+</tr>
+<tr>
+<td width="15px" class="
+                                        ok
+                                    "></td><td class="code">testStaticFactoryMissingMethod</td><td>0</td><td>0</td><td></td>
+</tr>
+<tr>
+<td width="15px" class="
+                                        ok
+                                    "></td><td class="code">testStaticFactoryNonPublicClass</td><td>0</td><td>0</td><td></td>
+</tr>
+<tr>
+<td width="15px" class="
+                                        ok
+                                    "></td><td class="code">testStaticFactoryNonPublicMethod</td><td>0</td><td>0</td><td></td>
+</tr>
+<tr>
+<td width="15px" class="
+                                        ok
+                                    "></td><td class="code">testStaticFactoryNonStaticMethod</td><td>0</td><td>0</td><td></td>
+</tr>
+<tr>
+<td width="15px" class="
+                                        ok
+                                    "></td><td class="code">testStaticFactoryNoClass</td><td>0</td><td>0</td><td></td>
+</tr>
+<tr>
+<td width="15px" class="
+                                        ok
+                                    "></td><td class="code">testInstanceFactoryMissingMethod</td><td>0</td><td>0</td><td></td>
+</tr>
+<tr>
+<td width="15px" class="
+                                        ok
+                                    "></td><td class="code">testInstanceFactoryNoMethod</td><td>0</td><td>0</td><td></td>
+</tr>
+<tr>
+<td width="15px" class="
+                                        ok
+                                    "></td><td class="code">testStaticFactoryNoComponent</td><td>0</td><td>0</td><td></td>
+</tr>
+<tr>
+<td width="15px" class="
+                                        ok
+                                    "></td><td class="code">testConstructorException</td><td>0</td><td>0</td><td></td>
+</tr>
+<tr>
+<td width="15px" class="
+                                        ok
+                                    "></td><td class="code">testLazyConstructorException</td><td>0</td><td>0</td><td></td>
+</tr>
+<tr>
+<td width="15px" class="
+                                        ok
+                                    "></td><td class="code">testInstanceFactoryException</td><td>0</td><td>0</td><td></td>
+</tr>
+<tr>
+<td width="15px" class="
+                                        ok
+                                    "></td><td class="code">testStaticFactoryException</td><td>0</td><td>0</td><td></td>
+</tr>
+<tr>
+<td width="15px" class="
+                                        ok
+                                    "></td><td class="code">testPropertyException</td><td>0</td><td>0</td><td></td>
+</tr>
+<tr>
+<td width="15px" class="
+                                        ok
+                                    "></td><td class="code">testInitMethodException</td><td>0</td><td>0</td><td></td>
+</tr>
+<tr>
+<td width="15px" class="
+                                        ok
+                                    "></td><td class="code">testDestroyMethodException</td><td>0</td><td>0</td><td></td>
+</tr>
+<tr>
+<td width="15px" class="
+                                        ok
+                                    "></td><td class="code">testNoConstructorMatch</td><td>0</td><td>0</td><td></td>
+</tr>
+<tr>
+<td width="15px" class="
+                                        ok
+                                    "></td><td class="code">testConstructorTypeMismatch</td><td>0</td><td>0</td><td></td>
+</tr>
+<tr>
+<td width="15px" class="
+                                        ok
+                                    "></td><td class="code">testConstructorInvalidType</td><td>0</td><td>0</td><td></td>
+</tr>
+<tr>
+<td width="15px" class="
+                                        ok
+                                    "></td><td class="code">testConstructorNonPrivate</td><td>0</td><td>0</td><td></td>
+</tr>
+<tr>
+<td width="15px" class="
+                                        ok
+                                    "></td><td class="code">testConversionError</td><td>0</td><td>0</td><td></td>
+</tr>
+<tr>
+<td width="15px" class="
+                                        ok
+                                    "></td><td class="code">testIncompatibleType</td><td>0</td><td>0</td><td></td>
+</tr>
+<tr>
+<td width="15px" class="
+                                        ok
+                                    "></td><td class="code">testConversionServiceError</td><td>0</td><td>0</td><td></td>
+</tr>
+<tr>
+<td width="15px" class="
+                                        ok
+                                    "></td><td class="code">testConversionServiceOverrideError</td><td>0</td><td>0</td><td></td>
+</tr>
+<tr>
+<td width="15px" class="
+                                        ok
+                                    "></td><td class="code">testTypeConverterError</td><td>0</td><td>0</td><td></td>
+</tr>
+<tr>
+<td width="15px" class="
+                                        ok
+                                    "></td><td class="code">testMissingReferenceError</td><td>0</td><td>0</td><td></td>
+</tr>
+<tr>
+<td width="15px" class="
+                                        ok
+                                    "></td><td class="code">testMissingIdrefError</td><td>0</td><td>0</td><td></td>
+</tr>
+<tr>
+<td width="15px" class="
+                                        ok
+                                    "></td><td class="code">testCircularReferenceError</td><td>0</td><td>0</td><td></td>
+</tr>
+<tr>
+<td width="15px" class="
+                                        ok
+                                    "></td><td class="code">testPrimitiveNull</td><td>0</td><td>0</td><td></td>
+</tr>
+<tr>
+<td width="15px" class="
+                                        ok
+                                    "></td><td class="code">testMissingProperty</td><td>0</td><td>0</td><td></td>
+</tr>
+<tr>
+<td width="15px" class="
+                                        ok
+                                    "></td><td class="code">testProtectedProperty</td><td>0</td><td>0</td><td></td>
+</tr>
+<tr>
+<td width="15px" class="
+                                        ok
+                                    "></td><td class="code">testPrivateProperty</td><td>0</td><td>0</td><td></td>
+</tr>
+<tr>
+<td width="15px" class="
+                                        ok
+                                    "></td><td class="code">testBadProperty</td><td>0</td><td>0</td><td></td>
+</tr>
+<tr>
+<td width="15px" class="
+                                        ok
+                                    "></td><td class="code">testSkippedIndex</td><td>0</td><td>0</td><td></td>
+</tr>
+<tr>
+<td width="15px" class="
+                                        ok
+                                    "></td><td class="code">testDuplicateIndex</td><td>0</td><td>0</td><td></td>
+</tr>
+<tr>
+<td width="15px" class="
+                                        ok
+                                    "></td><td class="code">testPartialIndex</td><td>0</td><td>0</td><td></td>
+</tr>
+<tr>
+<td width="15px" class="
+                                        ok
+                                    "></td><td class="code">testInitNoMethod</td><td>0</td><td>0</td><td></td>
+</tr>
+<tr>
+<td width="15px" class="
+                                        ok
+                                    "></td><td class="code">testDestroyNoMethod</td><td>0</td><td>0</td><td></td>
+</tr>
+<tr>
+<td width="15px" class="
+                                        ok
+                                    "></td><td class="code">testInitBadMethod</td><td>0</td><td>0</td><td></td>
+</tr>
+<tr>
+<td width="15px" class="
+                                        ok
+                                    "></td><td class="code">testDestroyBadMethod</td><td>0</td><td>0</td><td></td>
+</tr>
+<tr>
+<td width="15px" class="
+                                        ok
+                                    "></td><td class="code">testServiceBadComponent</td><td>0</td><td>0</td><td></td>
+</tr>
+<tr>
+<td width="15px" class="
+                                        ok
+                                    "></td><td class="code">testServiceBadInterface</td><td>0</td><td>0</td><td></td>
+</tr>
+<tr>
+<td width="15px" class="
+                                        ok
+                                    "></td><td class="code">testServiceNoComponent</td><td>0</td><td>0</td><td></td>
+</tr>
+<tr>
+<td width="15px" class="
+                                        ok
+                                    "></td><td class="code">testServiceNoInterface</td><td>0</td><td>0</td><td></td>
+</tr>
+<tr>
+<td width="15px" class="
+                                        ok
+                                    "></td><td class="code">testServiceWrongInterface</td><td>0</td><td>0</td><td></td>
+</tr>
+<tr>
+<td width="15px" class="
+                                        ok
+                                    "></td><td class="code">testServiceDupInterface</td><td>0</td><td>0</td><td></td>
+</tr>
+<tr>
+<td width="15px" class="
+                                        ok
+                                    "></td><td class="code">testServiceListenerBadComponent</td><td>0</td><td>0</td><td></td>
+</tr>
+<tr>
+<td width="15px" class="
+                                        ok
+                                    "></td><td class="code">testServiceListenerBadRegister</td><td>0</td><td>0</td><td></td>
+</tr>
+<tr>
+<td width="15px" class="
+                                        ok
+                                    "></td><td class="code">testServiceListenerBadUnregister</td><td>0</td><td>0</td><td></td>
+</tr>
+<tr>
+<td width="15px" class="
+                                        ok
+                                    "></td><td class="code">testServiceListenerNonPublicRegistered</td><td>0</td><td>0</td><td></td>
+</tr>
+<tr>
+<td width="15px" class="
+                                        ok
+                                    "></td><td class="code">testServiceListenerNonPublicUnregistered</td><td>0</td><td>0</td><td></td>
+</tr>
+<tr>
+<td width="15px" class="
+                                        ok
+                                    "></td><td class="code">testServiceListenerNoComponent</td><td>0</td><td>0</td><td></td>
+</tr>
+<tr>
+<td width="15px" class="
+                                        ok
+                                    "></td><td class="code">testServiceListenerNoMethods</td><td>0</td><td>0</td><td></td>
+</tr>
+<tr>
+<td width="15px" class="
+                                        ok
+                                    "></td><td class="code">testServiceListenerNoRegister</td><td>0</td><td>0</td><td></td>
+</tr>
+<tr>
+<td width="15px" class="
+                                        ok
+                                    "></td><td class="code">testServiceListenerRefInline</td><td>0</td><td>0</td><td></td>
+</tr>
+<tr>
+<td width="15px" class="
+                                        ok
+                                    "></td><td class="code">testServiceListenerNoUnregister</td><td>0</td><td>0</td><td></td>
+</tr>
+<tr>
+<td width="15px" class="
+                                        ok
+                                    "></td><td class="code">testComponentBadDependson</td><td>0</td><td>0</td><td></td>
+</tr>
+<tr>
+<td width="15px" class="
+                                        ok
+                                    "></td><td class="code">testServiceBadDependson</td><td>0</td><td>0</td><td></td>
+</tr>
+<tr>
+<td width="15px" class="
+                                        ok
+                                    "></td><td class="code">testReferenceBadInterface</td><td>0</td><td>0</td><td></td>
+</tr>
+<tr>
+<td width="15px" class="
+                                        ok
+                                    "></td><td class="code">testRefListBadInterface</td><td>0</td><td>0</td><td></td>
+</tr>
+<tr>
+<td width="15px" class="
+                                        ok
+                                    "></td><td class="code">testReferenceListenerBadComponent</td><td>0</td><td>0</td><td></td>
+</tr>
+<tr>
+<td width="15px" class="
+                                        ok
+                                    "></td><td class="code">testReferenceListenerBadBind</td><td>0</td><td>0</td><td></td>
+</tr>
+<tr>
+<td width="15px" class="
+                                        ok
+                                    "></td><td class="code">testReferenceListenerBadUnbind</td><td>0</td><td>0</td><td></td>
+</tr>
+<tr>
+<td width="15px" class="
+                                        ok
+                                    "></td><td class="code">testReferenceListenerNonPublicBind</td><td>0</td><td>0</td><td></td>
+</tr>
+<tr>
+<td width="15px" class="
+                                        ok
+                                    "></td><td class="code">testReferenceListenerNonPublicUnbind</td><td>0</td><td>0</td><td></td>
+</tr>
+<tr>
+<td width="15px" class="
+                                        ok
+                                    "></td><td class="code">testReferenceListenerNoComponent</td><td>0</td><td>0</td><td></td>
+</tr>
+<tr>
+<td width="15px" class="
+                                        ok
+                                    "></td><td class="code">testReferenceListenerNoMethods</td><td>0</td><td>0</td><td></td>
+</tr>
+<tr>
+<td width="15px" class="
+                                        ok
+                                    "></td><td class="code">testReferenceListenerNobind</td><td>0</td><td>0</td><td></td>
+</tr>
+<tr>
+<td width="15px" class="
+                                        ok
+                                    "></td><td class="code">testReferenceListenerNoUnbind</td><td>0</td><td>0</td><td></td>
+</tr>
+<tr>
+<td width="15px" class="
+                                        ok
+                                    "></td><td class="code">testMapBadKeyRef</td><td>0</td><td>0</td><td></td>
+</tr>
+<tr>
+<td width="15px" class="
+                                        ok
+                                    "></td><td class="code">testMapBadValueRef</td><td>0</td><td>0</td><td></td>
+</tr>
+<tr>
+<td width="15px" class="
+                                        ok
+                                    "></td><td class="code">testMapBadValueType</td><td>0</td><td>0</td><td></td>
+</tr>
+<tr>
+<td width="15px" class="
+                                        ok
+                                    "></td><td class="code">testMapBadKeyType</td><td>0</td><td>0</td><td></td>
+</tr>
+<tr>
+<td width="15px" class="
+                                        ok
+                                    "></td><td class="code">testMapPrimitiveKeyType</td><td>0</td><td>0</td><td></td>
+</tr>
+<tr>
+<td width="15px" class="
+                                        ok
+                                    "></td><td class="code">testMapDupValueRef</td><td>0</td><td>0</td><td></td>
+</tr>
+<tr>
+<td width="15px" class="
+                                        ok
+                                    "></td><td class="code">testMapDupKeyRef</td><td>0</td><td>0</td><td></td>
+</tr>
+<tr>
+<td width="15px" class="
+                                        ok
+                                    "></td><td class="code">testMapDupKey</td><td>0</td><td>0</td><td></td>
+</tr>
+<tr>
+<td width="15px" class="
+                                        ok
+                                    "></td><td class="code">testMapDupValue</td><td>0</td><td>0</td><td></td>
+</tr>
+<tr>
+<td width="15px" class="
+                                        ok
+                                    "></td><td class="code">testListBadValueRef</td><td>0</td><td>0</td><td></td>
+</tr>
+<tr>
+<td width="15px" class="
+                                        ok
+                                    "></td><td class="code">testConverterWrongType</td><td>0</td><td>0</td><td></td>
+</tr>
+<tr>
+<td width="15px" class="
+                                        ok
+                                    "></td><td class="code">testAmbiguousConstructor</td><td>0</td><td>0</td><td></td>
+</tr>
+<tr>
+<td width="15px" class="
+                                        ok
+                                    "></td><td class="code">testAmbiguousFactoryConstructor</td><td>0</td><td>0</td><td></td>
+</tr>
+<tr>
+<td width="15px" class="
+                                        ok
+                                    "></td><td class="code">testAmbiguousStaticFactoryConstructor</td><td>0</td><td>0</td><td></td>
+</tr>
+<tr>
+<td width="15px" class="
+                                        ok

[... 1644 lines stripped ...]


Mime
View raw message