aries-commits mailing list archives

Site index · List index
Message view « Date » · « Thread »
Top « Date » · « Thread »
From build...@apache.org
Subject svn commit: r782169 [9/16] - in /websites/staging/aries/trunk/content: ./ community/ development/ documentation/ documentation/tutorials/ downloads/ downloads/archived-releases/ downloads/ct/ downloads/ct/current-release/ images/ modules/ modules/sampl...
Date Wed, 05 Jan 2011 19:38:06 GMT
Added: websites/staging/aries/trunk/content/downloads/ct/current-release/org.osgi.test.cases.jmx.html
==============================================================================
--- websites/staging/aries/trunk/content/downloads/ct/current-release/org.osgi.test.cases.jmx.html (added)
+++ websites/staging/aries/trunk/content/downloads/ct/current-release/org.osgi.test.cases.jmx.html Wed Jan  5 19:38:03 2011
@@ -0,0 +1,2258 @@
+<html>
+<head>
+<META http-equiv="Content-Type" content="text/html; charset=UTF-8">
+<title>Test</title>
+<link rel="stylesheet" href="http://www.osgi.org/www/osgi.css" type="text/css">
+<style type="text/css">
+					.code { font-family: Courier,
+					sans-serif; }
+					.error,.ok, .info,
+					.warning {
+					background-position: 4 4;
+					background-repeat:no-repeat;
+					width:10px; }
+					.ok {
+					background-image:url("http://www.osgi.org/www/greenball.png"); }
+					.warning {
+					background-image:url("http://www.osgi.org/www/orangeball.png"); }
+					.error {
+					background-image:url("http://www.osgi.org/www/redball.png"); }
+					.info {
+					background-image:url("http://www.osgi.org/www/info.png"); }
+					.class { padding-top:20px; padding-bottom: 10px; font-size:12;
+					font-weight:bold; }
+
+					h2 { margin-top : 20px; margin-bottom:10px; }
+					table, th, td { border: 1px solid black; padding:5px; }
+					table {
+					border-collapse:collapse; width:100%; margin-top:20px;}
+					th { height:20px; }
+					} 
+				</style>
+<script language="javascript">
+					function toggle(name) {
+					var el =
+					document.getElementById(name);
+					if ( el.style.display != 'none' ) {
+					el.style.display = 'none';
+					}
+					else {
+					el.style.display = '';
+					}
+					}				
+				</script>
+</head>
+<body style="width:800px">
+<h2>Summary</h2>
+<p>The following table provides a sumary of the test information.</p>
+<table>
+<tr>
+<th>Property Key</th><th>Property Value</th>
+</tr>
+<tr>
+<td width="50%">Target</td><td>/Users/zoe/Workspaces/aries/ComplianceTests/ApacheAriesTests/jar/org.osgi.test.cases.jmx-4.2.0.jar</td>
+</tr>
+<tr>
+<td width="50%">Framework</td><td>org.eclipse.osgi.launch.Equinox@fb6354</td>
+</tr>
+<tr>
+<td width="50%">Testrun</td><td>Wed Sep 01 20:28:48 BST 2010</td>
+</tr>
+<tr>
+<th colspan="2">Bundles</th>
+</tr>
+<tr>
+<td>org.eclipse.osgi</td><td>3.5.0.v20090520</td>
+</tr>
+<tr>
+<td>org.apache.felix.configadmin</td><td>1.2.4</td>
+</tr>
+<tr>
+<td>org.apache.aries.jmx</td><td>0.2.0.incubating</td>
+</tr>
+<tr>
+<td>org.knopflerfish.bundle.useradmin</td><td>3.0.1</td>
+</tr>
+<tr>
+<td>org.knopflerfish.log-API</td><td>3.0.1</td>
+</tr>
+<tr>
+<td>org.apache.felix.log</td><td>1.0.0</td>
+</tr>
+<tr>
+<td>osgi.cmpn</td><td>4.2.0.200908310645</td>
+</tr>
+<tr>
+<td>org.eclipse.equinox.ip</td><td>1.1.100.v20100503</td>
+</tr>
+<tr>
+<td>org.eclipse.equinox.util</td><td>1.0.200.v20100503</td>
+</tr>
+<tr>
+<td>org.apache.felix.http.bundle</td><td>2.0.4</td>
+</tr>
+<tr>
+<td>org.osgi.test.cases.jmx</td><td>4.2.0.201004301238</td>
+</tr>
+</table>
+<h2>Testcases</h2>
+<p>The following table shows the results of each test. A red icon indicates that the 
+					test failed or had an error. A green icon
+					indicates success. Any errors or failure messages 
+					will be displayed as a list beneath the test name. To see the 
+					exception, click on the info icon on the right.</p>
+<table width="100%">
+<tr>
+<th width="15px"><img src="http://www.osgi.org/www/colorball.png" title="Status. red=bad, orange=almost good, green is perfect"></th><th>Test</th><th>Failures</th><th>Error</th><th>Info</th>
+</tr>
+<tr>
+<td width="15px" class="
+                                        warning
+                                    "></td><td class="code">testConfigurationGetBundleLocation<ul>
+<li></li>
+</ul>
+<pre id="testConfigurationGetBundleLocation" style="display:none">
+<div class="code">
+
+java.io.IOException: Invalid TabularType [javax.management.openmbean.TabularType(name=Properties,rowType=javax.management.openmbean.CompositeType(name=Property,items=((itemName=Key,itemType=javax.management.openmbean.SimpleType(name=java.lang.String)),(itemName=Type,itemType=javax.management.openmbean.SimpleType(name=java.lang.String)),(itemName=Value,itemType=javax.management.openmbean.SimpleType(name=java.lang.String)))),indexNames=(Key))]
+	at org.apache.aries.jmx.cm.ConfigurationAdmin.updateForLocation(ConfigurationAdmin.java:225)
+	at sun.reflect.NativeMethodAccessorImpl.invoke0(Native Method)
+	at sun.reflect.NativeMethodAccessorImpl.invoke(NativeMethodAccessorImpl.java:39)
+	at sun.reflect.DelegatingMethodAccessorImpl.invoke(DelegatingMethodAccessorImpl.java:25)
+	at java.lang.reflect.Method.invoke(Method.java:597)
+	at com.sun.jmx.mbeanserver.StandardMBeanIntrospector.invokeM2(StandardMBeanIntrospector.java:93)
+	at com.sun.jmx.mbeanserver.StandardMBeanIntrospector.invokeM2(StandardMBeanIntrospector.java:27)
+	at com.sun.jmx.mbeanserver.MBeanIntrospector.invokeM(MBeanIntrospector.java:208)
+	at com.sun.jmx.mbeanserver.PerInterface.invoke(PerInterface.java:120)
+	at com.sun.jmx.mbeanserver.MBeanSupport.invoke(MBeanSupport.java:262)
+	at javax.management.StandardMBean.invoke(StandardMBean.java:391)
+	at com.sun.jmx.interceptor.DefaultMBeanServerInterceptor.invoke(DefaultMBeanServerInterceptor.java:836)
+	at com.sun.jmx.mbeanserver.JmxMBeanServer.invoke(JmxMBeanServer.java:761)
+	at javax.management.MBeanServerInvocationHandler.invoke(MBeanServerInvocationHandler.java:288)
+	at $Proxy0.updateForLocation(Unknown Source)
+	at org.osgi.test.cases.jmx.junit.ConfigurationAdminMBeanTestCase.testConfigurationGetBundleLocation(ConfigurationAdminMBeanTestCase.java:46)
+	at sun.reflect.NativeMethodAccessorImpl.invoke0(Native Method)
+	at sun.reflect.NativeMethodAccessorImpl.invoke(NativeMethodAccessorImpl.java:39)
+	at sun.reflect.DelegatingMethodAccessorImpl.invoke(DelegatingMethodAccessorImpl.java:25)
+	at java.lang.reflect.Method.invoke(Method.java:597)
+	at junit.framework.TestCase.runTest(TestCase.java:164)
+	at junit.framework.TestCase.runBare(TestCase.java:130)
+	at junit.framework.TestResult$1.protect(TestResult.java:106)
+	at junit.framework.TestResult.runProtected(TestResult.java:124)
+	at junit.framework.TestResult.run(TestResult.java:109)
+	at junit.framework.TestCase.run(TestCase.java:120)
+	at junit.framework.TestSuite.runTest(TestSuite.java:230)
+	at junit.framework.TestSuite.run(TestSuite.java:225)
+	at junit.framework.TestSuite.runTest(TestSuite.java:230)
+	at junit.framework.TestSuite.run(TestSuite.java:225)
+	at aQute.junit.runtime.Target.doTesting(Target.java:234)
+	at aQute.junit.runtime.Target.run(Target.java:57)
+	at aQute.junit.runtime.Target.main(Target.java:37)
+
+ </div>
+</pre>
+</td><td>0</td><td>1</td><td><img src="http://www.osgi.org/www/info.png" onclick="toggle('testConfigurationGetBundleLocation')" title="Show Exceptions"></td>
+</tr>
+<tr>
+<td width="15px" class="
+                                        warning
+                                    "></td><td class="code">testConfigurationSetBundleLocation<ul>
+<li></li>
+</ul>
+<pre id="testConfigurationSetBundleLocation" style="display:none">
+<div class="code">
+
+java.io.IOException: Invalid TabularType [javax.management.openmbean.TabularType(name=Properties,rowType=javax.management.openmbean.CompositeType(name=Property,items=((itemName=Key,itemType=javax.management.openmbean.SimpleType(name=java.lang.String)),(itemName=Type,itemType=javax.management.openmbean.SimpleType(name=java.lang.String)),(itemName=Value,itemType=javax.management.openmbean.SimpleType(name=java.lang.String)))),indexNames=(Key))]
+	at org.apache.aries.jmx.cm.ConfigurationAdmin.updateForLocation(ConfigurationAdmin.java:225)
+	at org.apache.aries.jmx.cm.ConfigurationAdmin.update(ConfigurationAdmin.java:209)
+	at sun.reflect.NativeMethodAccessorImpl.invoke0(Native Method)
+	at sun.reflect.NativeMethodAccessorImpl.invoke(NativeMethodAccessorImpl.java:39)
+	at sun.reflect.DelegatingMethodAccessorImpl.invoke(DelegatingMethodAccessorImpl.java:25)
+	at java.lang.reflect.Method.invoke(Method.java:597)
+	at com.sun.jmx.mbeanserver.StandardMBeanIntrospector.invokeM2(StandardMBeanIntrospector.java:93)
+	at com.sun.jmx.mbeanserver.StandardMBeanIntrospector.invokeM2(StandardMBeanIntrospector.java:27)
+	at com.sun.jmx.mbeanserver.MBeanIntrospector.invokeM(MBeanIntrospector.java:208)
+	at com.sun.jmx.mbeanserver.PerInterface.invoke(PerInterface.java:120)
+	at com.sun.jmx.mbeanserver.MBeanSupport.invoke(MBeanSupport.java:262)
+	at javax.management.StandardMBean.invoke(StandardMBean.java:391)
+	at com.sun.jmx.interceptor.DefaultMBeanServerInterceptor.invoke(DefaultMBeanServerInterceptor.java:836)
+	at com.sun.jmx.mbeanserver.JmxMBeanServer.invoke(JmxMBeanServer.java:761)
+	at javax.management.MBeanServerInvocationHandler.invoke(MBeanServerInvocationHandler.java:288)
+	at $Proxy0.update(Unknown Source)
+	at org.osgi.test.cases.jmx.junit.ConfigurationAdminMBeanTestCase.testConfigurationSetBundleLocation(ConfigurationAdminMBeanTestCase.java:61)
+	at sun.reflect.NativeMethodAccessorImpl.invoke0(Native Method)
+	at sun.reflect.NativeMethodAccessorImpl.invoke(NativeMethodAccessorImpl.java:39)
+	at sun.reflect.DelegatingMethodAccessorImpl.invoke(DelegatingMethodAccessorImpl.java:25)
+	at java.lang.reflect.Method.invoke(Method.java:597)
+	at junit.framework.TestCase.runTest(TestCase.java:164)
+	at junit.framework.TestCase.runBare(TestCase.java:130)
+	at junit.framework.TestResult$1.protect(TestResult.java:106)
+	at junit.framework.TestResult.runProtected(TestResult.java:124)
+	at junit.framework.TestResult.run(TestResult.java:109)
+	at junit.framework.TestCase.run(TestCase.java:120)
+	at junit.framework.TestSuite.runTest(TestSuite.java:230)
+	at junit.framework.TestSuite.run(TestSuite.java:225)
+	at junit.framework.TestSuite.runTest(TestSuite.java:230)
+	at junit.framework.TestSuite.run(TestSuite.java:225)
+	at aQute.junit.runtime.Target.doTesting(Target.java:234)
+	at aQute.junit.runtime.Target.run(Target.java:57)
+	at aQute.junit.runtime.Target.main(Target.java:37)
+
+ </div>
+</pre>
+</td><td>0</td><td>1</td><td><img src="http://www.osgi.org/www/info.png" onclick="toggle('testConfigurationSetBundleLocation')" title="Show Exceptions"></td>
+</tr>
+<tr>
+<td width="15px" class="
+                                        warning
+                                    "></td><td class="code">testConfigurationUpdate<ul>
+<li></li>
+</ul>
+<pre id="testConfigurationUpdate" style="display:none">
+<div class="code">
+
+java.io.IOException: Invalid TabularType [javax.management.openmbean.TabularType(name=Properties,rowType=javax.management.openmbean.CompositeType(name=Property,items=((itemName=Key,itemType=javax.management.openmbean.SimpleType(name=java.lang.String)),(itemName=Type,itemType=javax.management.openmbean.SimpleType(name=java.lang.String)),(itemName=Value,itemType=javax.management.openmbean.SimpleType(name=java.lang.String)))),indexNames=(Key))]
+	at org.apache.aries.jmx.cm.ConfigurationAdmin.updateForLocation(ConfigurationAdmin.java:225)
+	at sun.reflect.NativeMethodAccessorImpl.invoke0(Native Method)
+	at sun.reflect.NativeMethodAccessorImpl.invoke(NativeMethodAccessorImpl.java:39)
+	at sun.reflect.DelegatingMethodAccessorImpl.invoke(DelegatingMethodAccessorImpl.java:25)
+	at java.lang.reflect.Method.invoke(Method.java:597)
+	at com.sun.jmx.mbeanserver.StandardMBeanIntrospector.invokeM2(StandardMBeanIntrospector.java:93)
+	at com.sun.jmx.mbeanserver.StandardMBeanIntrospector.invokeM2(StandardMBeanIntrospector.java:27)
+	at com.sun.jmx.mbeanserver.MBeanIntrospector.invokeM(MBeanIntrospector.java:208)
+	at com.sun.jmx.mbeanserver.PerInterface.invoke(PerInterface.java:120)
+	at com.sun.jmx.mbeanserver.MBeanSupport.invoke(MBeanSupport.java:262)
+	at javax.management.StandardMBean.invoke(StandardMBean.java:391)
+	at com.sun.jmx.interceptor.DefaultMBeanServerInterceptor.invoke(DefaultMBeanServerInterceptor.java:836)
+	at com.sun.jmx.mbeanserver.JmxMBeanServer.invoke(JmxMBeanServer.java:761)
+	at javax.management.MBeanServerInvocationHandler.invoke(MBeanServerInvocationHandler.java:288)
+	at $Proxy0.updateForLocation(Unknown Source)
+	at org.osgi.test.cases.jmx.junit.ConfigurationAdminMBeanTestCase.testConfigurationUpdate(ConfigurationAdminMBeanTestCase.java:74)
+	at sun.reflect.NativeMethodAccessorImpl.invoke0(Native Method)
+	at sun.reflect.NativeMethodAccessorImpl.invoke(NativeMethodAccessorImpl.java:39)
+	at sun.reflect.DelegatingMethodAccessorImpl.invoke(DelegatingMethodAccessorImpl.java:25)
+	at java.lang.reflect.Method.invoke(Method.java:597)
+	at junit.framework.TestCase.runTest(TestCase.java:164)
+	at junit.framework.TestCase.runBare(TestCase.java:130)
+	at junit.framework.TestResult$1.protect(TestResult.java:106)
+	at junit.framework.TestResult.runProtected(TestResult.java:124)
+	at junit.framework.TestResult.run(TestResult.java:109)
+	at junit.framework.TestCase.run(TestCase.java:120)
+	at junit.framework.TestSuite.runTest(TestSuite.java:230)
+	at junit.framework.TestSuite.run(TestSuite.java:225)
+	at junit.framework.TestSuite.runTest(TestSuite.java:230)
+	at junit.framework.TestSuite.run(TestSuite.java:225)
+	at aQute.junit.runtime.Target.doTesting(Target.java:234)
+	at aQute.junit.runtime.Target.run(Target.java:57)
+	at aQute.junit.runtime.Target.main(Target.java:37)
+
+ </div>
+</pre>
+</td><td>0</td><td>1</td><td><img src="http://www.osgi.org/www/info.png" onclick="toggle('testConfigurationUpdate')" title="Show Exceptions"></td>
+</tr>
+<tr>
+<td width="15px" class="
+                                        warning
+                                    "></td><td class="code">testConfigurationUpdateForLocation<ul>
+<li></li>
+</ul>
+<pre id="testConfigurationUpdateForLocation" style="display:none">
+<div class="code">
+
+java.io.IOException: Invalid TabularType [javax.management.openmbean.TabularType(name=Properties,rowType=javax.management.openmbean.CompositeType(name=Property,items=((itemName=Key,itemType=javax.management.openmbean.SimpleType(name=java.lang.String)),(itemName=Type,itemType=javax.management.openmbean.SimpleType(name=java.lang.String)),(itemName=Value,itemType=javax.management.openmbean.SimpleType(name=java.lang.String)))),indexNames=(Key))]
+	at org.apache.aries.jmx.cm.ConfigurationAdmin.updateForLocation(ConfigurationAdmin.java:225)
+	at sun.reflect.NativeMethodAccessorImpl.invoke0(Native Method)
+	at sun.reflect.NativeMethodAccessorImpl.invoke(NativeMethodAccessorImpl.java:39)
+	at sun.reflect.DelegatingMethodAccessorImpl.invoke(DelegatingMethodAccessorImpl.java:25)
+	at java.lang.reflect.Method.invoke(Method.java:597)
+	at com.sun.jmx.mbeanserver.StandardMBeanIntrospector.invokeM2(StandardMBeanIntrospector.java:93)
+	at com.sun.jmx.mbeanserver.StandardMBeanIntrospector.invokeM2(StandardMBeanIntrospector.java:27)
+	at com.sun.jmx.mbeanserver.MBeanIntrospector.invokeM(MBeanIntrospector.java:208)
+	at com.sun.jmx.mbeanserver.PerInterface.invoke(PerInterface.java:120)
+	at com.sun.jmx.mbeanserver.MBeanSupport.invoke(MBeanSupport.java:262)
+	at javax.management.StandardMBean.invoke(StandardMBean.java:391)
+	at com.sun.jmx.interceptor.DefaultMBeanServerInterceptor.invoke(DefaultMBeanServerInterceptor.java:836)
+	at com.sun.jmx.mbeanserver.JmxMBeanServer.invoke(JmxMBeanServer.java:761)
+	at javax.management.MBeanServerInvocationHandler.invoke(MBeanServerInvocationHandler.java:288)
+	at $Proxy0.updateForLocation(Unknown Source)
+	at org.osgi.test.cases.jmx.junit.ConfigurationAdminMBeanTestCase.testConfigurationUpdateForLocation(ConfigurationAdminMBeanTestCase.java:86)
+	at sun.reflect.NativeMethodAccessorImpl.invoke0(Native Method)
+	at sun.reflect.NativeMethodAccessorImpl.invoke(NativeMethodAccessorImpl.java:39)
+	at sun.reflect.DelegatingMethodAccessorImpl.invoke(DelegatingMethodAccessorImpl.java:25)
+	at java.lang.reflect.Method.invoke(Method.java:597)
+	at junit.framework.TestCase.runTest(TestCase.java:164)
+	at junit.framework.TestCase.runBare(TestCase.java:130)
+	at junit.framework.TestResult$1.protect(TestResult.java:106)
+	at junit.framework.TestResult.runProtected(TestResult.java:124)
+	at junit.framework.TestResult.run(TestResult.java:109)
+	at junit.framework.TestCase.run(TestCase.java:120)
+	at junit.framework.TestSuite.runTest(TestSuite.java:230)
+	at junit.framework.TestSuite.run(TestSuite.java:225)
+	at junit.framework.TestSuite.runTest(TestSuite.java:230)
+	at junit.framework.TestSuite.run(TestSuite.java:225)
+	at aQute.junit.runtime.Target.doTesting(Target.java:234)
+	at aQute.junit.runtime.Target.run(Target.java:57)
+	at aQute.junit.runtime.Target.main(Target.java:37)
+
+ </div>
+</pre>
+</td><td>0</td><td>1</td><td><img src="http://www.osgi.org/www/info.png" onclick="toggle('testConfigurationUpdateForLocation')" title="Show Exceptions"></td>
+</tr>
+<tr>
+<td width="15px" class="
+                                        warning
+                                    "></td><td class="code">testConfigurationGetProperties<ul>
+<li></li>
+</ul>
+<pre id="testConfigurationGetProperties" style="display:none">
+<div class="code">
+
+java.io.IOException: Invalid TabularType [javax.management.openmbean.TabularType(name=Properties,rowType=javax.management.openmbean.CompositeType(name=Property,items=((itemName=Key,itemType=javax.management.openmbean.SimpleType(name=java.lang.String)),(itemName=Type,itemType=javax.management.openmbean.SimpleType(name=java.lang.String)),(itemName=Value,itemType=javax.management.openmbean.SimpleType(name=java.lang.String)))),indexNames=(Key))]
+	at org.apache.aries.jmx.cm.ConfigurationAdmin.updateForLocation(ConfigurationAdmin.java:225)
+	at sun.reflect.NativeMethodAccessorImpl.invoke0(Native Method)
+	at sun.reflect.NativeMethodAccessorImpl.invoke(NativeMethodAccessorImpl.java:39)
+	at sun.reflect.DelegatingMethodAccessorImpl.invoke(DelegatingMethodAccessorImpl.java:25)
+	at java.lang.reflect.Method.invoke(Method.java:597)
+	at com.sun.jmx.mbeanserver.StandardMBeanIntrospector.invokeM2(StandardMBeanIntrospector.java:93)
+	at com.sun.jmx.mbeanserver.StandardMBeanIntrospector.invokeM2(StandardMBeanIntrospector.java:27)
+	at com.sun.jmx.mbeanserver.MBeanIntrospector.invokeM(MBeanIntrospector.java:208)
+	at com.sun.jmx.mbeanserver.PerInterface.invoke(PerInterface.java:120)
+	at com.sun.jmx.mbeanserver.MBeanSupport.invoke(MBeanSupport.java:262)
+	at javax.management.StandardMBean.invoke(StandardMBean.java:391)
+	at com.sun.jmx.interceptor.DefaultMBeanServerInterceptor.invoke(DefaultMBeanServerInterceptor.java:836)
+	at com.sun.jmx.mbeanserver.JmxMBeanServer.invoke(JmxMBeanServer.java:761)
+	at javax.management.MBeanServerInvocationHandler.invoke(MBeanServerInvocationHandler.java:288)
+	at $Proxy0.updateForLocation(Unknown Source)
+	at org.osgi.test.cases.jmx.junit.ConfigurationAdminMBeanTestCase.testConfigurationGetProperties(ConfigurationAdminMBeanTestCase.java:101)
+	at sun.reflect.NativeMethodAccessorImpl.invoke0(Native Method)
+	at sun.reflect.NativeMethodAccessorImpl.invoke(NativeMethodAccessorImpl.java:39)
+	at sun.reflect.DelegatingMethodAccessorImpl.invoke(DelegatingMethodAccessorImpl.java:25)
+	at java.lang.reflect.Method.invoke(Method.java:597)
+	at junit.framework.TestCase.runTest(TestCase.java:164)
+	at junit.framework.TestCase.runBare(TestCase.java:130)
+	at junit.framework.TestResult$1.protect(TestResult.java:106)
+	at junit.framework.TestResult.runProtected(TestResult.java:124)
+	at junit.framework.TestResult.run(TestResult.java:109)
+	at junit.framework.TestCase.run(TestCase.java:120)
+	at junit.framework.TestSuite.runTest(TestSuite.java:230)
+	at junit.framework.TestSuite.run(TestSuite.java:225)
+	at junit.framework.TestSuite.runTest(TestSuite.java:230)
+	at junit.framework.TestSuite.run(TestSuite.java:225)
+	at aQute.junit.runtime.Target.doTesting(Target.java:234)
+	at aQute.junit.runtime.Target.run(Target.java:57)
+	at aQute.junit.runtime.Target.main(Target.java:37)
+
+ </div>
+</pre>
+</td><td>0</td><td>1</td><td><img src="http://www.osgi.org/www/info.png" onclick="toggle('testConfigurationGetProperties')" title="Show Exceptions"></td>
+</tr>
+<tr>
+<td width="15px" class="
+                                        warning
+                                    "></td><td class="code">testConfigurationGetPropertiesForLocation<ul>
+<li></li>
+</ul>
+<pre id="testConfigurationGetPropertiesForLocation" style="display:none">
+<div class="code">
+
+java.io.IOException: Invalid TabularType [javax.management.openmbean.TabularType(name=Properties,rowType=javax.management.openmbean.CompositeType(name=Property,items=((itemName=Key,itemType=javax.management.openmbean.SimpleType(name=java.lang.String)),(itemName=Type,itemType=javax.management.openmbean.SimpleType(name=java.lang.String)),(itemName=Value,itemType=javax.management.openmbean.SimpleType(name=java.lang.String)))),indexNames=(Key))]
+	at org.apache.aries.jmx.cm.ConfigurationAdmin.updateForLocation(ConfigurationAdmin.java:225)
+	at sun.reflect.NativeMethodAccessorImpl.invoke0(Native Method)
+	at sun.reflect.NativeMethodAccessorImpl.invoke(NativeMethodAccessorImpl.java:39)
+	at sun.reflect.DelegatingMethodAccessorImpl.invoke(DelegatingMethodAccessorImpl.java:25)
+	at java.lang.reflect.Method.invoke(Method.java:597)
+	at com.sun.jmx.mbeanserver.StandardMBeanIntrospector.invokeM2(StandardMBeanIntrospector.java:93)
+	at com.sun.jmx.mbeanserver.StandardMBeanIntrospector.invokeM2(StandardMBeanIntrospector.java:27)
+	at com.sun.jmx.mbeanserver.MBeanIntrospector.invokeM(MBeanIntrospector.java:208)
+	at com.sun.jmx.mbeanserver.PerInterface.invoke(PerInterface.java:120)
+	at com.sun.jmx.mbeanserver.MBeanSupport.invoke(MBeanSupport.java:262)
+	at javax.management.StandardMBean.invoke(StandardMBean.java:391)
+	at com.sun.jmx.interceptor.DefaultMBeanServerInterceptor.invoke(DefaultMBeanServerInterceptor.java:836)
+	at com.sun.jmx.mbeanserver.JmxMBeanServer.invoke(JmxMBeanServer.java:761)
+	at javax.management.MBeanServerInvocationHandler.invoke(MBeanServerInvocationHandler.java:288)
+	at $Proxy0.updateForLocation(Unknown Source)
+	at org.osgi.test.cases.jmx.junit.ConfigurationAdminMBeanTestCase.testConfigurationGetPropertiesForLocation(ConfigurationAdminMBeanTestCase.java:118)
+	at sun.reflect.NativeMethodAccessorImpl.invoke0(Native Method)
+	at sun.reflect.NativeMethodAccessorImpl.invoke(NativeMethodAccessorImpl.java:39)
+	at sun.reflect.DelegatingMethodAccessorImpl.invoke(DelegatingMethodAccessorImpl.java:25)
+	at java.lang.reflect.Method.invoke(Method.java:597)
+	at junit.framework.TestCase.runTest(TestCase.java:164)
+	at junit.framework.TestCase.runBare(TestCase.java:130)
+	at junit.framework.TestResult$1.protect(TestResult.java:106)
+	at junit.framework.TestResult.runProtected(TestResult.java:124)
+	at junit.framework.TestResult.run(TestResult.java:109)
+	at junit.framework.TestCase.run(TestCase.java:120)
+	at junit.framework.TestSuite.runTest(TestSuite.java:230)
+	at junit.framework.TestSuite.run(TestSuite.java:225)
+	at junit.framework.TestSuite.runTest(TestSuite.java:230)
+	at junit.framework.TestSuite.run(TestSuite.java:225)
+	at aQute.junit.runtime.Target.doTesting(Target.java:234)
+	at aQute.junit.runtime.Target.run(Target.java:57)
+	at aQute.junit.runtime.Target.main(Target.java:37)
+
+ </div>
+</pre>
+</td><td>0</td><td>1</td><td><img src="http://www.osgi.org/www/info.png" onclick="toggle('testConfigurationGetPropertiesForLocation')" title="Show Exceptions"></td>
+</tr>
+<tr>
+<td width="15px" class="
+                                        warning
+                                    "></td><td class="code">testConfigurationDelete<ul>
+<li></li>
+</ul>
+<pre id="testConfigurationDelete" style="display:none">
+<div class="code">
+
+java.io.IOException: Invalid TabularType [javax.management.openmbean.TabularType(name=Properties,rowType=javax.management.openmbean.CompositeType(name=Property,items=((itemName=Key,itemType=javax.management.openmbean.SimpleType(name=java.lang.String)),(itemName=Type,itemType=javax.management.openmbean.SimpleType(name=java.lang.String)),(itemName=Value,itemType=javax.management.openmbean.SimpleType(name=java.lang.String)))),indexNames=(Key))]
+	at org.apache.aries.jmx.cm.ConfigurationAdmin.updateForLocation(ConfigurationAdmin.java:225)
+	at sun.reflect.NativeMethodAccessorImpl.invoke0(Native Method)
+	at sun.reflect.NativeMethodAccessorImpl.invoke(NativeMethodAccessorImpl.java:39)
+	at sun.reflect.DelegatingMethodAccessorImpl.invoke(DelegatingMethodAccessorImpl.java:25)
+	at java.lang.reflect.Method.invoke(Method.java:597)
+	at com.sun.jmx.mbeanserver.StandardMBeanIntrospector.invokeM2(StandardMBeanIntrospector.java:93)
+	at com.sun.jmx.mbeanserver.StandardMBeanIntrospector.invokeM2(StandardMBeanIntrospector.java:27)
+	at com.sun.jmx.mbeanserver.MBeanIntrospector.invokeM(MBeanIntrospector.java:208)
+	at com.sun.jmx.mbeanserver.PerInterface.invoke(PerInterface.java:120)
+	at com.sun.jmx.mbeanserver.MBeanSupport.invoke(MBeanSupport.java:262)
+	at javax.management.StandardMBean.invoke(StandardMBean.java:391)
+	at com.sun.jmx.interceptor.DefaultMBeanServerInterceptor.invoke(DefaultMBeanServerInterceptor.java:836)
+	at com.sun.jmx.mbeanserver.JmxMBeanServer.invoke(JmxMBeanServer.java:761)
+	at javax.management.MBeanServerInvocationHandler.invoke(MBeanServerInvocationHandler.java:288)
+	at $Proxy0.updateForLocation(Unknown Source)
+	at org.osgi.test.cases.jmx.junit.ConfigurationAdminMBeanTestCase.testConfigurationDelete(ConfigurationAdminMBeanTestCase.java:136)
+	at sun.reflect.NativeMethodAccessorImpl.invoke0(Native Method)
+	at sun.reflect.NativeMethodAccessorImpl.invoke(NativeMethodAccessorImpl.java:39)
+	at sun.reflect.DelegatingMethodAccessorImpl.invoke(DelegatingMethodAccessorImpl.java:25)
+	at java.lang.reflect.Method.invoke(Method.java:597)
+	at junit.framework.TestCase.runTest(TestCase.java:164)
+	at junit.framework.TestCase.runBare(TestCase.java:130)
+	at junit.framework.TestResult$1.protect(TestResult.java:106)
+	at junit.framework.TestResult.runProtected(TestResult.java:124)
+	at junit.framework.TestResult.run(TestResult.java:109)
+	at junit.framework.TestCase.run(TestCase.java:120)
+	at junit.framework.TestSuite.runTest(TestSuite.java:230)
+	at junit.framework.TestSuite.run(TestSuite.java:225)
+	at junit.framework.TestSuite.runTest(TestSuite.java:230)
+	at junit.framework.TestSuite.run(TestSuite.java:225)
+	at aQute.junit.runtime.Target.doTesting(Target.java:234)
+	at aQute.junit.runtime.Target.run(Target.java:57)
+	at aQute.junit.runtime.Target.main(Target.java:37)
+
+ </div>
+</pre>
+</td><td>0</td><td>1</td><td><img src="http://www.osgi.org/www/info.png" onclick="toggle('testConfigurationDelete')" title="Show Exceptions"></td>
+</tr>
+<tr>
+<td width="15px" class="
+                                        warning
+                                    "></td><td class="code">testConfigurationDeleteForLocation<ul>
+<li></li>
+</ul>
+<pre id="testConfigurationDeleteForLocation" style="display:none">
+<div class="code">
+
+java.io.IOException: Invalid TabularType [javax.management.openmbean.TabularType(name=Properties,rowType=javax.management.openmbean.CompositeType(name=Property,items=((itemName=Key,itemType=javax.management.openmbean.SimpleType(name=java.lang.String)),(itemName=Type,itemType=javax.management.openmbean.SimpleType(name=java.lang.String)),(itemName=Value,itemType=javax.management.openmbean.SimpleType(name=java.lang.String)))),indexNames=(Key))]
+	at org.apache.aries.jmx.cm.ConfigurationAdmin.updateForLocation(ConfigurationAdmin.java:225)
+	at sun.reflect.NativeMethodAccessorImpl.invoke0(Native Method)
+	at sun.reflect.NativeMethodAccessorImpl.invoke(NativeMethodAccessorImpl.java:39)
+	at sun.reflect.DelegatingMethodAccessorImpl.invoke(DelegatingMethodAccessorImpl.java:25)
+	at java.lang.reflect.Method.invoke(Method.java:597)
+	at com.sun.jmx.mbeanserver.StandardMBeanIntrospector.invokeM2(StandardMBeanIntrospector.java:93)
+	at com.sun.jmx.mbeanserver.StandardMBeanIntrospector.invokeM2(StandardMBeanIntrospector.java:27)
+	at com.sun.jmx.mbeanserver.MBeanIntrospector.invokeM(MBeanIntrospector.java:208)
+	at com.sun.jmx.mbeanserver.PerInterface.invoke(PerInterface.java:120)
+	at com.sun.jmx.mbeanserver.MBeanSupport.invoke(MBeanSupport.java:262)
+	at javax.management.StandardMBean.invoke(StandardMBean.java:391)
+	at com.sun.jmx.interceptor.DefaultMBeanServerInterceptor.invoke(DefaultMBeanServerInterceptor.java:836)
+	at com.sun.jmx.mbeanserver.JmxMBeanServer.invoke(JmxMBeanServer.java:761)
+	at javax.management.MBeanServerInvocationHandler.invoke(MBeanServerInvocationHandler.java:288)
+	at $Proxy0.updateForLocation(Unknown Source)
+	at org.osgi.test.cases.jmx.junit.ConfigurationAdminMBeanTestCase.testConfigurationDeleteForLocation(ConfigurationAdminMBeanTestCase.java:149)
+	at sun.reflect.NativeMethodAccessorImpl.invoke0(Native Method)
+	at sun.reflect.NativeMethodAccessorImpl.invoke(NativeMethodAccessorImpl.java:39)
+	at sun.reflect.DelegatingMethodAccessorImpl.invoke(DelegatingMethodAccessorImpl.java:25)
+	at java.lang.reflect.Method.invoke(Method.java:597)
+	at junit.framework.TestCase.runTest(TestCase.java:164)
+	at junit.framework.TestCase.runBare(TestCase.java:130)
+	at junit.framework.TestResult$1.protect(TestResult.java:106)
+	at junit.framework.TestResult.runProtected(TestResult.java:124)
+	at junit.framework.TestResult.run(TestResult.java:109)
+	at junit.framework.TestCase.run(TestCase.java:120)
+	at junit.framework.TestSuite.runTest(TestSuite.java:230)
+	at junit.framework.TestSuite.run(TestSuite.java:225)
+	at junit.framework.TestSuite.runTest(TestSuite.java:230)
+	at junit.framework.TestSuite.run(TestSuite.java:225)
+	at aQute.junit.runtime.Target.doTesting(Target.java:234)
+	at aQute.junit.runtime.Target.run(Target.java:57)
+	at aQute.junit.runtime.Target.main(Target.java:37)
+
+ </div>
+</pre>
+</td><td>0</td><td>1</td><td><img src="http://www.osgi.org/www/info.png" onclick="toggle('testConfigurationDeleteForLocation')" title="Show Exceptions"></td>
+</tr>
+<tr>
+<td width="15px" class="
+                                        warning
+                                    "></td><td class="code">testDeleteConfigurationsFilter<ul>
+<li></li>
+</ul>
+<pre id="testDeleteConfigurationsFilter" style="display:none">
+<div class="code">
+
+java.io.IOException: Invalid TabularType [javax.management.openmbean.TabularType(name=Properties,rowType=javax.management.openmbean.CompositeType(name=Property,items=((itemName=Key,itemType=javax.management.openmbean.SimpleType(name=java.lang.String)),(itemName=Type,itemType=javax.management.openmbean.SimpleType(name=java.lang.String)),(itemName=Value,itemType=javax.management.openmbean.SimpleType(name=java.lang.String)))),indexNames=(Key))]
+	at org.apache.aries.jmx.cm.ConfigurationAdmin.updateForLocation(ConfigurationAdmin.java:225)
+	at sun.reflect.NativeMethodAccessorImpl.invoke0(Native Method)
+	at sun.reflect.NativeMethodAccessorImpl.invoke(NativeMethodAccessorImpl.java:39)
+	at sun.reflect.DelegatingMethodAccessorImpl.invoke(DelegatingMethodAccessorImpl.java:25)
+	at java.lang.reflect.Method.invoke(Method.java:597)
+	at com.sun.jmx.mbeanserver.StandardMBeanIntrospector.invokeM2(StandardMBeanIntrospector.java:93)
+	at com.sun.jmx.mbeanserver.StandardMBeanIntrospector.invokeM2(StandardMBeanIntrospector.java:27)
+	at com.sun.jmx.mbeanserver.MBeanIntrospector.invokeM(MBeanIntrospector.java:208)
+	at com.sun.jmx.mbeanserver.PerInterface.invoke(PerInterface.java:120)
+	at com.sun.jmx.mbeanserver.MBeanSupport.invoke(MBeanSupport.java:262)
+	at javax.management.StandardMBean.invoke(StandardMBean.java:391)
+	at com.sun.jmx.interceptor.DefaultMBeanServerInterceptor.invoke(DefaultMBeanServerInterceptor.java:836)
+	at com.sun.jmx.mbeanserver.JmxMBeanServer.invoke(JmxMBeanServer.java:761)
+	at javax.management.MBeanServerInvocationHandler.invoke(MBeanServerInvocationHandler.java:288)
+	at $Proxy0.updateForLocation(Unknown Source)
+	at org.osgi.test.cases.jmx.junit.ConfigurationAdminMBeanTestCase.testDeleteConfigurationsFilter(ConfigurationAdminMBeanTestCase.java:163)
+	at sun.reflect.NativeMethodAccessorImpl.invoke0(Native Method)
+	at sun.reflect.NativeMethodAccessorImpl.invoke(NativeMethodAccessorImpl.java:39)
+	at sun.reflect.DelegatingMethodAccessorImpl.invoke(DelegatingMethodAccessorImpl.java:25)
+	at java.lang.reflect.Method.invoke(Method.java:597)
+	at junit.framework.TestCase.runTest(TestCase.java:164)
+	at junit.framework.TestCase.runBare(TestCase.java:130)
+	at junit.framework.TestResult$1.protect(TestResult.java:106)
+	at junit.framework.TestResult.runProtected(TestResult.java:124)
+	at junit.framework.TestResult.run(TestResult.java:109)
+	at junit.framework.TestCase.run(TestCase.java:120)
+	at junit.framework.TestSuite.runTest(TestSuite.java:230)
+	at junit.framework.TestSuite.run(TestSuite.java:225)
+	at junit.framework.TestSuite.runTest(TestSuite.java:230)
+	at junit.framework.TestSuite.run(TestSuite.java:225)
+	at aQute.junit.runtime.Target.doTesting(Target.java:234)
+	at aQute.junit.runtime.Target.run(Target.java:57)
+	at aQute.junit.runtime.Target.main(Target.java:37)
+
+ </div>
+</pre>
+</td><td>0</td><td>1</td><td><img src="http://www.osgi.org/www/info.png" onclick="toggle('testDeleteConfigurationsFilter')" title="Show Exceptions"></td>
+</tr>
+<tr>
+<td width="15px" class="
+                                        ok
+                                    "></td><td class="code">testGetFactoryPid</td><td>0</td><td>0</td><td></td>
+</tr>
+<tr>
+<td width="15px" class="
+                                        ok
+                                    "></td><td class="code">testGetFactoryPidForLocation</td><td>0</td><td>0</td><td></td>
+</tr>
+<tr>
+<td width="15px" class="
+                                        warning
+                                    "></td><td class="code">testGetConfigurationsFilter<ul>
+<li></li>
+</ul>
+<pre id="testGetConfigurationsFilter" style="display:none">
+<div class="code">
+
+java.io.IOException: Invalid TabularType [javax.management.openmbean.TabularType(name=Properties,rowType=javax.management.openmbean.CompositeType(name=Property,items=((itemName=Key,itemType=javax.management.openmbean.SimpleType(name=java.lang.String)),(itemName=Type,itemType=javax.management.openmbean.SimpleType(name=java.lang.String)),(itemName=Value,itemType=javax.management.openmbean.SimpleType(name=java.lang.String)))),indexNames=(Key))]
+	at org.apache.aries.jmx.cm.ConfigurationAdmin.updateForLocation(ConfigurationAdmin.java:225)
+	at sun.reflect.NativeMethodAccessorImpl.invoke0(Native Method)
+	at sun.reflect.NativeMethodAccessorImpl.invoke(NativeMethodAccessorImpl.java:39)
+	at sun.reflect.DelegatingMethodAccessorImpl.invoke(DelegatingMethodAccessorImpl.java:25)
+	at java.lang.reflect.Method.invoke(Method.java:597)
+	at com.sun.jmx.mbeanserver.StandardMBeanIntrospector.invokeM2(StandardMBeanIntrospector.java:93)
+	at com.sun.jmx.mbeanserver.StandardMBeanIntrospector.invokeM2(StandardMBeanIntrospector.java:27)
+	at com.sun.jmx.mbeanserver.MBeanIntrospector.invokeM(MBeanIntrospector.java:208)
+	at com.sun.jmx.mbeanserver.PerInterface.invoke(PerInterface.java:120)
+	at com.sun.jmx.mbeanserver.MBeanSupport.invoke(MBeanSupport.java:262)
+	at javax.management.StandardMBean.invoke(StandardMBean.java:391)
+	at com.sun.jmx.interceptor.DefaultMBeanServerInterceptor.invoke(DefaultMBeanServerInterceptor.java:836)
+	at com.sun.jmx.mbeanserver.JmxMBeanServer.invoke(JmxMBeanServer.java:761)
+	at javax.management.MBeanServerInvocationHandler.invoke(MBeanServerInvocationHandler.java:288)
+	at $Proxy0.updateForLocation(Unknown Source)
+	at org.osgi.test.cases.jmx.junit.ConfigurationAdminMBeanTestCase.testGetConfigurationsFilter(ConfigurationAdminMBeanTestCase.java:205)
+	at sun.reflect.NativeMethodAccessorImpl.invoke0(Native Method)
+	at sun.reflect.NativeMethodAccessorImpl.invoke(NativeMethodAccessorImpl.java:39)
+	at sun.reflect.DelegatingMethodAccessorImpl.invoke(DelegatingMethodAccessorImpl.java:25)
+	at java.lang.reflect.Method.invoke(Method.java:597)
+	at junit.framework.TestCase.runTest(TestCase.java:164)
+	at junit.framework.TestCase.runBare(TestCase.java:130)
+	at junit.framework.TestResult$1.protect(TestResult.java:106)
+	at junit.framework.TestResult.runProtected(TestResult.java:124)
+	at junit.framework.TestResult.run(TestResult.java:109)
+	at junit.framework.TestCase.run(TestCase.java:120)
+	at junit.framework.TestSuite.runTest(TestSuite.java:230)
+	at junit.framework.TestSuite.run(TestSuite.java:225)
+	at junit.framework.TestSuite.runTest(TestSuite.java:230)
+	at junit.framework.TestSuite.run(TestSuite.java:225)
+	at aQute.junit.runtime.Target.doTesting(Target.java:234)
+	at aQute.junit.runtime.Target.run(Target.java:57)
+	at aQute.junit.runtime.Target.main(Target.java:37)
+
+ </div>
+</pre>
+</td><td>0</td><td>1</td><td><img src="http://www.osgi.org/www/info.png" onclick="toggle('testGetConfigurationsFilter')" title="Show Exceptions"></td>
+</tr>
+<tr>
+<td width="15px" class="
+                                        warning
+                                    "></td><td class="code">testCreateFactoryConfigurationForLocation<ul>
+<li></li>
+</ul>
+<pre id="testCreateFactoryConfigurationForLocation" style="display:none">
+<div class="code">
+
+java.io.IOException: Invalid TabularType [javax.management.openmbean.TabularType(name=Properties,rowType=javax.management.openmbean.CompositeType(name=Property,items=((itemName=Key,itemType=javax.management.openmbean.SimpleType(name=java.lang.String)),(itemName=Type,itemType=javax.management.openmbean.SimpleType(name=java.lang.String)),(itemName=Value,itemType=javax.management.openmbean.SimpleType(name=java.lang.String)))),indexNames=(Key))]
+	at org.apache.aries.jmx.cm.ConfigurationAdmin.updateForLocation(ConfigurationAdmin.java:225)
+	at org.apache.aries.jmx.cm.ConfigurationAdmin.update(ConfigurationAdmin.java:209)
+	at sun.reflect.NativeMethodAccessorImpl.invoke0(Native Method)
+	at sun.reflect.NativeMethodAccessorImpl.invoke(NativeMethodAccessorImpl.java:39)
+	at sun.reflect.DelegatingMethodAccessorImpl.invoke(DelegatingMethodAccessorImpl.java:25)
+	at java.lang.reflect.Method.invoke(Method.java:597)
+	at com.sun.jmx.mbeanserver.StandardMBeanIntrospector.invokeM2(StandardMBeanIntrospector.java:93)
+	at com.sun.jmx.mbeanserver.StandardMBeanIntrospector.invokeM2(StandardMBeanIntrospector.java:27)
+	at com.sun.jmx.mbeanserver.MBeanIntrospector.invokeM(MBeanIntrospector.java:208)
+	at com.sun.jmx.mbeanserver.PerInterface.invoke(PerInterface.java:120)
+	at com.sun.jmx.mbeanserver.MBeanSupport.invoke(MBeanSupport.java:262)
+	at javax.management.StandardMBean.invoke(StandardMBean.java:391)
+	at com.sun.jmx.interceptor.DefaultMBeanServerInterceptor.invoke(DefaultMBeanServerInterceptor.java:836)
+	at com.sun.jmx.mbeanserver.JmxMBeanServer.invoke(JmxMBeanServer.java:761)
+	at javax.management.MBeanServerInvocationHandler.invoke(MBeanServerInvocationHandler.java:288)
+	at $Proxy0.update(Unknown Source)
+	at org.osgi.test.cases.jmx.junit.ConfigurationAdminMBeanTestCase.testCreateFactoryConfigurationForLocation(ConfigurationAdminMBeanTestCase.java:243)
+	at sun.reflect.NativeMethodAccessorImpl.invoke0(Native Method)
+	at sun.reflect.NativeMethodAccessorImpl.invoke(NativeMethodAccessorImpl.java:39)
+	at sun.reflect.DelegatingMethodAccessorImpl.invoke(DelegatingMethodAccessorImpl.java:25)
+	at java.lang.reflect.Method.invoke(Method.java:597)
+	at junit.framework.TestCase.runTest(TestCase.java:164)
+	at junit.framework.TestCase.runBare(TestCase.java:130)
+	at junit.framework.TestResult$1.protect(TestResult.java:106)
+	at junit.framework.TestResult.runProtected(TestResult.java:124)
+	at junit.framework.TestResult.run(TestResult.java:109)
+	at junit.framework.TestCase.run(TestCase.java:120)
+	at junit.framework.TestSuite.runTest(TestSuite.java:230)
+	at junit.framework.TestSuite.run(TestSuite.java:225)
+	at junit.framework.TestSuite.runTest(TestSuite.java:230)
+	at junit.framework.TestSuite.run(TestSuite.java:225)
+	at aQute.junit.runtime.Target.doTesting(Target.java:234)
+	at aQute.junit.runtime.Target.run(Target.java:57)
+	at aQute.junit.runtime.Target.main(Target.java:37)
+
+ </div>
+</pre>
+</td><td>0</td><td>1</td><td><img src="http://www.osgi.org/www/info.png" onclick="toggle('testCreateFactoryConfigurationForLocation')" title="Show Exceptions"></td>
+</tr>
+<tr>
+<td width="15px" class="
+                                        warning
+                                    "></td><td class="code">testCreateFactoryConfiguration<ul>
+<li></li>
+</ul>
+<pre id="testCreateFactoryConfiguration" style="display:none">
+<div class="code">
+
+java.io.IOException: Invalid TabularType [javax.management.openmbean.TabularType(name=Properties,rowType=javax.management.openmbean.CompositeType(name=Property,items=((itemName=Key,itemType=javax.management.openmbean.SimpleType(name=java.lang.String)),(itemName=Type,itemType=javax.management.openmbean.SimpleType(name=java.lang.String)),(itemName=Value,itemType=javax.management.openmbean.SimpleType(name=java.lang.String)))),indexNames=(Key))]
+	at org.apache.aries.jmx.cm.ConfigurationAdmin.updateForLocation(ConfigurationAdmin.java:225)
+	at org.apache.aries.jmx.cm.ConfigurationAdmin.update(ConfigurationAdmin.java:209)
+	at sun.reflect.NativeMethodAccessorImpl.invoke0(Native Method)
+	at sun.reflect.NativeMethodAccessorImpl.invoke(NativeMethodAccessorImpl.java:39)
+	at sun.reflect.DelegatingMethodAccessorImpl.invoke(DelegatingMethodAccessorImpl.java:25)
+	at java.lang.reflect.Method.invoke(Method.java:597)
+	at com.sun.jmx.mbeanserver.StandardMBeanIntrospector.invokeM2(StandardMBeanIntrospector.java:93)
+	at com.sun.jmx.mbeanserver.StandardMBeanIntrospector.invokeM2(StandardMBeanIntrospector.java:27)
+	at com.sun.jmx.mbeanserver.MBeanIntrospector.invokeM(MBeanIntrospector.java:208)
+	at com.sun.jmx.mbeanserver.PerInterface.invoke(PerInterface.java:120)
+	at com.sun.jmx.mbeanserver.MBeanSupport.invoke(MBeanSupport.java:262)
+	at javax.management.StandardMBean.invoke(StandardMBean.java:391)
+	at com.sun.jmx.interceptor.DefaultMBeanServerInterceptor.invoke(DefaultMBeanServerInterceptor.java:836)
+	at com.sun.jmx.mbeanserver.JmxMBeanServer.invoke(JmxMBeanServer.java:761)
+	at javax.management.MBeanServerInvocationHandler.invoke(MBeanServerInvocationHandler.java:288)
+	at $Proxy0.update(Unknown Source)
+	at org.osgi.test.cases.jmx.junit.ConfigurationAdminMBeanTestCase.testCreateFactoryConfiguration(ConfigurationAdminMBeanTestCase.java:284)
+	at sun.reflect.NativeMethodAccessorImpl.invoke0(Native Method)
+	at sun.reflect.NativeMethodAccessorImpl.invoke(NativeMethodAccessorImpl.java:39)
+	at sun.reflect.DelegatingMethodAccessorImpl.invoke(DelegatingMethodAccessorImpl.java:25)
+	at java.lang.reflect.Method.invoke(Method.java:597)
+	at junit.framework.TestCase.runTest(TestCase.java:164)
+	at junit.framework.TestCase.runBare(TestCase.java:130)
+	at junit.framework.TestResult$1.protect(TestResult.java:106)
+	at junit.framework.TestResult.runProtected(TestResult.java:124)
+	at junit.framework.TestResult.run(TestResult.java:109)
+	at junit.framework.TestCase.run(TestCase.java:120)
+	at junit.framework.TestSuite.runTest(TestSuite.java:230)
+	at junit.framework.TestSuite.run(TestSuite.java:225)
+	at junit.framework.TestSuite.runTest(TestSuite.java:230)
+	at junit.framework.TestSuite.run(TestSuite.java:225)
+	at aQute.junit.runtime.Target.doTesting(Target.java:234)
+	at aQute.junit.runtime.Target.run(Target.java:57)
+	at aQute.junit.runtime.Target.main(Target.java:37)
+
+ </div>
+</pre>
+</td><td>0</td><td>1</td><td><img src="http://www.osgi.org/www/info.png" onclick="toggle('testCreateFactoryConfiguration')" title="Show Exceptions"></td>
+</tr>
+<tr>
+<td width="15px" class="
+                                        ok
+                                    "></td><td class="code">testExceptions</td><td>0</td><td>0</td><td></td>
+</tr>
+<tr>
+<td width="15px" class="
+                                        ok
+                                    "></td><td class="code">testExceptions</td><td>0</td><td>0</td><td></td>
+</tr>
+<tr>
+<td width="15px" class="
+                                        ok
+                                    "></td><td class="code">testGetDependencies</td><td>0</td><td>0</td><td></td>
+</tr>
+<tr>
+<td width="15px" class="
+                                        ok
+                                    "></td><td class="code">testGetRequiringBundles</td><td>0</td><td>0</td><td></td>
+</tr>
+<tr>
+<td width="15px" class="
+                                        ok
+                                    "></td><td class="code">testGetBundles</td><td>0</td><td>0</td><td></td>
+</tr>
+<tr>
+<td width="15px" class="
+                                        ok
+                                    "></td><td class="code">testGetExportedPackages</td><td>0</td><td>0</td><td></td>
+</tr>
+<tr>
+<td width="15px" class="
+                                        ok
+                                    "></td><td class="code">testGetImportedPackages</td><td>0</td><td>0</td><td></td>
+</tr>
+<tr>
+<td width="15px" class="
+                                        ok
+                                    "></td><td class="code">testGetFragments</td><td>0</td><td>0</td><td></td>
+</tr>
+<tr>
+<td width="15px" class="
+                                        ok
+                                    "></td><td class="code">testGetHeaders</td><td>0</td><td>0</td><td></td>
+</tr>
+<tr>
+<td width="15px" class="
+                                        ok
+                                    "></td><td class="code">testGetRegisteredServices</td><td>0</td><td>0</td><td></td>
+</tr>
+<tr>
+<td width="15px" class="
+                                        ok
+                                    "></td><td class="code">testGetServicesInUse</td><td>0</td><td>0</td><td></td>
+</tr>
+<tr>
+<td width="15px" class="
+                                        ok
+                                    "></td><td class="code">testGetLocation</td><td>0</td><td>0</td><td></td>
+</tr>
+<tr>
+<td width="15px" class="
+                                        ok
+                                    "></td><td class="code">testGetState</td><td>0</td><td>0</td><td></td>
+</tr>
+<tr>
+<td width="15px" class="
+                                        ok
+                                    "></td><td class="code">testGetSymbolicName</td><td>0</td><td>0</td><td></td>
+</tr>
+<tr>
+<td width="15px" class="
+                                        ok
+                                    "></td><td class="code">testGetVersion</td><td>0</td><td>0</td><td></td>
+</tr>
+<tr>
+<td width="15px" class="
+                                        ok
+                                    "></td><td class="code">testIsFragment</td><td>0</td><td>0</td><td></td>
+</tr>
+<tr>
+<td width="15px" class="
+                                        ok
+                                    "></td><td class="code">testIsRemovalPending</td><td>0</td><td>0</td><td></td>
+</tr>
+<tr>
+<td width="15px" class="
+                                        ok
+                                    "></td><td class="code">testIsRequired</td><td>0</td><td>0</td><td></td>
+</tr>
+<tr>
+<td width="15px" class="
+                                        ok
+                                    "></td><td class="code">testIsPersistentlyStarted</td><td>0</td><td>0</td><td></td>
+</tr>
+<tr>
+<td width="15px" class="
+                                        ok
+                                    "></td><td class="code">testGetHosts</td><td>0</td><td>0</td><td></td>
+</tr>
+<tr>
+<td width="15px" class="
+                                        ok
+                                    "></td><td class="code">testExceptions</td><td>0</td><td>0</td><td></td>
+</tr>
+<tr>
+<td width="15px" class="
+                                        ok
+                                    "></td><td class="code">testGetServiceInterfaces</td><td>0</td><td>0</td><td></td>
+</tr>
+<tr>
+<td width="15px" class="
+                                        ok
+                                    "></td><td class="code">testGetBundle</td><td>0</td><td>0</td><td></td>
+</tr>
+<tr>
+<td width="15px" class="
+                                        ok
+                                    "></td><td class="code">testGetProperties</td><td>0</td><td>0</td><td></td>
+</tr>
+<tr>
+<td width="15px" class="
+                                        ok
+                                    "></td><td class="code">testGetServices</td><td>0</td><td>0</td><td></td>
+</tr>
+<tr>
+<td width="15px" class="
+                                        ok
+                                    "></td><td class="code">testGetUsingBundles</td><td>0</td><td>0</td><td></td>
+</tr>
+<tr>
+<td width="15px" class="
+                                        ok
+                                    "></td><td class="code">testExceptions</td><td>0</td><td>0</td><td></td>
+</tr>
+<tr>
+<td width="15px" class="
+                                        ok
+                                    "></td><td class="code">testGetInformation</td><td>0</td><td>0</td><td></td>
+</tr>
+<tr>
+<td width="15px" class="
+                                        warning
+                                    "></td><td class="code">testAddInformation<ul>
+<li></li>
+</ul>
+<pre id="testAddInformation" style="display:none">
+<div class="code">
+
+java.lang.IllegalArgumentException: Invalid CompositeType [javax.management.openmbean.CompositeType(name=Property,items=((itemName=Key,itemType=javax.management.openmbean.SimpleType(name=java.lang.String)),(itemName=Type,itemType=javax.management.openmbean.SimpleType(name=java.lang.String)),(itemName=Value,itemType=javax.management.openmbean.SimpleType(name=java.lang.String))))]
+	at org.apache.aries.jmx.codec.PropertyData.from(PropertyData.java:260)
+	at org.apache.aries.jmx.provisioning.ProvisioningService.extractProvisioningDictionary(ProvisioningService.java:110)
+	at org.apache.aries.jmx.provisioning.ProvisioningService.addInformation(ProvisioningService.java:74)
+	at sun.reflect.NativeMethodAccessorImpl.invoke0(Native Method)
+	at sun.reflect.NativeMethodAccessorImpl.invoke(NativeMethodAccessorImpl.java:39)
+	at sun.reflect.DelegatingMethodAccessorImpl.invoke(DelegatingMethodAccessorImpl.java:25)
+	at java.lang.reflect.Method.invoke(Method.java:597)
+	at com.sun.jmx.mbeanserver.StandardMBeanIntrospector.invokeM2(StandardMBeanIntrospector.java:93)
+	at com.sun.jmx.mbeanserver.StandardMBeanIntrospector.invokeM2(StandardMBeanIntrospector.java:27)
+	at com.sun.jmx.mbeanserver.MBeanIntrospector.invokeM(MBeanIntrospector.java:208)
+	at com.sun.jmx.mbeanserver.PerInterface.invoke(PerInterface.java:120)
+	at com.sun.jmx.mbeanserver.MBeanSupport.invoke(MBeanSupport.java:262)
+	at javax.management.StandardMBean.invoke(StandardMBean.java:391)
+	at com.sun.jmx.interceptor.DefaultMBeanServerInterceptor.invoke(DefaultMBeanServerInterceptor.java:836)
+	at com.sun.jmx.mbeanserver.JmxMBeanServer.invoke(JmxMBeanServer.java:761)
+	at javax.management.MBeanServerInvocationHandler.invoke(MBeanServerInvocationHandler.java:288)
+	at $Proxy3.addInformation(Unknown Source)
+	at org.osgi.test.cases.jmx.junit.ProvisioningServiceMBeanTestCase.testAddInformation(ProvisioningServiceMBeanTestCase.java:48)
+	at sun.reflect.NativeMethodAccessorImpl.invoke0(Native Method)
+	at sun.reflect.NativeMethodAccessorImpl.invoke(NativeMethodAccessorImpl.java:39)
+	at sun.reflect.DelegatingMethodAccessorImpl.invoke(DelegatingMethodAccessorImpl.java:25)
+	at java.lang.reflect.Method.invoke(Method.java:597)
+	at junit.framework.TestCase.runTest(TestCase.java:164)
+	at junit.framework.TestCase.runBare(TestCase.java:130)
+	at junit.framework.TestResult$1.protect(TestResult.java:106)
+	at junit.framework.TestResult.runProtected(TestResult.java:124)
+	at junit.framework.TestResult.run(TestResult.java:109)
+	at junit.framework.TestCase.run(TestCase.java:120)
+	at junit.framework.TestSuite.runTest(TestSuite.java:230)
+	at junit.framework.TestSuite.run(TestSuite.java:225)
+	at junit.framework.TestSuite.runTest(TestSuite.java:230)
+	at junit.framework.TestSuite.run(TestSuite.java:225)
+	at aQute.junit.runtime.Target.doTesting(Target.java:234)
+	at aQute.junit.runtime.Target.run(Target.java:57)
+	at aQute.junit.runtime.Target.main(Target.java:37)
+
+ </div>
+</pre>
+</td><td>0</td><td>1</td><td><img src="http://www.osgi.org/www/info.png" onclick="toggle('testAddInformation')" title="Show Exceptions"></td>
+</tr>
+<tr>
+<td width="15px" class="
+                                        warning
+                                    "></td><td class="code">testSetInformation<ul>
+<li></li>
+</ul>
+<pre id="testSetInformation" style="display:none">
+<div class="code">
+
+java.lang.IllegalArgumentException: Invalid CompositeType [javax.management.openmbean.CompositeType(name=Property,items=((itemName=Key,itemType=javax.management.openmbean.SimpleType(name=java.lang.String)),(itemName=Type,itemType=javax.management.openmbean.SimpleType(name=java.lang.String)),(itemName=Value,itemType=javax.management.openmbean.SimpleType(name=java.lang.String))))]
+	at org.apache.aries.jmx.codec.PropertyData.from(PropertyData.java:260)
+	at org.apache.aries.jmx.provisioning.ProvisioningService.extractProvisioningDictionary(ProvisioningService.java:110)
+	at org.apache.aries.jmx.provisioning.ProvisioningService.addInformation(ProvisioningService.java:74)
+	at sun.reflect.NativeMethodAccessorImpl.invoke0(Native Method)
+	at sun.reflect.NativeMethodAccessorImpl.invoke(NativeMethodAccessorImpl.java:39)
+	at sun.reflect.DelegatingMethodAccessorImpl.invoke(DelegatingMethodAccessorImpl.java:25)
+	at java.lang.reflect.Method.invoke(Method.java:597)
+	at com.sun.jmx.mbeanserver.StandardMBeanIntrospector.invokeM2(StandardMBeanIntrospector.java:93)
+	at com.sun.jmx.mbeanserver.StandardMBeanIntrospector.invokeM2(StandardMBeanIntrospector.java:27)
+	at com.sun.jmx.mbeanserver.MBeanIntrospector.invokeM(MBeanIntrospector.java:208)
+	at com.sun.jmx.mbeanserver.PerInterface.invoke(PerInterface.java:120)
+	at com.sun.jmx.mbeanserver.MBeanSupport.invoke(MBeanSupport.java:262)
+	at javax.management.StandardMBean.invoke(StandardMBean.java:391)
+	at com.sun.jmx.interceptor.DefaultMBeanServerInterceptor.invoke(DefaultMBeanServerInterceptor.java:836)
+	at com.sun.jmx.mbeanserver.JmxMBeanServer.invoke(JmxMBeanServer.java:761)
+	at javax.management.MBeanServerInvocationHandler.invoke(MBeanServerInvocationHandler.java:288)
+	at $Proxy3.addInformation(Unknown Source)
+	at org.osgi.test.cases.jmx.junit.ProvisioningServiceMBeanTestCase.testSetInformation(ProvisioningServiceMBeanTestCase.java:61)
+	at sun.reflect.NativeMethodAccessorImpl.invoke0(Native Method)
+	at sun.reflect.NativeMethodAccessorImpl.invoke(NativeMethodAccessorImpl.java:39)
+	at sun.reflect.DelegatingMethodAccessorImpl.invoke(DelegatingMethodAccessorImpl.java:25)
+	at java.lang.reflect.Method.invoke(Method.java:597)
+	at junit.framework.TestCase.runTest(TestCase.java:164)
+	at junit.framework.TestCase.runBare(TestCase.java:130)
+	at junit.framework.TestResult$1.protect(TestResult.java:106)
+	at junit.framework.TestResult.runProtected(TestResult.java:124)
+	at junit.framework.TestResult.run(TestResult.java:109)
+	at junit.framework.TestCase.run(TestCase.java:120)
+	at junit.framework.TestSuite.runTest(TestSuite.java:230)
+	at junit.framework.TestSuite.run(TestSuite.java:225)
+	at junit.framework.TestSuite.runTest(TestSuite.java:230)
+	at junit.framework.TestSuite.run(TestSuite.java:225)
+	at aQute.junit.runtime.Target.doTesting(Target.java:234)
+	at aQute.junit.runtime.Target.run(Target.java:57)
+	at aQute.junit.runtime.Target.main(Target.java:37)
+
+ </div>
+</pre>
+</td><td>0</td><td>1</td><td><img src="http://www.osgi.org/www/info.png" onclick="toggle('testSetInformation')" title="Show Exceptions"></td>
+</tr>
+<tr>
+<td width="15px" class="
+                                        ok
+                                    "></td><td class="code">testAddInformationFromZip</td><td>0</td><td>0</td><td></td>
+</tr>
+<tr>
+<td width="15px" class="
+                                        warning
+                                    "></td><td class="code">testShutdown<ul>
+<li></li>
+</ul>
+<pre id="testShutdown" style="display:none">
+<div class="code">
+
+org.osgi.framework.BundleException: An error occurred trying to read the bundle
+	at org.eclipse.osgi.internal.baseadaptor.BundleInstall.begin(BundleInstall.java:94)
+	at org.eclipse.osgi.framework.internal.core.Framework.installWorkerPrivileged(Framework.java:922)
+	at org.eclipse.osgi.framework.internal.core.Framework$1.run(Framework.java:838)
+	at java.security.AccessController.doPrivileged(Native Method)
+	at org.eclipse.osgi.framework.internal.core.Framework.installWorker(Framework.java:889)
+	at org.eclipse.osgi.framework.internal.core.Framework.installBundle(Framework.java:833)
+	at org.eclipse.osgi.framework.internal.core.BundleContextImpl.installBundle(BundleContextImpl.java:166)
+	at org.eclipse.osgi.framework.internal.core.BundleContextImpl.installBundle(BundleContextImpl.java:160)
+	at org.osgi.test.cases.jmx.junit.FrameworkMBeanLifecycleTestCase.installFramework(FrameworkMBeanLifecycleTestCase.java:424)
+	at org.osgi.test.cases.jmx.junit.FrameworkMBeanLifecycleTestCase.setUp(FrameworkMBeanLifecycleTestCase.java:82)
+	at junit.framework.TestCase.runBare(TestCase.java:128)
+	at junit.framework.TestResult$1.protect(TestResult.java:106)
+	at junit.framework.TestResult.runProtected(TestResult.java:124)
+	at junit.framework.TestResult.run(TestResult.java:109)
+	at junit.framework.TestCase.run(TestCase.java:120)
+	at junit.framework.TestSuite.runTest(TestSuite.java:230)
+	at junit.framework.TestSuite.run(TestSuite.java:225)
+	at junit.framework.TestSuite.runTest(TestSuite.java:230)
+	at junit.framework.TestSuite.run(TestSuite.java:225)
+	at aQute.junit.runtime.Target.doTesting(Target.java:234)
+	at aQute.junit.runtime.Target.run(Target.java:57)
+	at aQute.junit.runtime.Target.main(Target.java:37)
+Caused by: java.io.FileNotFoundException: jar/osgi.enterprise-4.2.0.jar (No such file or directory)
+	at java.io.FileInputStream.open(Native Method)
+	at java.io.FileInputStream.&lt;init&gt;(FileInputStream.java:106)
+	at java.io.FileInputStream.&lt;init&gt;(FileInputStream.java:66)
+	at sun.net.www.protocol.file.FileURLConnection.connect(FileURLConnection.java:70)
+	at sun.net.www.protocol.file.FileURLConnection.getInputStream(FileURLConnection.java:161)
+	at org.eclipse.osgi.internal.baseadaptor.BundleInstall.begin(BundleInstall.java:56)
+	... 21 more
+
+ </div>
+</pre>
+</td><td>0</td><td>1</td><td><img src="http://www.osgi.org/www/info.png" onclick="toggle('testShutdown')" title="Show Exceptions"></td>
+</tr>
+<tr>
+<td width="15px" class="
+                                        warning
+                                    "></td><td class="code">testRestart<ul>
+<li></li>
+</ul>
+<pre id="testRestart" style="display:none">
+<div class="code">
+
+org.osgi.framework.BundleException: An error occurred trying to read the bundle
+	at org.eclipse.osgi.internal.baseadaptor.BundleInstall.begin(BundleInstall.java:94)
+	at org.eclipse.osgi.framework.internal.core.Framework.installWorkerPrivileged(Framework.java:922)
+	at org.eclipse.osgi.framework.internal.core.Framework$1.run(Framework.java:838)
+	at java.security.AccessController.doPrivileged(Native Method)
+	at org.eclipse.osgi.framework.internal.core.Framework.installWorker(Framework.java:889)
+	at org.eclipse.osgi.framework.internal.core.Framework.installBundle(Framework.java:833)
+	at org.eclipse.osgi.framework.internal.core.BundleContextImpl.installBundle(BundleContextImpl.java:166)
+	at org.eclipse.osgi.framework.internal.core.BundleContextImpl.installBundle(BundleContextImpl.java:160)
+	at org.osgi.test.cases.jmx.junit.FrameworkMBeanLifecycleTestCase.installFramework(FrameworkMBeanLifecycleTestCase.java:424)
+	at org.osgi.test.cases.jmx.junit.FrameworkMBeanLifecycleTestCase.setUp(FrameworkMBeanLifecycleTestCase.java:82)
+	at junit.framework.TestCase.runBare(TestCase.java:128)
+	at junit.framework.TestResult$1.protect(TestResult.java:106)
+	at junit.framework.TestResult.runProtected(TestResult.java:124)
+	at junit.framework.TestResult.run(TestResult.java:109)
+	at junit.framework.TestCase.run(TestCase.java:120)
+	at junit.framework.TestSuite.runTest(TestSuite.java:230)
+	at junit.framework.TestSuite.run(TestSuite.java:225)
+	at junit.framework.TestSuite.runTest(TestSuite.java:230)
+	at junit.framework.TestSuite.run(TestSuite.java:225)
+	at aQute.junit.runtime.Target.doTesting(Target.java:234)
+	at aQute.junit.runtime.Target.run(Target.java:57)
+	at aQute.junit.runtime.Target.main(Target.java:37)
+Caused by: java.io.FileNotFoundException: jar/osgi.enterprise-4.2.0.jar (No such file or directory)
+	at java.io.FileInputStream.open(Native Method)
+	at java.io.FileInputStream.&lt;init&gt;(FileInputStream.java:106)
+	at java.io.FileInputStream.&lt;init&gt;(FileInputStream.java:66)
+	at sun.net.www.protocol.file.FileURLConnection.connect(FileURLConnection.java:70)
+	at sun.net.www.protocol.file.FileURLConnection.getInputStream(FileURLConnection.java:161)
+	at org.eclipse.osgi.internal.baseadaptor.BundleInstall.begin(BundleInstall.java:56)
+	... 21 more
+
+ </div>
+</pre>
+</td><td>0</td><td>1</td><td><img src="http://www.osgi.org/www/info.png" onclick="toggle('testRestart')" title="Show Exceptions"></td>
+</tr>
+<tr>
+<td width="15px" class="
+                                        warning
+                                    "></td><td class="code">testUpdate<ul>
+<li></li>
+</ul>
+<pre id="testUpdate" style="display:none">
+<div class="code">
+
+org.osgi.framework.BundleException: An error occurred trying to read the bundle
+	at org.eclipse.osgi.internal.baseadaptor.BundleInstall.begin(BundleInstall.java:94)
+	at org.eclipse.osgi.framework.internal.core.Framework.installWorkerPrivileged(Framework.java:922)
+	at org.eclipse.osgi.framework.internal.core.Framework$1.run(Framework.java:838)
+	at java.security.AccessController.doPrivileged(Native Method)
+	at org.eclipse.osgi.framework.internal.core.Framework.installWorker(Framework.java:889)
+	at org.eclipse.osgi.framework.internal.core.Framework.installBundle(Framework.java:833)
+	at org.eclipse.osgi.framework.internal.core.BundleContextImpl.installBundle(BundleContextImpl.java:166)
+	at org.eclipse.osgi.framework.internal.core.BundleContextImpl.installBundle(BundleContextImpl.java:160)
+	at org.osgi.test.cases.jmx.junit.FrameworkMBeanLifecycleTestCase.installFramework(FrameworkMBeanLifecycleTestCase.java:424)
+	at org.osgi.test.cases.jmx.junit.FrameworkMBeanLifecycleTestCase.setUp(FrameworkMBeanLifecycleTestCase.java:82)
+	at junit.framework.TestCase.runBare(TestCase.java:128)
+	at junit.framework.TestResult$1.protect(TestResult.java:106)
+	at junit.framework.TestResult.runProtected(TestResult.java:124)
+	at junit.framework.TestResult.run(TestResult.java:109)
+	at junit.framework.TestCase.run(TestCase.java:120)
+	at junit.framework.TestSuite.runTest(TestSuite.java:230)
+	at junit.framework.TestSuite.run(TestSuite.java:225)
+	at junit.framework.TestSuite.runTest(TestSuite.java:230)
+	at junit.framework.TestSuite.run(TestSuite.java:225)
+	at aQute.junit.runtime.Target.doTesting(Target.java:234)
+	at aQute.junit.runtime.Target.run(Target.java:57)
+	at aQute.junit.runtime.Target.main(Target.java:37)
+Caused by: java.io.FileNotFoundException: jar/osgi.enterprise-4.2.0.jar (No such file or directory)
+	at java.io.FileInputStream.open(Native Method)
+	at java.io.FileInputStream.&lt;init&gt;(FileInputStream.java:106)
+	at java.io.FileInputStream.&lt;init&gt;(FileInputStream.java:66)
+	at sun.net.www.protocol.file.FileURLConnection.connect(FileURLConnection.java:70)
+	at sun.net.www.protocol.file.FileURLConnection.getInputStream(FileURLConnection.java:161)
+	at org.eclipse.osgi.internal.baseadaptor.BundleInstall.begin(BundleInstall.java:56)
+	... 21 more
+
+ </div>
+</pre>
+</td><td>0</td><td>1</td><td><img src="http://www.osgi.org/www/info.png" onclick="toggle('testUpdate')" title="Show Exceptions"></td>
+</tr>
+<tr>
+<td width="15px" class="
+                                        warning
+                                    "></td><td class="code">testAll<ul>
+<li></li>
+</ul>
+<pre id="testAll" style="display:none">
+<div class="code">
+
+org.osgi.framework.BundleException: An error occurred trying to read the bundle
+	at org.eclipse.osgi.internal.baseadaptor.BundleInstall.begin(BundleInstall.java:94)
+	at org.eclipse.osgi.framework.internal.core.Framework.installWorkerPrivileged(Framework.java:922)
+	at org.eclipse.osgi.framework.internal.core.Framework$1.run(Framework.java:838)
+	at java.security.AccessController.doPrivileged(Native Method)
+	at org.eclipse.osgi.framework.internal.core.Framework.installWorker(Framework.java:889)
+	at org.eclipse.osgi.framework.internal.core.Framework.installBundle(Framework.java:833)
+	at org.eclipse.osgi.framework.internal.core.BundleContextImpl.installBundle(BundleContextImpl.java:166)
+	at org.eclipse.osgi.framework.internal.core.BundleContextImpl.installBundle(BundleContextImpl.java:160)
+	at org.osgi.test.cases.jmx.junit.FrameworkMBeanLifecycleTestCase.installFramework(FrameworkMBeanLifecycleTestCase.java:424)
+	at org.osgi.test.cases.jmx.junit.FrameworkMBeanLifecycleTestCase.setUp(FrameworkMBeanLifecycleTestCase.java:82)
+	at junit.framework.TestCase.runBare(TestCase.java:128)
+	at junit.framework.TestResult$1.protect(TestResult.java:106)
+	at junit.framework.TestResult.runProtected(TestResult.java:124)
+	at junit.framework.TestResult.run(TestResult.java:109)
+	at junit.framework.TestCase.run(TestCase.java:120)
+	at junit.framework.TestSuite.runTest(TestSuite.java:230)
+	at junit.framework.TestSuite.run(TestSuite.java:225)
+	at junit.framework.TestSuite.runTest(TestSuite.java:230)
+	at junit.framework.TestSuite.run(TestSuite.java:225)
+	at aQute.junit.runtime.Target.doTesting(Target.java:234)
+	at aQute.junit.runtime.Target.run(Target.java:57)
+	at aQute.junit.runtime.Target.main(Target.java:37)
+Caused by: java.io.FileNotFoundException: jar/osgi.enterprise-4.2.0.jar (No such file or directory)
+	at java.io.FileInputStream.open(Native Method)
+	at java.io.FileInputStream.&lt;init&gt;(FileInputStream.java:106)
+	at java.io.FileInputStream.&lt;init&gt;(FileInputStream.java:66)
+	at sun.net.www.protocol.file.FileURLConnection.connect(FileURLConnection.java:70)
+	at sun.net.www.protocol.file.FileURLConnection.getInputStream(FileURLConnection.java:161)
+	at org.eclipse.osgi.internal.baseadaptor.BundleInstall.begin(BundleInstall.java:56)
+	... 21 more
+
+ </div>
+</pre>
+</td><td>0</td><td>1</td><td><img src="http://www.osgi.org/www/info.png" onclick="toggle('testAll')" title="Show Exceptions"></td>
+</tr>
+<tr>
+<td width="15px" class="
+                                        ok
+                                    "></td><td class="code">testExceptions</td><td>0</td><td>0</td><td></td>
+</tr>
+<tr>
+<td width="15px" class="
+                                        ok
+                                    "></td><td class="code">testListLocations</td><td>0</td><td>0</td><td></td>
+</tr>
+<tr>
+<td width="15px" class="
+                                        ok
+                                    "></td><td class="code">testListDefaultPermissions</td><td>0</td><td>0</td><td></td>
+</tr>
+<tr>
+<td width="15px" class="
+                                        ok
+                                    "></td><td class="code">testGetPermissions</td><td>0</td><td>0</td><td></td>
+</tr>
+<tr>
+<td width="15px" class="
+                                        ok
+                                    "></td><td class="code">testSetPermissions</td><td>0</td><td>0</td><td></td>
+</tr>
+<tr>
+<td width="15px" class="
+                                        ok
+                                    "></td><td class="code">testSetDefaultPermissions</td><td>0</td><td>0</td><td></td>
+</tr>
+<tr>
+<td width="15px" class="
+                                        ok
+                                    "></td><td class="code">testSignature</td><td>0</td><td>0</td><td></td>
+</tr>
+<tr>
+<td width="15px" class="
+                                        ok
+                                    "></td><td class="code">testExceptions</td><td>0</td><td>0</td><td></td>
+</tr>
+<tr>
+<td width="15px" class="
+                                        ok
+                                    "></td><td class="code">testGetProperties</td><td>0</td><td>0</td><td></td>
+</tr>
+<tr>
+<td width="15px" class="
+                                        ok
+                                    "></td><td class="code">testCreateUser</td><td>0</td><td>0</td><td></td>
+</tr>
+<tr>
+<td width="15px" class="
+                                        ok
+                                    "></td><td class="code">testCreateGroup</td><td>0</td><td>0</td><td></td>
+</tr>
+<tr>
+<td width="15px" class="
+                                        ok
+                                    "></td><td class="code">testAddRequiredMember</td><td>0</td><td>0</td><td></td>
+</tr>
+<tr>
+<td width="15px" class="
+                                        ok
+                                    "></td><td class="code">testAddAndRemoveGroupMember</td><td>0</td><td>0</td><td></td>
+</tr>
+<tr>
+<td width="15px" class="
+                                        ok
+                                    "></td><td class="code">testGetGroup</td><td>0</td><td>0</td><td></td>
+</tr>
+<tr>
+<td width="15px" class="
+                                        ok
+                                    "></td><td class="code">testGetAuthorization</td><td>0</td><td>0</td><td></td>
+</tr>
+<tr>
+<td width="15px" class="
+                                        ok
+                                    "></td><td class="code">testListGroups</td><td>0</td><td>0</td><td></td>
+</tr>
+<tr>
+<td width="15px" class="
+                                        ok
+                                    "></td><td class="code">testGetImpliedRoles</td><td>0</td><td>0</td><td></td>
+</tr>
+<tr>
+<td width="15px" class="
+                                        ok
+                                    "></td><td class="code">testGetMembers</td><td>0</td><td>0</td><td></td>
+</tr>
+<tr>
+<td width="15px" class="
+                                        ok
+                                    "></td><td class="code">testGetRequiredMembers</td><td>0</td><td>0</td><td></td>
+</tr>
+<tr>
+<td width="15px" class="
+                                        ok
+                                    "></td><td class="code">testGetUser</td><td>0</td><td>0</td><td></td>
+</tr>
+<tr>
+<td width="15px" class="
+                                        ok
+                                    "></td><td class="code">testListUsers</td><td>0</td><td>0</td><td></td>
+</tr>
+<tr>
+<td width="15px" class="
+                                        ok
+                                    "></td><td class="code">testRemoveRole</td><td>0</td><td>0</td><td></td>
+</tr>
+<tr>
+<td width="15px" class="
+                                        ok
+                                    "></td><td class="code">testAddPropertyString</td><td>0</td><td>0</td><td></td>
+</tr>
+<tr>
+<td width="15px" class="
+                                        ok
+                                    "></td><td class="code">testAddProperty</td><td>0</td><td>0</td><td></td>
+</tr>
+<tr>
+<td width="15px" class="
+                                        ok
+                                    "></td><td class="code">testAddAndRemoveCredentialString</td><td>0</td><td>0</td><td></td>
+</tr>
+<tr>
+<td width="15px" class="
+                                        ok
+                                    "></td><td class="code">testAddAndRemoveCredential</td><td>0</td><td>0</td><td></td>
+</tr>
+<tr>
+<td width="15px" class="
+                                        ok
+                                    "></td><td class="code">testGetCredentials</td><td>0</td><td>0</td><td></td>
+</tr>
+<tr>
+<td width="15px" class="
+                                        ok
+                                    "></td><td class="code">testGetRole</td><td>0</td><td>0</td><td></td>
+</tr>
+<tr>
+<td width="15px" class="
+                                        ok
+                                    "></td><td class="code">testGetRoleFilter</td><td>0</td><td>0</td><td></td>
+</tr>
+<tr>
+<td width="15px" class="
+                                        ok
+                                    "></td><td class="code">testGetUserFilter</td><td>0</td><td>0</td><td></td>
+</tr>
+<tr>
+<td width="15px" class="
+                                        ok
+                                    "></td><td class="code">testGetGroupFilter</td><td>0</td><td>0</td><td></td>
+</tr>
+<tr>
+<td width="15px" class="
+                                        ok
+                                    "></td><td class="code">testGetUserWithProperty</td><td>0</td><td>0</td><td></td>
+</tr>
+<tr>
+<td width="15px" class="
+                                        ok
+                                    "></td><td class="code">testListRoles</td><td>0</td><td>0</td><td></td>
+</tr>
+<tr>
+<td width="15px" class="
+                                        ok
+                                    "></td><td class="code">testRemoveGroup</td><td>0</td><td>0</td><td></td>
+</tr>
+<tr>
+<td width="15px" class="
+                                        ok
+                                    "></td><td class="code">testRemoveUser</td><td>0</td><td>0</td><td></td>
+</tr>
+<tr>
+<td width="15px" class="
+                                        ok
+                                    "></td><td class="code">testRemoveProperty</td><td>0</td><td>0</td><td></td>
+</tr>
+<tr>
+<td width="15px" class="
+                                        ok
+                                    "></td><td class="code">testExceptions</td><td>0</td><td>0</td><td></td>
+</tr>
+<tr>
+<td width="15px" class="
+                                        ok
+                                    "></td><td class="code">testFrameworkMBeanExists</td><td>0</td><td>0</td><td></td>
+</tr>
+<tr>
+<td width="15px" class="
+                                        ok
+                                    "></td><td class="code">testFrameworkStartLevel</td><td>0</td><td>0</td><td></td>
+</tr>
+<tr>
+<td width="15px" class="
+                                        ok
+                                    "></td><td class="code">testBundleStartLevel</td><td>0</td><td>0</td><td></td>
+</tr>
+<tr>
+<td width="15px" class="
+                                        ok
+                                    "></td><td class="code">testBundleInstallFromURL</td><td>0</td><td>0</td><td></td>
+</tr>
+<tr>
+<td width="15px" class="
+                                        ok
+                                    "></td><td class="code">testBundleUpdateFromURL</td><td>0</td><td>0</td><td></td>
+</tr>
+<tr>
+<td width="15px" class="
+                                        ok
+                                    "></td><td class="code">testBundleResolve</td><td>0</td><td>0</td><td></td>
+</tr>
+<tr>
+<td width="15px" class="
+                                        ok
+                                    "></td><td class="code">testBundleStartStop</td><td>0</td><td>0</td><td></td>
+</tr>
+<tr>
+<td width="15px" class="
+                                        ok
+                                    "></td><td class="code">testBundleRefresh</td><td>0</td><td>0</td><td></td>
+</tr>
+<tr>
+<td width="15px" class="
+                                        ok
+                                    "></td><td class="code">testItem</td><td>0</td><td>0</td><td></td>
+</tr>
+<tr>
+<td width="15px" class="
+                                        ok
+                                    "></td><td class="code">testItemArrayType</td><td>0</td><td>0</td><td></td>
+</tr>
+<tr>
+<td width="15px" class="
+                                        ok
+                                    "></td><td class="code">testItemCompositeType</td><td>0</td><td>0</td><td></td>
+</tr>
+<tr>
+<td width="15px" class="
+                                        ok
+                                    "></td><td class="code">testItemExtend</td><td>0</td><td>0</td><td></td>
+</tr>
+<tr>
+<td width="15px" class="
+                                        ok
+                                    "></td><td class="code">testItemTabularType</td><td>0</td><td>0</td><td></td>
+</tr>
+<tr>
+<td width="15px" class="
+                                        ok
+                                    "></td><td class="code">testItemComplex</td><td>0</td><td>0</td><td></td>
+</tr>
+<tr>
+<td width="15px" class="
+                                        ok
+                                    "></td><td class="code">testBundleInstallAndUpdate</td><td>0</td><td>0</td><td></td>
+</tr>
+<tr>
+<td width="15px" class="
+                                        ok
+                                    "></td><td class="code">testBundlesInstallAndUpdate</td><td>0</td><td>0</td><td></td>
+</tr>
+<tr>
+<td width="15px" class="
+                                        ok
+                                    "></td><td class="code">testExceptions</td><td>0</td><td>0</td><td></td>
+</tr>
+<tr>
+<td width="15px" class="
+                                        ok
+                                    "></td><td class="code">testIsRemovalPending</td><td>0</td><td>0</td><td></td>
+</tr>
+<tr>
+<td width="15px" class="
+                                        ok
+                                    "></td><td class="code">testGetExportingBundle</td><td>0</td><td>0</td><td></td>
+</tr>
+<tr>
+<td width="15px" class="
+                                        ok
+                                    "></td><td class="code">testGetImportingBundles</td><td>0</td><td>0</td><td></td>
+</tr>
+<tr>
+<td width="15px" class="
+                                        ok
+                                    "></td><td class="code">testGetPackages</td><td>0</td><td>0</td><td></td>
+</tr>
+<tr>
+<td width="15px" class="
+                                        ok
+                                    "></td><td class="code">testMBeanServerExistence</td><td>0</td><td>0</td><td></td>
+</tr>
+</table>
+<br>
+<h2>Coverage</h2>
+<p>The following table provides a sumary of the coverage based on static analysis.
+					A red icon indicates the method is never referred. An orange icon indicates there is
+					only one method referring to the method and a green icon indicates there are 2 or more
+					references. The references are shown by clicking on the info icon. This table is based on static analysis so it is not possible to see
+					how often the method is called and with what parameters.</p>
+<table width="100%">
+<tr>
+<th width="15px"></th><th>org.osgi.jmx.Item</th><th></th><th></th>
+</tr>
+<tr>
+<td width="15px" class="
+													ok
+												"></td><td class="code">Item(String,String,OpenType,String[])<div class="code" style="display:none;margin:4;padding:8; background-color: #FFFFCC;" id="Item(String,String,OpenType,String[])" title="Callers">void FrameworkMBeanTestCase.testItem()<br>void FrameworkMBeanTestCase.testItemCompositeType()<br>void FrameworkMBeanTestCase.testItemCompositeType()<br>void FrameworkMBeanTestCase.testItemExtend()<br>void FrameworkMBeanTestCase.testItemExtend()<br>void FrameworkMBeanTestCase.testItemExtend()<br>void FrameworkMBeanTestCase.testItemTabularType()<br>void FrameworkMBeanTestCase.testItemTabularType()<br>void FrameworkMBeanTestCase.testItemComplex()<br>void FrameworkMBeanTestCase.testItemComplex()<br>
+</div>
+</td><td>10</td><td><img src="http://www.osgi.org/www/info.png" onclick="toggle('Item(String,String,OpenType,String[])')" title="Show/Hide Callers"></td>
+</tr>
+<tr>
+<td width="15px" class="
+													ok
+												"></td><td class="code">ArrayType Item.arrayType(int,OpenType)<div class="code" style="display:none;margin:4;padding:8; background-color: #FFFFCC;" id="ArrayType Item.arrayType(int,OpenType)" title="Callers">void FrameworkMBeanTestCase.testItemArrayType()<br>void FrameworkMBeanTestCase.testItemComplex()<br>
+</div>
+</td><td>2</td><td><img src="http://www.osgi.org/www/info.png" onclick="toggle('ArrayType Item.arrayType(int,OpenType)')" title="Show/Hide Callers"></td>
+</tr>
+<tr>
+<td width="15px" class="
+													ok
+												"></td><td class="code">CompositeType Item.compositeType(String,String,Item[])<div class="code" style="display:none;margin:4;padding:8; background-color: #FFFFCC;" id="CompositeType Item.compositeType(String,String,Item[])" title="Callers">void FrameworkMBeanTestCase.testItem()<br>void FrameworkMBeanTestCase.testItemCompositeType()<br>void FrameworkMBeanTestCase.testItemExtend()<br>void FrameworkMBeanTestCase.testItemTabularType()<br>void FrameworkMBeanTestCase.testItemComplex()<br>
+</div>
+</td><td>5</td><td><img src="http://www.osgi.org/www/info.png" onclick="toggle('CompositeType Item.compositeType(String,String,Item[])')" title="Show/Hide Callers"></td>
+</tr>
+<tr>
+<td width="15px" class="
+													ok
+												"></td><td class="code">CompositeType Item.extend(CompositeType,String,String,Item[])<div class="code" style="display:none;margin:4;padding:8; background-color: #FFFFCC;" id="CompositeType Item.extend(CompositeType,String,String,Item[])" title="Callers">void FrameworkMBeanTestCase.testItemExtend()<br>void FrameworkMBeanTestCase.testItemComplex()<br>
+</div>
+</td><td>2</td><td><img src="http://www.osgi.org/www/info.png" onclick="toggle('CompositeType Item.extend(CompositeType,String,String,Item[])')" title="Show/Hide Callers"></td>
+</tr>
+<tr>
+<td width="15px" class="
+													ok
+												"></td><td class="code">TabularType Item.tabularType(String,String,CompositeType,String[])<div class="code" style="display:none;margin:4;padding:8; background-color: #FFFFCC;" id="TabularType Item.tabularType(String,String,CompositeType,String[])" title="Callers">void FrameworkMBeanTestCase.testItemTabularType()<br>void FrameworkMBeanTestCase.testItemComplex()<br>
+</div>
+</td><td>2</td><td><img src="http://www.osgi.org/www/info.png" onclick="toggle('TabularType Item.tabularType(String,String,CompositeType,String[])')" title="Show/Hide Callers"></td>
+</tr>
+<tr>
+<th width="15px"></th><th>org.osgi.jmx.framework.BundleStateMBean</th><th></th><th></th>
+</tr>
+<tr>
+<td width="15px" class="
+													ok
+												"></td><td class="code">String[] BundleStateMBean.getExportedPackages(long)<div class="code" style="display:none;margin:4;padding:8; background-color: #FFFFCC;" id="String[] BundleStateMBean.getExportedPackages(long)" title="Callers">void BundleStateMBeanTestCase.testGetExportedPackages()<br>void BundleStateMBeanTestCase.testExceptions()<br>void BundleStateMBeanTestCase.testExceptions()<br>
+</div>
+</td><td>3</td><td><img src="http://www.osgi.org/www/info.png" onclick="toggle('String[] BundleStateMBean.getExportedPackages(long)')" title="Show/Hide Callers"></td>
+</tr>
+<tr>
+<td width="15px" class="
+													ok
+												"></td><td class="code">long[] BundleStateMBean.getFragments(long)<div class="code" style="display:none;margin:4;padding:8; background-color: #FFFFCC;" id="long[] BundleStateMBean.getFragments(long)" title="Callers">void BundleStateMBeanTestCase.testGetFragments()<br>void BundleStateMBeanTestCase.testGetFragments()<br>void BundleStateMBeanTestCase.testExceptions()<br>void BundleStateMBeanTestCase.testExceptions()<br>
+</div>
+</td><td>4</td><td><img src="http://www.osgi.org/www/info.png" onclick="toggle('long[] BundleStateMBean.getFragments(long)')" title="Show/Hide Callers"></td>
+</tr>
+<tr>
+<td width="15px" class="
+													ok
+												"></td><td class="code">TabularData BundleStateMBean.getHeaders(long)<div class="code" style="display:none;margin:4;padding:8; background-color: #FFFFCC;" id="TabularData BundleStateMBean.getHeaders(long)" title="Callers">void BundleStateMBeanTestCase.testGetHeaders()<br>void BundleStateMBeanTestCase.testExceptions()<br>void BundleStateMBeanTestCase.testExceptions()<br>
+</div>
+</td><td>3</td><td><img src="http://www.osgi.org/www/info.png" onclick="toggle('TabularData BundleStateMBean.getHeaders(long)')" title="Show/Hide Callers"></td>
+</tr>
+<tr>
+<td width="15px" class="
+													ok
+												"></td><td class="code">long[] BundleStateMBean.getHosts(long)<div class="code" style="display:none;margin:4;padding:8; background-color: #FFFFCC;" id="long[] BundleStateMBean.getHosts(long)" title="Callers">void BundleStateMBeanTestCase.testGetHosts()<br>void BundleStateMBeanTestCase.testGetHosts()<br>void BundleStateMBeanTestCase.testExceptions()<br>void BundleStateMBeanTestCase.testExceptions()<br>
+</div>
+</td><td>4</td><td><img src="http://www.osgi.org/www/info.png" onclick="toggle('long[] BundleStateMBean.getHosts(long)')" title="Show/Hide Callers"></td>
+</tr>
+<tr>
+<td width="15px" class="
+													ok
+												"></td><td class="code">String[] BundleStateMBean.getImportedPackages(long)<div class="code" style="display:none;margin:4;padding:8; background-color: #FFFFCC;" id="String[] BundleStateMBean.getImportedPackages(long)" title="Callers">void BundleStateMBeanTestCase.testGetImportedPackages()<br>void BundleStateMBeanTestCase.testExceptions()<br>void BundleStateMBeanTestCase.testExceptions()<br>
+</div>
+</td><td>3</td><td><img src="http://www.osgi.org/www/info.png" onclick="toggle('String[] BundleStateMBean.getImportedPackages(long)')" title="Show/Hide Callers"></td>
+</tr>
+<tr>
+<td width="15px" class="
+													ok
+												"></td><td class="code">long BundleStateMBean.getLastModified(long)<div class="code" style="display:none;margin:4;padding:8; background-color: #FFFFCC;" id="long BundleStateMBean.getLastModified(long)" title="Callers">void BundleStateMBeanTestCase.testExceptions()<br>void BundleStateMBeanTestCase.testExceptions()<br>void FrameworkMBeanTestCase.testBundleUpdateFromURL()<br>void FrameworkMBeanTestCase.testBundleUpdateFromURL()<br>void FrameworkMBeanTestCase.testBundleUpdateFromURL()<br>void FrameworkMBeanTestCase.testBundleUpdateFromURL()<br>void FrameworkMBeanTestCase.testBundleUpdateFromURL()<br>void FrameworkMBeanTestCase.testBundleUpdateFromURL()<br>void FrameworkMBeanTestCase.testBundleInstallAndUpdate()<br>void FrameworkMBeanTestCase.testBundleInstallAndUpdate()<br>void FrameworkMBeanTestCase.testBundlesInstallAndUpdate()<br>void FrameworkMBeanTestCase.testBundlesInstallAndUpdate()<br>void FrameworkMBeanTestCase.testBundlesInstallAndUpdate()<br>void Framework
 MBeanTestCase.testBundlesInstallAndUpdate()<br>
+</div>
+</td><td>14</td><td><img src="http://www.osgi.org/www/info.png" onclick="toggle('long BundleStateMBean.getLastModified(long)')" title="Show/Hide Callers"></td>
+</tr>
+<tr>
+<td width="15px" class="
+													ok
+												"></td><td class="code">String BundleStateMBean.getLocation(long)<div class="code" style="display:none;margin:4;padding:8; background-color: #FFFFCC;" id="String BundleStateMBean.getLocation(long)" title="Callers">void BundleStateMBeanTestCase.testGetLocation()<br>void BundleStateMBeanTestCase.testExceptions()<br>void BundleStateMBeanTestCase.testExceptions()<br>
+</div>
+</td><td>3</td><td><img src="http://www.osgi.org/www/info.png" onclick="toggle('String BundleStateMBean.getLocation(long)')" title="Show/Hide Callers"></td>
+</tr>
+<tr>
+<td width="15px" class="
+													ok
+												"></td><td class="code">long[] BundleStateMBean.getRegisteredServices(long)<div class="code" style="display:none;margin:4;padding:8; background-color: #FFFFCC;" id="long[] BundleStateMBean.getRegisteredServices(long)" title="Callers">void BundleStateMBeanTestCase.testGetRegisteredServices()<br>void BundleStateMBeanTestCase.testGetRegisteredServices()<br>void BundleStateMBeanTestCase.testExceptions()<br>void BundleStateMBeanTestCase.testExceptions()<br>
+</div>
+</td><td>4</td><td><img src="http://www.osgi.org/www/info.png" onclick="toggle('long[] BundleStateMBean.getRegisteredServices(long)')" title="Show/Hide Callers"></td>
+</tr>
+<tr>
+<td width="15px" class="
+													ok
+												"></td><td class="code">long[] BundleStateMBean.getRequiredBundles(long)<div class="code" style="display:none;margin:4;padding:8; background-color: #FFFFCC;" id="long[] BundleStateMBean.getRequiredBundles(long)" title="Callers">void BundleStateMBeanTestCase.testGetDependencies()<br>void BundleStateMBeanTestCase.testGetDependencies()<br>void BundleStateMBeanTestCase.testExceptions()<br>void BundleStateMBeanTestCase.testExceptions()<br>
+</div>
+</td><td>4</td><td><img src="http://www.osgi.org/www/info.png" onclick="toggle('long[] BundleStateMBean.getRequiredBundles(long)')" title="Show/Hide Callers"></td>
+</tr>
+<tr>
+<td width="15px" class="
+													ok
+												"></td><td class="code">long[] BundleStateMBean.getRequiringBundles(long)<div class="code" style="display:none;margin:4;padding:8; background-color: #FFFFCC;" id="long[] BundleStateMBean.getRequiringBundles(long)" title="Callers">void BundleStateMBeanTestCase.testGetRequiringBundles()<br>void BundleStateMBeanTestCase.testExceptions()<br>void BundleStateMBeanTestCase.testExceptions()<br>
+</div>
+</td><td>3</td><td><img src="http://www.osgi.org/www/info.png" onclick="toggle('long[] BundleStateMBean.getRequiringBundles(long)')" title="Show/Hide Callers"></td>
+</tr>
+<tr>

[... 722 lines stripped ...]


Mime
View raw message