archiva-users mailing list archives

Site index · List index
Message view « Date » · « Thread »
Top « Date » · « Thread »
From "Nerderman,Adam" <nerde...@oclc.org>
Subject 500 error: Failed to look for file
Date Thu, 05 Feb 2015 15:27:32 GMT
One of our applications is seeing this build failure intermittently. The artifact that the
application they are trying to get does not exist in this repository, but for some reason
instead of always moving on it is failing with a 500 error saying it failed to look for the
file. Is there any known bug with Archiva 2.1.1 for this or does anyone have any idea what
might be causing this?


Thanks,

Adam


05:39:03,483 ERROR - Failed to execute goal org.apache.maven.plugins:maven-remote-resources-plugin:1.1:process
(default) on project circ-business-compiledrest: Error resolving project artifact: Could not
transfer artifact org.olap4j:olap4j:pom:0.9.7.309-JS-3 from/to legacy-releases (http://HOST/archiva/repository/internal):
Failed to look for file: http://HOST/archiva/repository/internal/org/olap4j/olap4j/0.9.7.309-JS-3/olap4j-0.9.7.309-JS-3.pom.
Return code is: 500 for project org.olap4j:olap4j:jar:0.9.7.309-JS-3 -> [Help 1]
05:39:03,483 ERROR - org.apache.maven.lifecycle.LifecycleExecutionException: Failed to execute
goal org.apache.maven.plugins:maven-remote-resources-plugin:1.1:process (default) on project
circ-business-compiledrest: Error resolving project artifact: Could not transfer artifact
org.olap4j:olap4j:pom:0.9.7.309-JS-3 from/to legacy-releases (http://HOST/archiva/repository/internal):
Failed to look for file: http://HOST/archiva/repository/internal/org/olap4j/olap4j/0.9.7.309-JS-3/olap4j-0.9.7.309-JS-3.pom.
Return code is: 500 for project org.olap4j:olap4j:jar:0.9.7.309-JS-3
05:39:03,483 ERROR -     at org.apache.maven.lifecycle.internal.MojoExecutor.execute(MojoExecutor.java:217)
05:39:03,483 ERROR -     at org.apache.maven.lifecycle.internal.MojoExecutor.execute(MojoExecutor.java:153)
05:39:03,483 ERROR -     at org.apache.maven.lifecycle.internal.MojoExecutor.execute(MojoExecutor.java:145)
05:39:03,483 ERROR -     at org.apache.maven.lifecycle.internal.LifecycleModuleBuilder.buildProject(LifecycleModuleBuilder.java:84)
05:39:03,483 ERROR -     at org.apache.maven.lifecycle.internal.LifecycleModuleBuilder.buildProject(LifecycleModuleBuilder.java:59)
05:39:03,483 ERROR -     at org.apache.maven.lifecycle.internal.LifecycleStarter.singleThreadedBuild(LifecycleStarter.java:183)
05:39:03,483 ERROR -     at org.apache.maven.lifecycle.internal.LifecycleStarter.execute(LifecycleStarter.java:161)
05:39:03,483 ERROR -     at org.apache.maven.DefaultMaven.doExecute(DefaultMaven.java:319)
05:39:03,483 ERROR -     at org.apache.maven.DefaultMaven.execute(DefaultMaven.java:156)
05:39:03,483 ERROR -     at org.apache.maven.cli.MavenCli.execute(MavenCli.java:537)
05:39:03,483 ERROR -     at org.apache.maven.cli.MavenCli.doMain(MavenCli.java:196)
05:39:03,483 ERROR -     at org.apache.maven.cli.MavenCli.main(MavenCli.java:141)
05:39:03,483 ERROR -     at sun.reflect.NativeMethodAccessorImpl.invoke0(Native Method)
05:39:03,483 ERROR -     at sun.reflect.NativeMethodAccessorImpl.invoke(NativeMethodAccessorImpl.java:57)
05:39:03,483 ERROR -     at sun.reflect.DelegatingMethodAccessorImpl.invoke(DelegatingMethodAccessorImpl.java:43)
05:39:03,483 ERROR -     at java.lang.reflect.Method.invoke(Method.java:601)
05:39:03,483 ERROR -     at org.codehaus.plexus.classworlds.launcher.Launcher.launchEnhanced(Launcher.java:290)
05:39:03,483 ERROR -     at org.codehaus.plexus.classworlds.launcher.Launcher.launch(Launcher.java:230)
05:39:03,483 ERROR -     at org.codehaus.plexus.classworlds.launcher.Launcher.mainWithExitCode(Launcher.java:409)
05:39:03,483 ERROR -     at org.codehaus.plexus.classworlds.launcher.Launcher.main(Launcher.java:352)
05:39:03,483 ERROR - Caused by: org.apache.maven.plugin.MojoExecutionException: Error resolving
project artifact: Could not transfer artifact org.olap4j:olap4j:pom:0.9.7.309-JS-3 from/to
legacy-releases (http://HOST/archiva/repository/internal): Failed to look for file: http://​HOST/archiva/repository/internal/org/olap4j/olap4j/0.9.7.309-JS-3/olap4j-0.9.7.309-JS-3.pom.
Return code is: 500 for project org.olap4j:olap4j:jar:0.9.7.309-JS-3
05:39:03,483 ERROR -     at org.apache.maven.plugin.resources.remote.ProcessRemoteResourcesMojo.getProjects(ProcessRemoteResourcesMojo.java:677)
05:39:03,483 ERROR -     at org.apache.maven.plugin.resources.remote.ProcessRemoteResourcesMojo.configureVelocityContext(ProcessRemoteResourcesMojo.java:969)
05:39:03,483 ERROR -     at org.apache.maven.plugin.resources.remote.ProcessRemoteResourcesMojo.execute(ProcessRemoteResourcesMojo.java:492)
05:39:03,483 ERROR -     at org.apache.maven.plugin.DefaultBuildPluginManager.executeMojo(DefaultBuildPluginManager.java:101)
05:39:03,483 ERROR -     at org.apache.maven.lifecycle.internal.MojoExecutor.execute(MojoExecutor.java:209)
05:39:03,483 ERROR -     ... 19 more
05:39:03,483 ERROR - Caused by: org.apache.maven.project.ProjectBuildingException: Error resolving
project artifact: Could not transfer artifact org.olap4j:olap4j:pom:0.9.7.309-JS-3 from/to
legacy-releases (http://HOST/archiva/repository/internal): Failed to look for file: http://HOST/archiva/repository/internal/org/olap4j/olap4j/0.9.7.309-JS-3/olap4j-0.9.7.309-JS-3.pom.
Return code is: 500 for project org.olap4j:olap4j:jar:0.9.7.309-JS-3
05:39:03,483 ERROR -     at org.apache.maven.project.DefaultProjectBuilder.build(DefaultProjectBuilder.java:272)
05:39:03,483 ERROR -     at org.apache.maven.project.DefaultMavenProjectBuilder.buildFromRepository(DefaultMavenProjectBuilder.java:237)
05:39:03,483 ERROR -     at org.apache.maven.project.DefaultMavenProjectBuilder.buildFromRepository(DefaultMavenProjectBuilder.java:252)
05:39:03,483 ERROR -     at org.apache.maven.project.DefaultMavenProjectBuilder.buildFromRepository(DefaultMavenProjectBuilder.java:259)
05:39:03,483 ERROR -     at org.apache.maven.plugin.resources.remote.ProcessRemoteResourcesMojo.getProjects(ProcessRemoteResourcesMojo.java:647)
05:39:03,483 ERROR -     ... 23 more
05:39:03,483 ERROR - Caused by: org.sonatype.aether.resolution.ArtifactResolutionException:
Could not transfer artifact org.olap4j:olap4j:pom:0.9.7.309-JS-3 from/to legacy-releases (http://HOST/archiva/repository/internal):
Failed to look for file: http://HOST/archiva/repository/internal/org/olap4j/olap4j/0.9.7.309-JS-3/olap4j-0.9.7.309-JS-3.pom.
Return code is: 500
05:39:03,483 ERROR -     at org.sonatype.aether.impl.internal.DefaultArtifactResolver.resolve(DefaultArtifactResolver.java:541)
05:39:03,483 ERROR -     at org.sonatype.aether.impl.internal.DefaultArtifactResolver.resolveArtifacts(DefaultArtifactResolver.java:220)
05:39:03,483 ERROR -     at org.sonatype.aether.impl.internal.DefaultArtifactResolver.resolveArtifact(DefaultArtifactResolver.java:197)
05:39:03,483 ERROR -     at org.sonatype.aether.impl.internal.DefaultRepositorySystem.resolveArtifact(DefaultRepositorySystem.java:323)
05:39:03,483 ERROR -     at org.apache.maven.project.DefaultProjectBuilder.build(DefaultProjectBuilder.java:261)
05:39:03,483 ERROR -     ... 27 more
05:39:03,483 ERROR - Caused by: org.sonatype.aether.transfer.ArtifactTransferException: Could
not transfer artifact org.olap4j:olap4j:pom:0.9.7.309-JS-3 from/to legacy-releases (http://HOST/archiva/repository/internal):
Failed to look for file: http://HOST/archiva/repository/internal/org/olap4j/olap4j/0.9.7.309-JS-3/olap4j-0.9.7.309-JS-3.pom.
Return code is: 500
05:39:03,483 ERROR -     at org.sonatype.aether.connector.wagon.WagonRepositoryConnector$4.wrap(WagonRepositoryConnector.java:949)
05:39:03,483 ERROR -     at org.sonatype.aether.connector.wagon.WagonRepositoryConnector$4.wrap(WagonRepositoryConnector.java:940)
05:39:03,483 ERROR -     at org.sonatype.aether.connector.wagon.WagonRepositoryConnector$GetTask.flush(WagonRepositoryConnector.java:695)
05:39:03,483 ERROR -     at org.sonatype.aether.connector.wagon.WagonRepositoryConnector$GetTask.flush(WagonRepositoryConnector.java:689)
05:39:03,483 ERROR -     at org.sonatype.aether.connector.wagon.WagonRepositoryConnector.get(WagonRepositoryConnector.java:445)
05:39:03,483 ERROR -     at org.sonatype.aether.impl.internal.DefaultArtifactResolver.resolve(DefaultArtifactResolver.java:460)
05:39:03,483 ERROR -     ... 31 more
05:39:03,484 ERROR - Caused by: org.apache.maven.wagon.TransferFailedException: Failed to
look for file: http://HOST/archiva/repository/internal/org/olap4j/olap4j/0.9.7.309-JS-3/olap4j-0.9.7.309-JS-3.pom.
Return code is: 500
05:39:03,484 ERROR -     at org.apache.maven.wagon.providers.http.LightweightHttpWagon.resourceExists(LightweightHttpWagon.java:351)
05:39:03,484 ERROR -     at org.sonatype.aether.connector.wagon.WagonRepositoryConnector$GetTask.run(WagonRepositoryConnector.java:584)
05:39:03,484 ERROR -     at org.sonatype.aether.util.concurrency.RunnableErrorForwarder$1.run(RunnableErrorForwarder.java:64)
05:39:03,484 ERROR -     at java.util.concurrent.ThreadPoolExecutor.runWorker(ThreadPoolExecutor.java:1110)
05:39:03,484 ERROR -     at java.util.concurrent.ThreadPoolExecutor$Worker.run(ThreadPoolExecutor.java:603)
05:39:03,484 ERROR -     at java.lang.Thread.run(Thread.java:722)
05:39:03,484 ERROR -
05:39:03,484 ERROR - Re-run Maven using the -X switch to enable full debug logging.
05:39:03,484 ERROR -
05:39:03,484 ERROR - For more information about the errors and possible solutions, please
read the following articles:
05:39:03,484 ERROR - [Help 1] http://cwiki.apache.org/confluence/display/MAVEN/MojoExecutionException
05:39:03,484 ERROR -
05:39:03,484 ERROR - After correcting the problems, you can resume the build with the command
05:39:03,484 ERROR - mvn <goals> -rf :circ-business-compiledrest

Mime
  • Unnamed multipart/alternative (inline, None, 0 bytes)
View raw message