archiva-users mailing list archives

Site index · List index
Message view « Date » · « Thread »
Top « Date » · « Thread »
From dvicente <dvicent...@gmail.com>
Subject Re: Build Failed For 521889
Date Mon, 26 Mar 2007 10:53:36 GMT

i try to build Archiva and it fails during "Building Archiva Standard
Reports" because :

[INFO] [jpox:enhance {execution: default}]
[DEBUG] Classes Dir is :
C:\PIC\projects\Archiva\archiva-reports-standard\target\classes
[DEBUG] Executing command line:
[DEBUG] java -cp
C:\PIC\projects\Archiva\archiva-reports-standard\target\classes;C:\PIC\maven-repo-sonate\org\apache\maven\maven-profile\2.0.5\maven-profile-2.0.5.jar;C:\PIC\maven-repo-sonate\javax\transaction\jta\1.0.1B\jta-1.0.1B.jar;C:\PIC\maven-repo-sonate\org\codehaus\plexus\plexus-classworlds\1.2-alpha-7\plexus-classworlds-1.2-alpha-7.jar;C:\PIC\projects\Archiva\archiva-repository-layer\target\classes;C:\PIC\maven-repo-sonate\javax\jdo\jdo2-api\2.0\jdo2-api-2.0.jar;C:\PIC\maven-repo-sonate\org\apache\maven\maven-project\2.0.5\maven-project-2.0.5.jar;C:\PIC\maven-repo-sonate\log4j\log4j\1.2.8\log4j-1.2.8.jar;C:\PIC\maven-repo-sonate\commons-logging\commons-logging\1.0.4\commons-logging-1.0.4.jar;C:\PIC\maven-repo-sonate\org\codehaus\plexus\plexus-component-api\1.0-alpha-19\plexus-component-api-1.0-alpha-19.jar;C:\PIC\maven-repo-sonate\org\codehaus\plexus\cache\plexus-cache-ehcache\1.0-alpha-2-SNAPSHOT\plexus-cache-ehcache-1.0-alpha-2-SNAPSHOT.jar;C:\PIC\maven-repo-sonate\javax\resource\connector\1.0\connector-1.0.jar;C:\PIC\maven-repo-sonate\org\slf4j\slf4j-log4j12\1.2\slf4j-log4j12-1.2.jar;C:\PIC\maven-repo-sonate\org\apache\maven\maven-model\2.0.5\maven-model-2.0.5.jar;C:\PIC\maven-repo-sonate\org\apache\lucene\lucene-core\2.0.0\lucene-core-2.0.0.jar;C:\PIC\projects\Archiva\archiva-discoverer\target\classes;C:\PIC\maven-repo-sonate\org\apache\maven\maven-artifact\2.0.5\maven-artifact-2.0.5.jar;C:\PIC\projects\Archiva\archiva-common\target\archiva-common-1.0-SNAPSHOT.jar;C:\PIC\maven-repo-sonate\org\apache\maven\wagon\wagon-provider-api\1.0-beta-2\wagon-provider-api-1.0-beta-2.jar;C:\PIC\maven-repo-sonate\geronimo-spec\geronimo-spec-jta\1.0.1B-rc2\geronimo-spec-jta-1.0.1B-rc2.jar;C:\PIC\maven-repo-sonate\org\apache\maven\maven-settings\2.0.5\maven-settings-2.0.5.jar;C:\PIC\maven-repo-sonate\org\codehaus\plexus\plexus-digest\1.0\plexus-digest-1.0.jar;C:\PIC\maven-repo-sonate\org\codehaus\plexus\plexus-utils\1.4\plexus-utils-1.4.jar;C:\PIC\maven-repo-sonate\commons-lang\commons-lang\2.2\commons-lang-2.2.jar;C:\PIC\maven-repo-sonate\org\codehaus\plexus\plexus-container-default\1.0-alpha-20\plexus-container-default-1.0-alpha-20.jar;C:\PIC\maven-repo-sonate\org\apache\maven\maven-repository-metadata\2.0.5\maven-repository-metadata-2.0.5.jar;C:\PIC\maven-repo-sonate\org\codehaus\plexus\plexus-jdo2\1.0-alpha-8\plexus-jdo2-1.0-alpha-8.jar;C:\PIC\maven-repo-sonate\org\slf4j\slf4j-api\1.2\slf4j-api-1.2.jar;C:\PIC\projects\Archiva\archiva-indexer\target\classes;C:\PIC\maven-repo-sonate\commons-collections\commons-collections\3.2\commons-collections-3.2.jar;C:\PIC\maven-repo-sonate\org\codehaus\plexus\cache\plexus-cache-api\1.0-alpha-2-SNAPSHOT\plexus-cache-api-1.0-alpha-2-SNAPSHOT.jar;C:\PIC\maven-repo-sonate\net\sf\ehcache\ehcache\1.2.4\ehcache-1.2.4.jar;C:\PIC\maven-repo-sonate\org\apache\maven\maven-artifact-manager\2.0.5\maven-artifact-manager-2.0.5.jar;C:\PIC\maven-repo-sonate\commons-io\commons-io\1.2\commons-io-1.2.jar;C:\PIC\maven-repo-sonate\jpox\jpox\1.1.7\jpox-1.1.7.jar;C:\PIC\maven-repo-sonate\geronimo-spec\geronimo-spec-jta\1.0.1B-rc2\geronimo-spec-jta-1.0.1B-rc2.jar;C:\PIC\maven-repo-sonate\javax\transaction\jta\1.0.1B\jta-1.0.1B.jar;C:\PIC\maven-repo-sonate\org\apache\bcel\bcel\5.2\bcel-5.2.jar;C:\PIC\maven-repo-sonate\javax\resource\connector\1.0\connector-1.0.jar;C:\PIC\maven-repo-sonate\javax\jdo\jdo2-api\2.0\jdo2-api-2.0.jar;C:\PIC\maven-repo-sonate\jakarta-regexp\jakarta-regexp\1.4\jakarta-regexp-1.4.jar;C:\PIC\maven-repo-sonate\jpox\jpox-enhancer\1.1.7\jpox-enhancer-1.1.7.jar;C:\PIC\maven-repo-sonate\ant\ant\1.6\ant-1.6.jar;C:\PIC\maven-repo-sonate\log4j\log4j\1.2.8\log4j-1.2.8.jar;C:\PIC\maven-repo-sonate\jpox\jpox\1.1.7\jpox-1.1.7.jar;C:\PIC\maven-2.0.5\core\plexus-container-default-1.0-alpha-9.jar;C:\PIC\maven-2.0.5\core\plexus-utils-1.1.jar;C:\PIC\maven-2.0.5\lib\maven-artifact-2.0.5.jar;C:\PIC\maven-2.0.5\lib\maven-plugin-api-2.0.5.jar
-Dlog4j.configuration=jar:file:/C:/PIC/maven-repo-sonate/org/codehaus/mojo/jpox-maven-plugin/1.1.7-SNAPSHOT/jpox-maven-plugin-1.1.7-SNAPSHOT.jar!/log4j.configuration
org.jpox.enhancer.JPOXEnhancer -v
C:\PIC\projects\Archiva\archiva-reports-standard\target\classes\org\apache\maven\archiva\reporting\model\package.jdo
[DEBUG] Exit code: 1
[DEBUG] --------------------
[DEBUG]  Standard output from the JPox enhancer tool:
[DEBUG] --------------------
[INFO] 
[DEBUG] --------------------
[ERROR] --------------------
[ERROR]  Standard error from the JPox enhancer tool:
[ERROR] --------------------
[ERROR] La chaŒne de caractŠres suivante est trop longueÿ:
 -cp
C:\PIC\projects\Archiva\archiva-reports-standard\target\classes;C:\PIC\maven-repo-sonate\org\apache\maven\maven-profile\2.0.5\maven-profile-2.0.5.jar;C:\PIC\maven-repo-sonate\javax\transaction\jta\1.0.1B\jta-1.0.1B.jar;C:\PIC\maven-repo-sonate\org\codehau2.0.5\maven-project-2.0.5.jar;C:\PIC\maven-repo-sonate\log4j\log4j\1.2.8\log4j-1.2.8.jar;C:\PIC\maven-repo-sonate\commons-logging\commons-logging\1.0.4\commons-logging-1.0.4.jar;C:\PIC\maven-repo-sonate\org\codehaus\plexus\plexus-component-api\1.0-alpha-19\plexus-component-api-1.0-alpha-19.jar;C:\PIC\maven-repo-sonate\org\codehaus\plexus\cache\plexus-cache-ehcache\1.0-alpha-2-SNAPSHOT\plexus-cache-ehcache-1.0-alpha-2-SNAPSHOT.jar;C:\PIC\maven-repo-sonate\javax\resource\connector\1.0\connector-1.0.jar;C:\PIC\maven-repo-sonate\org\slf4j\slf4j-log4j12\1.2\slf4j-log4j12-1.2.jar;C:\PIC\maven-repo-sonate\org\apache\maven\maven-model\2.0.5\maven-model-2.0.5.jar;C:\PIC\maven-repo-sonate\org\apache\lucene\lucene-core\2.0.0\lucene-core-2.0.0.jar;C:\PIC\projects\Archiva\archiva-discoverer\target\classes;C:\PIC\maven-repo-sonate\org\apache\maven\maven-artifact\2.0.5\maven-artifact-2.0.5.jar;C:\PIC\projects\Archiva\archiva-common\target\archiva-common-1.0-SNAPSHOT.jar;C:\PIC\maven-repo-sonate\org\apache\maven\wagon\wagon-provider-api\1.0-beta-2\wagon-provider-api-1.0-beta-2.jar;C:\PIC\maven-repo-sonate\geronimo-spec\geronimo-spec-jta\1.0.1B-rc2\geronimo-spec-jta-1.0.1B-rc2.jar;C:\PIC\maven-repo-sonate\org\apache\maven\maven-settings\2.0.5\maven-settings-2.0.5.jar;C:\PIC\maven-repo-sonate\org\codehaus\plexus\plexus-digest\1.0\plexus-digest-1.0.jar;C:\PIC\maven-repo-sonate\org\codehaus\plexus\plexus-utils\1.4\plexus-utils-1.4.jar;C:\PIC\maven-repo-sonate\commons-lang\commons-lang\2.2\commons-lang-2.2.jar;C:\PIC\maven-repo-sonate\org\codehaus\plexus\plexus-container-default\1.0-alpha-20\plexus-container-default-1.0-alpha-20.jar;C:\PIC\maven-repo-sonate\org\apache\maven\maven-repository-metadata\2.0.5\maven-repository-metadata-2.0.5.jar;C:\PIC\maven-repo-sonate\org\codehaus\plexus\plexus-jdo2\1.0-alpha-8\plexus-jdo2-1.0-alpha-8.jar;C:\PIC\maven-repo-sonate\org\slf4j\slf4j-api\1.2\slf4j-api-1.2.jar;C:\PIC\projects\Archiva\archiva-indexer\target\classes;C:\PIC\maven-repo-sonate\commons-collections\commons-collections\3.2\commons-collections-3.2.jar;C:\PIC\maven-repo-sonate\org\codehaus\plexus\cache\plexus-cache-api\1.0-alpha-2-SNAPSHOT\plexus-cache-api-1.0-alpha-2-SNAPSHOT.jar;C:\PIC\maven-repo-sonate\net\sf\ehcache\ehcache\1.2.4\ehcache-1.2.4.jar;C:\PIC\maven-repo-sonate\org\apache\maven\maven-artifact-manager\2.0.5\maven-artifact-manager-2.0.5.jar;C:\PIC\maven-repo-sonate\commons-io\commons-io\1.2\commons-io-1.2.jar;C:\PIC\maven-repo-sonate\jpox\jpox\1.1.7\jpox-1.1.7.jar;C:\PIC\maven-repo-sonate\geronimo-spec\geronimo-spec-jta\1.0.1B-rc2\geronimo-spec-jta-1.0.1B-rc2.jar;C:\PIC\maven-repo-sonate\javax\transaction\jta\1.0.1B\jta-1.0.1B.jar;C:\PIC\maven-repo-sonate\org\apache\bcel\bcel\5.2\bcel-5.2.jar;C:\PIC\maven-repo-sonate\javax\resource\connector\1.0\connector-1.0.jar;C:\PIC\maven-repo-sonate\javax\jdo\jdo2-api\2.0\jdo2-api-2.0.jar;C:\PIC\maven-repo-sonate\jakarta-regexp\jakarta-regexp\1.4\jakarta-regexp-1.4.jar;C:\PIC\maven-repo-sonate\jpox\jpox-enhancer\1.1.7\jpox-enhancer-1.1.7.jar;C:\PIC\maven-repo-sonate\ant\ant\1.6\ant-1.6.jar;C:\PIC\maven-repo-sonate\log4j\log4j\1.2.8\log4j-1.2.8.jar;C:\PIC\maven-repo-sonate\jpox\jpox\1.1.7\jpox-1.1.7.jar;C:\PIC\maven-2.0.5\core\plexus-container-default-1.0-alpha-9.jar;C:\PIC\maven-2.0.5\core\plexus-utils-1.1.jar;C:\PIC\maven-2.0.5\lib\maven-artifact-2.0.5.jar;C:\PIC\maven-2.0.5\lib\maven-plugin-api-2.0.5.jar
-Dlog4j.configuration=jar:file:/C:/PIC/maven-repo-sonate/org/codehaus/mojo/jpox-maven-plugin/1.1.7-SNAPSHOT/jpox-maven-plugin-1.1.7-SNAPSHOT.jar!/log4j.configuration
org.jpox.enha

[ERROR] --------------------
[INFO]
------------------------------------------------------------------------
[ERROR] BUILD ERROR
[INFO]
------------------------------------------------------------------------
[INFO] The JPox enhancer tool exited with a non-null exit code.
[INFO]
------------------------------------------------------------------------
[DEBUG] Trace
org.apache.maven.lifecycle.LifecycleExecutionException: The JPox enhancer
tool exited with a non-null exit code.
	at
org.apache.maven.lifecycle.DefaultLifecycleExecutor.executeGoals(DefaultLifecycleExecutor.java:564)
	at
org.apache.maven.lifecycle.DefaultLifecycleExecutor.executeGoalWithLifecycle(DefaultLifecycleExecutor.java:480)
	at
org.apache.maven.lifecycle.DefaultLifecycleExecutor.executeGoal(DefaultLifecycleExecutor.java:459)
	at
org.apache.maven.lifecycle.DefaultLifecycleExecutor.executeGoalAndHandleFailures(DefaultLifecycleExecutor.java:311)
	at
org.apache.maven.lifecycle.DefaultLifecycleExecutor.executeTaskSegments(DefaultLifecycleExecutor.java:278)
	at
org.apache.maven.lifecycle.DefaultLifecycleExecutor.execute(DefaultLifecycleExecutor.java:143)
	at org.apache.maven.DefaultMaven.doExecute(DefaultMaven.java:330)
	at org.apache.maven.DefaultMaven.execute(DefaultMaven.java:123)
	at org.apache.maven.cli.MavenCli.main(MavenCli.java:272)
	at sun.reflect.NativeMethodAccessorImpl.invoke0(Native Method)
	at
sun.reflect.NativeMethodAccessorImpl.invoke(NativeMethodAccessorImpl.java:39)
	at
sun.reflect.DelegatingMethodAccessorImpl.invoke(DelegatingMethodAccessorImpl.java:25)
	at java.lang.reflect.Method.invoke(Method.java:324)
	at org.codehaus.classworlds.Launcher.launchEnhanced(Launcher.java:315)
	at org.codehaus.classworlds.Launcher.launch(Launcher.java:255)
	at org.codehaus.classworlds.Launcher.mainWithExitCode(Launcher.java:430)
	at org.codehaus.classworlds.Launcher.main(Launcher.java:375)
Caused by: org.apache.maven.plugin.MojoExecutionException: The JPox enhancer
tool exited with a non-null exit code.
	at
org.codehaus.mojo.jpox.JpoxEnhancerMojo.enhance(JpoxEnhancerMojo.java:151)
	at
org.codehaus.mojo.jpox.JpoxEnhancerMojo.executeJpoxTool(JpoxEnhancerMojo.java:56)
	at
org.codehaus.mojo.jpox.AbstractJpoxMojo.execute(AbstractJpoxMojo.java:96)
	at
org.apache.maven.plugin.DefaultPluginManager.executeMojo(DefaultPluginManager.java:420)
	at
org.apache.maven.lifecycle.DefaultLifecycleExecutor.executeGoals(DefaultLifecycleExecutor.java:539)
	... 16 more



-- 
View this message in context: http://www.nabble.com/Build-Failes-For-521799-tf3455052.html#a9671087
Sent from the archiva-users mailing list archive at Nabble.com.


Mime
View raw message