archiva-notifications mailing list archives

Site index · List index
Message view « Date » · « Thread »
Top « Date » · « Thread »
From "Continuum@vmbuild.apache.org" <contin...@apache.org>
Subject [continuum] BUILD FAILURE: Archiva - Archiva Web :: Application Tests -
Date Mon, 21 Sep 2009 14:45:30 GMT
Online report : http://vmbuild.apache.org/continuum/buildResult.action?buildId=217439&projectId=2464

Build statistics:
  State: Failed
  Previous State: Failed
  Started at: Mon 21 Sep 2009 07:25:29 -0700
  Finished at: Mon 21 Sep 2009 07:45:18 -0700
  Total time: 19m 48s
  Build Trigger: Schedule
  Build Number: 9
  Exit code: 1
  Building machine hostname: vmbuild.apache.org
  Operating system : Linux(unknown)
  Java Home version : 
          java version "1.5.0_12"
          Java(TM) 2 Runtime Environment, Standard Edition (build 1.5.0_12-b04)
          Java HotSpot(TM) Client VM (build 1.5.0_12-b04, mixed mode, sharing)
        
  Builder version :
          Maven version: 2.0.9
          Java version: 1.5.0_12
          OS name: "linux" version: "2.6.24-23-server" arch: "i386" Family: "unix"
    
****************************************************************************
SCM Changes:
****************************************************************************
No files changed

****************************************************************************
Dependencies Changes:
****************************************************************************
org.apache.archiva:archiva-webapp:1.2.3-SNAPSHOT

org.apache.archiva:archiva-web:1.2.3-SNAPSHOT


****************************************************************************
Build Definition:
****************************************************************************
POM filename: pom.xml
Goals: clean install   
Arguments: --batch-mode --non-recursive -PbuildWithAdditionalRepos,headless
Build Fresh: true
Always Build: false
Default Build Definition: true
Schedule: DEFAULT_SCHEDULE
Profile Name: Maven 2.0.9, Java 5
Description: 

****************************************************************************
Test Summary:
****************************************************************************
Tests: 93
Failures: 6
Errors: 0
Success Rate: 93
Total time: 1019.508

****************************************************************************
Test Failures:
****************************************************************************

TestSuite
    testViewSearchedArtifact :
  com.thoughtworks.selenium.SeleniumException
  com.thoughtworks.selenium.SeleniumException: Timed out after 60000ms
	at com.thoughtworks.selenium.HttpCommandProcessor.throwAssertionFailureExceptionOrError(HttpCommandProcessor.java:90)
	at com.thoughtworks.selenium.HttpCommandProcessor.doCommand(HttpCommandProcessor.java:84)
	at com.thoughtworks.selenium.DefaultSelenium.waitForPageToLoad(DefaultSelenium.java:626)
	at org.apache.archiva.web.test.parent.AbstractSeleniumTest.waitPage(AbstractSeleniumTest.java:223)
	at org.apache.archiva.web.test.parent.AbstractSeleniumTest.clickLinkWithLocator(AbstractSeleniumTest.java:353)
	at org.apache.archiva.web.test.parent.AbstractSeleniumTest.clickLinkWithText(AbstractSeleniumTest.java:329)
	at org.apache.archiva.web.test.parent.AbstractSeleniumTest.clickLinkWithText(AbstractSeleniumTest.java:324)
	at org.apache.archiva.web.test.SearchTest.testViewSearchedArtifact(SearchTest.java:50)


    testUserWithRepoManagerInternalRole :
  com.thoughtworks.selenium.SeleniumException
  com.thoughtworks.selenium.SeleniumException: Timed out after 60000ms
	at com.thoughtworks.selenium.HttpCommandProcessor.throwAssertionFailureExceptionOrError(HttpCommandProcessor.java:90)
	at com.thoughtworks.selenium.HttpCommandProcessor.doCommand(HttpCommandProcessor.java:84)
	at com.thoughtworks.selenium.DefaultSelenium.waitForPageToLoad(DefaultSelenium.java:626)
	at org.apache.archiva.web.test.parent.AbstractSeleniumTest.waitPage(AbstractSeleniumTest.java:223)
	at org.apache.archiva.web.test.parent.AbstractSeleniumTest.clickLinkWithLocator(AbstractSeleniumTest.java:353)
	at org.apache.archiva.web.test.parent.AbstractSeleniumTest.clickLinkWithText(AbstractSeleniumTest.java:329)
	at org.apache.archiva.web.test.parent.AbstractSeleniumTest.clickLinkWithText(AbstractSeleniumTest.java:324)
	at org.apache.archiva.web.test.UserRolesTest.testUserWithRepoManagerInternalRole(UserRolesTest.java:226)


    testAddManagedRepoValidValues :
  java.lang.AssertionError
  java.lang.AssertionError: 'link=Repositories' isn't present. expected:<true> but was:<false>
	at org.testng.Assert.fail(Assert.java:84)
	at org.testng.Assert.failNotEquals(Assert.java:438)
	at org.testng.Assert.assertTrue(Assert.java:32)
	at org.apache.archiva.web.test.parent.AbstractSeleniumTest.assertElementPresent(AbstractSeleniumTest.java:169)
	at org.apache.archiva.web.test.parent.AbstractSeleniumTest.clickLinkWithLocator(AbstractSeleniumTest.java:349)
	at org.apache.archiva.web.test.parent.AbstractSeleniumTest.clickLinkWithText(AbstractSeleniumTest.java:329)
	at org.apache.archiva.web.test.parent.AbstractSeleniumTest.clickLinkWithText(AbstractSeleniumTest.java:324)
	at org.apache.archiva.web.test.parent.AbstractRepositoryTest.goToRepositoriesPage(AbstractRepositoryTest.java:220)
	at org.apache.archiva.web.test.RepositoryTest.testAddManagedRepoValidValues(RepositoryTest.java:32)


    testAddAppearanceNullValues :
  java.lang.AssertionError
  java.lang.AssertionError: 'link=Appearance' isn't present. expected:<true> but was:<false>
	at org.testng.Assert.fail(Assert.java:84)
	at org.testng.Assert.failNotEquals(Assert.java:438)
	at org.testng.Assert.assertTrue(Assert.java:32)
	at org.apache.archiva.web.test.parent.AbstractSeleniumTest.assertElementPresent(AbstractSeleniumTest.java:169)
	at org.apache.archiva.web.test.parent.AbstractSeleniumTest.clickLinkWithLocator(AbstractSeleniumTest.java:349)
	at org.apache.archiva.web.test.parent.AbstractSeleniumTest.clickLinkWithText(AbstractSeleniumTest.java:329)
	at org.apache.archiva.web.test.parent.AbstractSeleniumTest.clickLinkWithText(AbstractSeleniumTest.java:324)
	at org.apache.archiva.web.test.parent.AbstractArchivaTest.goToAppearancePage(AbstractArchivaTest.java:430)
	at org.apache.archiva.web.test.AppearanceTest.testAddAppearanceNullValues(AppearanceTest.java:30)

    testAddArtifactFileType_NullValue :
  java.lang.AssertionError
  java.lang.AssertionError: 'link=Repository Scanning' isn't present. expected:<true>
but was:<false>
	at org.testng.Assert.fail(Assert.java:84)
	at org.testng.Assert.failNotEquals(Assert.java:438)
	at org.testng.Assert.assertTrue(Assert.java:32)
	at org.apache.archiva.web.test.parent.AbstractSeleniumTest.assertElementPresent(AbstractSeleniumTest.java:169)
	at org.apache.archiva.web.test.parent.AbstractSeleniumTest.clickLinkWithLocator(AbstractSeleniumTest.java:349)
	at org.apache.archiva.web.test.parent.AbstractSeleniumTest.clickLinkWithText(AbstractSeleniumTest.java:329)
	at org.apache.archiva.web.test.parent.AbstractSeleniumTest.clickLinkWithText(AbstractSeleniumTest.java:324)
	at org.apache.archiva.web.test.parent.AbstractRepositoryTest.goToRepositoryScanningPage(AbstractRepositoryTest.java:332)
	at org.apache.archiva.web.test.RepositoryScanningTest.testAddArtifactFileType_NullValue(RepositoryScanningTest.java:31)


    testAddLegacyArtifact_NullValues :
  java.lang.AssertionError
  java.lang.AssertionError: 'link=Legacy Support' isn't present. expected:<true> but
was:<false>
	at org.testng.Assert.fail(Assert.java:84)
	at org.testng.Assert.failNotEquals(Assert.java:438)
	at org.testng.Assert.assertTrue(Assert.java:32)
	at org.apache.archiva.web.test.parent.AbstractSeleniumTest.assertElementPresent(AbstractSeleniumTest.java:169)
	at org.apache.archiva.web.test.parent.AbstractSeleniumTest.clickLinkWithLocator(AbstractSeleniumTest.java:349)
	at org.apache.archiva.web.test.parent.AbstractSeleniumTest.clickLinkWithText(AbstractSeleniumTest.java:329)
	at org.apache.archiva.web.test.parent.AbstractSeleniumTest.clickLinkWithText(AbstractSeleniumTest.java:324)
	at org.apache.archiva.web.test.parent.AbstractArtifactManagementTest.goToLegacySupportPage(AbstractArtifactManagementTest.java:126)
	at org.apache.archiva.web.test.LegacySupportTest.testAddLegacyArtifact_NullValues(LegacySupportTest.java:31)


  



Mime
View raw message