archiva-notifications mailing list archives

Site index · List index
Message view « Date » · « Thread »
Top « Date » · « Thread »
From "Continuum@vmbuild.apache.org" <contin...@apache.org>
Subject [continuum] BUILD FAILURE: Archiva - Archiva Web :: WebDAV -
Date Tue, 22 Sep 2009 03:04:10 GMT
Online report : http://vmbuild.apache.org/continuum/buildResult.action?buildId=217799&projectId=684

Build statistics:
  State: Failed
  Previous State: Failed
  Started at: Mon 21 Sep 2009 19:53:44 -0700
  Finished at: Mon 21 Sep 2009 20:04:01 -0700
  Total time: 10m 16s
  Build Trigger: Schedule
  Build Number: 547
  Exit code: 1
  Building machine hostname: vmbuild.apache.org
  Operating system : Linux(unknown)
  Java Home version : 
          java version "1.5.0_12"
          Java(TM) 2 Runtime Environment, Standard Edition (build 1.5.0_12-b04)
          Java HotSpot(TM) Client VM (build 1.5.0_12-b04, mixed mode, sharing)
        
  Builder version :
          Maven version: 2.0.9
          Java version: 1.5.0_12
          OS name: "linux" version: "2.6.24-23-server" arch: "i386" Family: "unix"
    
****************************************************************************
SCM Changes:
****************************************************************************
No files changed

****************************************************************************
Dependencies Changes:
****************************************************************************
org.apache.archiva:archiva-configuration:1.2.3-SNAPSHOT

org.apache.archiva:archiva-repository-layer:1.2.3-SNAPSHOT

org.apache.archiva:archiva-scheduled:1.2.3-SNAPSHOT

org.apache.archiva:archiva-proxy:1.2.3-SNAPSHOT

org.apache.archiva:archiva-security:1.2.3-SNAPSHOT

org.apache.archiva:archiva-web:1.2.3-SNAPSHOT


****************************************************************************
Build Definition:
****************************************************************************
POM filename: pom.xml
Goals: clean install   
Arguments: --batch-mode --non-recursive -PbuildWithAdditionalRepos,headless
Build Fresh: true
Always Build: false
Default Build Definition: true
Schedule: DEFAULT_SCHEDULE
Profile Name: Maven 2.0.9, Java 5
Description: 

****************************************************************************
Test Summary:
****************************************************************************
Tests: 15
Failures: 1
Errors: 2
Success Rate: 80
Total time: 68.59

****************************************************************************
Test Failures:
****************************************************************************

RepositoryServletProxiedTimestampedSnapshotPolicyTest
    testGetProxiedSnapshotsArtifactPolicyOnceFail :
  junit.framework.AssertionFailedError
  junit.framework.AssertionFailedError: Should have been an OK response code expected:<200>
but was:<404>
	at junit.framework.Assert.fail(Assert.java:47)
	at junit.framework.Assert.failNotEquals(Assert.java:282)
	at junit.framework.Assert.assertEquals(Assert.java:64)
	at junit.framework.Assert.assertEquals(Assert.java:201)
	at org.apache.maven.archiva.webdav.AbstractRepositoryServletTestCase.assertResponseOK(AbstractRepositoryServletTestCase.java:90)
	at org.apache.maven.archiva.webdav.AbstractRepositoryServletProxiedTestCase.assertServerSetupCorrectly(AbstractRepositoryServletProxiedTestCase.java:152)
	at org.apache.maven.archiva.webdav.AbstractRepositoryServletProxiedTestCase.setupSnapshotsRemoteRepo(AbstractRepositoryServletProxiedTestCase.java:231)
	at org.apache.maven.archiva.webdav.RepositoryServletProxiedTimestampedSnapshotPolicyTest.assertGetProxiedSnapshotsArtifactWithPolicy(RepositoryServletProxiedTimestampedSnapshotPolicyTest.java:149)
	at org.apache.maven.archiva.webdav.RepositoryServletProxiedTimestampedSnapshotPolicyTest.assertGetProxiedSnapshotsArtifactWithPolicy(RepositoryServletProxiedTimestampedSnapshotPolicyTest.java:141)
	at org.apache.maven.archiva.webdav.RepositoryServletProxiedTimestampedSnapshotPolicyTest.testGetProxiedSnapshotsArtifactPolicyOnceFail(RepositoryServletProxiedTimestampedSnapshotPolicyTest.java:122)

    testGetProxiedSnapshotsArtifactPolicyOnceNoManagedContent :
  java.io.FileNotFoundException
  java.io.FileNotFoundException: Source '/home/continuum/services/continuum/data/working-directory/684/src/test/resources/repository-archiva.xml'
does not exist
	at org.apache.commons.io.FileUtils.copyFile(FileUtils.java:637)
	at org.apache.commons.io.FileUtils.copyFile(FileUtils.java:607)
	at org.apache.maven.archiva.webdav.AbstractRepositoryServletTestCase.setUp(AbstractRepositoryServletTestCase.java:172)
	at org.apache.maven.archiva.webdav.AbstractRepositoryServletProxiedTestCase.setUp(AbstractRepositoryServletProxiedTestCase.java:99)
	at junit.framework.TestCase.runBare(TestCase.java:125)
	at junit.framework.TestResult$1.protect(TestResult.java:106)
	at junit.framework.TestResult.runProtected(TestResult.java:124)
	at junit.framework.TestResult.run(TestResult.java:109)
	at junit.framework.TestCase.run(TestCase.java:118)
	at junit.framework.TestSuite.runTest(TestSuite.java:208)
	at junit.framework.TestSuite.run(TestSuite.java:203)
	at sun.reflect.GeneratedMethodAccessor28.invoke(Unknown Source)
	at sun.reflect.DelegatingMethodAccessorImpl.invoke(DelegatingMethodAccessorImpl.java:25)
	at java.lang.reflect.Method.invoke(Method.java:585)
	at org.apache.maven.surefire.junit.JUnitTestSet.execute(JUnitTestSet.java:213)
	at org.apache.maven.surefire.suite.AbstractDirectoryTestSuite.executeTestSet(AbstractDirectoryTestSuite.java:140)
	at org.apache.maven.surefire.suite.AbstractDirectoryTestSuite.execute(AbstractDirectoryTestSuite.java:127)
	at org.apache.maven.surefire.Surefire.run(Surefire.java:177)
	at sun.reflect.NativeMethodAccessorImpl.invoke0(Native Method)
	at sun.reflect.NativeMethodAccessorImpl.invoke(NativeMethodAccessorImpl.java:39)
	at sun.reflect.DelegatingMethodAccessorImpl.invoke(DelegatingMethodAccessorImpl.java:25)
	at java.lang.reflect.Method.invoke(Method.java:585)
	at org.apache.maven.surefire.booter.SurefireBooter.runSuitesInProcess(SurefireBooter.java:338)
	at org.apache.maven.surefire.booter.SurefireBooter.main(SurefireBooter.java:997)


    testGetProxiedSnapshotsArtifactPolicyOncePass :
  org.springframework.beans.factory.BeanCreationException
  org.springframework.beans.factory.BeanCreationException: Error creating bean with name 'urlFailureCache'
defined in URL [jar:file:/home/continuum/.m2/repository/org/apache/archiva/archiva-policies/1.2.3-SNAPSHOT/archiva-policies-1.2.3-SNAPSHOT.jar!/META-INF/spring-context.xml]:
Cannot resolve reference to bean 'cache#url-failures-cache' while setting constructor argument;
nested exception is org.springframework.beans.factory.BeanCreationException: Error creating
bean with name 'cache#url-failures-cache': Post-processing of the FactoryBean's object failed;
nested exception is org.springframework.beans.factory.BeanInitializationException: Failed
to invoke plexus lifecycle Initializable.initialize on cache#url-failures-cache; nested exception
is org.codehaus.plexus.personality.plexus.lifecycle.phase.InitializationException: A previous
cache with name [url-failures-cache] exists.
	at org.springframework.beans.factory.support.BeanDefinitionValueResolver.resolveReference(BeanDefinitionValueResolver.java:275)
	at org.springframework.beans.factory.support.BeanDefinitionValueResolver.resolveValueIfNecessary(BeanDefinitionValueResolver.java:104)
	at org.springframework.beans.factory.support.ConstructorResolver.resolveConstructorArguments(ConstructorResolver.java:495)
	at org.springframework.beans.factory.support.ConstructorResolver.autowireConstructor(ConstructorResolver.java:162)
	at org.springframework.beans.factory.support.AbstractAutowireCapableBeanFactory.autowireConstructor(AbstractAutowireCapableBeanFactory.java:925)
	at org.springframework.beans.factory.support.AbstractAutowireCapableBeanFactory.createBeanInstance(AbstractAutowireCapableBeanFactory.java:835)
	at org.springframework.beans.factory.support.AbstractAutowireCapableBeanFactory.doCreateBean(AbstractAutowireCapableBeanFactory.java:440)
	at org.springframework.beans.factory.support.AbstractAutowireCapableBeanFactory$1.run(AbstractAutowireCapableBeanFactory.java:409)
	at java.security.AccessController.doPrivileged(Native Method)
	at org.springframework.beans.factory.support.AbstractAutowireCapableBeanFactory.createBean(AbstractAutowireCapableBeanFactory.java:380)
	at org.springframework.beans.factory.support.AbstractBeanFactory$1.getObject(AbstractBeanFactory.java:264)
	at org.springframework.beans.factory.support.DefaultSingletonBeanRegistry.getSingleton(DefaultSingletonBeanRegistry.java:222)
	at org.springframework.beans.factory.support.AbstractBeanFactory.doGetBean(AbstractBeanFactory.java:261)
	at org.springframework.beans.factory.support.AbstractBeanFactory.getBean(AbstractBeanFactory.java:185)
	at org.springframework.beans.factory.support.AbstractBeanFactory.getBean(AbstractBeanFactory.java:164)
	at org.springframework.beans.factory.support.DefaultListableBeanFactory.preInstantiateSingletons(DefaultListableBeanFactory.java:429)
	at org.springframework.context.support.AbstractApplicationContext.finishBeanFactoryInitialization(AbstractApplicationContext.java:728)
	at org.springframework.context.support.AbstractApplicationContext.refresh(AbstractApplicationContext.java:380)
	at org.springframework.context.support.ClassPathXmlApplicationContext.<init>(ClassPathXmlApplicationContext.java:139)
	at org.springframework.context.support.ClassPathXmlApplicationContext.<init>(ClassPathXmlApplicationContext.java:93)
	at org.codehaus.plexus.spring.PlexusClassPathXmlApplicationContext.<init>(PlexusClassPathXmlApplicationContext.java:91)
	at org.codehaus.plexus.spring.PlexusInSpringTestCase.setUp(PlexusInSpringTestCase.java:45)
	at org.apache.maven.archiva.webdav.AbstractRepositoryServletTestCase.setUp(AbstractRepositoryServletTestCase.java:165)
	at org.apache.maven.archiva.webdav.AbstractRepositoryServletProxiedTestCase.setUp(AbstractRepositoryServletProxiedTestCase.java:99)
	at junit.framework.TestCase.runBare(TestCase.java:125)
	at junit.framework.TestResult$1.protect(TestResult.java:106)
	at junit.framework.TestResult.runProtected(TestResult.java:124)
	at junit.framework.TestResult.run(TestResult.java:109)
	at junit.framework.TestCase.run(TestCase.java:118)
	at junit.framework.TestSuite.runTest(TestSuite.java:208)
	at junit.framework.TestSuite.run(TestSuite.java:203)
	at sun.reflect.GeneratedMethodAccessor28.invoke(Unknown Source)
	at sun.reflect.DelegatingMethodAccessorImpl.invoke(DelegatingMethodAccessorImpl.java:25)
	at java.lang.reflect.Method.invoke(Method.java:585)
	at org.apache.maven.surefire.junit.JUnitTestSet.execute(JUnitTestSet.java:213)
	at org.apache.maven.surefire.suite.AbstractDirectoryTestSuite.executeTestSet(AbstractDirectoryTestSuite.java:140)
	at org.apache.maven.surefire.suite.AbstractDirectoryTestSuite.execute(AbstractDirectoryTestSuite.java:127)
	at org.apache.maven.surefire.Surefire.run(Surefire.java:177)
	at sun.reflect.NativeMethodAccessorImpl.invoke0(Native Method)
	at sun.reflect.NativeMethodAccessorImpl.invoke(NativeMethodAccessorImpl.java:39)
	at sun.reflect.DelegatingMethodAccessorImpl.invoke(DelegatingMethodAccessorImpl.java:25)
	at java.lang.reflect.Method.invoke(Method.java:585)
	at org.apache.maven.surefire.booter.SurefireBooter.runSuitesInProcess(SurefireBooter.java:338)
	at org.apache.maven.surefire.booter.SurefireBooter.main(SurefireBooter.java:997)
Caused by: org.springframework.beans.factory.BeanCreationException: Error creating bean with
name 'cache#url-failures-cache': Post-processing of the FactoryBean's object failed; nested
exception is org.springframework.beans.factory.BeanInitializationException: Failed to invoke
plexus lifecycle Initializable.initialize on cache#url-failures-cache; nested exception is
org.codehaus.plexus.personality.plexus.lifecycle.phase.InitializationException: A previous
cache with name [url-failures-cache] exists.
	at org.springframework.beans.factory.support.FactoryBeanRegistrySupport$1.run(FactoryBeanRegistrySupport.java:142)
	at java.security.AccessController.doPrivileged(Native Method)
	at org.springframework.beans.factory.support.FactoryBeanRegistrySupport.doGetObjectFromFactoryBean(FactoryBeanRegistrySupport.java:116)
	at org.springframework.beans.factory.support.FactoryBeanRegistrySupport.getObjectFromFactoryBean(FactoryBeanRegistrySupport.java:91)
	at org.springframework.beans.factory.support.AbstractBeanFactory.getObjectForBeanInstance(AbstractBeanFactory.java:1288)
	at org.springframework.beans.factory.support.AbstractBeanFactory.doGetBean(AbstractBeanFactory.java:275)
	at org.springframework.beans.factory.support.AbstractBeanFactory.getBean(AbstractBeanFactory.java:185)
	at org.springframework.beans.factory.support.AbstractBeanFactory.getBean(AbstractBeanFactory.java:164)
	at org.springframework.beans.factory.support.BeanDefinitionValueResolver.resolveReference(BeanDefinitionValueResolver.java:269)
	... 43 more
Caused by: org.springframework.beans.factory.BeanInitializationException: Failed to invoke
plexus lifecycle Initializable.initialize on cache#url-failures-cache; nested exception is
org.codehaus.plexus.personality.plexus.lifecycle.phase.InitializationException: A previous
cache with name [url-failures-cache] exists.
	at org.codehaus.plexus.spring.PlexusLifecycleBeanPostProcessor.postProcessAfterInitialization(PlexusLifecycleBeanPostProcessor.java:221)
	at org.springframework.beans.factory.support.AbstractAutowireCapableBeanFactory.applyBeanPostProcessorsAfterInitialization(AbstractAutowireCapableBeanFactory.java:361)
	at org.springframework.beans.factory.support.AbstractAutowireCapableBeanFactory.postProcessObjectFromFactoryBean(AbstractAutowireCapableBeanFactory.java:1429)
	at org.springframework.beans.factory.support.FactoryBeanRegistrySupport$1.run(FactoryBeanRegistrySupport.java:139)
	... 51 more
Caused by: org.codehaus.plexus.personality.plexus.lifecycle.phase.InitializationException:
A previous cache with name [url-failures-cache] exists.
	at org.codehaus.plexus.cache.ehcache.EhcacheCache.initialize(EhcacheCache.java:237)
	at org.codehaus.plexus.spring.PlexusLifecycleBeanPostProcessor.postProcessAfterInitialization(PlexusLifecycleBeanPostProcessor.java:217)
	... 54 more
Caused by: org.springframework.beans.factory.BeanCreationException: Error creating bean with
name 'cache#url-failures-cache': Post-processing of the FactoryBean's object failed; nested
exception is org.springframework.beans.factory.BeanInitializationException: Failed to invoke
plexus lifecycle Initializable.initialize on cache#url-failures-cache; nested exception is
org.codehaus.plexus.personality.plexus.lifecycle.phase.InitializationException: A previous
cache with name [url-failures-cache] exists.
	at org.springframework.beans.factory.support.FactoryBeanRegistrySupport$1.run(FactoryBeanRegistrySupport.java:142)
	at java.security.AccessController.doPrivileged(Native Method)
	at org.springframework.beans.factory.support.FactoryBeanRegistrySupport.doGetObjectFromFactoryBean(FactoryBeanRegistrySupport.java:116)
	at org.springframework.beans.factory.support.FactoryBeanRegistrySupport.getObjectFromFactoryBean(FactoryBeanRegistrySupport.java:91)
	at org.springframework.beans.factory.support.AbstractBeanFactory.getObjectForBeanInstance(AbstractBeanFactory.java:1288)
	at org.springframework.beans.factory.support.AbstractBeanFactory.doGetBean(AbstractBeanFactory.java:275)
	at org.springframework.beans.factory.support.AbstractBeanFactory.getBean(AbstractBeanFactory.java:185)
	at org.springframework.beans.factory.support.AbstractBeanFactory.getBean(AbstractBeanFactory.java:164)
	at org.springframework.beans.factory.support.BeanDefinitionValueResolver.resolveReference(BeanDefinitionValueResolver.java:269)
	... 43 more
Caused by: org.springframework.beans.factory.BeanInitializationException: Failed to invoke
plexus lifecycle Initializable.initialize on cache#url-failures-cache; nested exception is
org.codehaus.plexus.personality.plexus.lifecycle.phase.InitializationException: A previous
cache with name [url-failures-cache] exists.
	at org.codehaus.plexus.spring.PlexusLifecycleBeanPostProcessor.postProcessAfterInitialization(PlexusLifecycleBeanPostProcessor.java:221)
	at org.springframework.beans.factory.support.AbstractAutowireCapableBeanFactory.applyBeanPostProcessorsAfterInitialization(AbstractAutowireCapableBeanFactory.java:361)
	at org.springframework.beans.factory.support.AbstractAutowireCapableBeanFactory.postProcessObjectFromFactoryBean(AbstractAutowireCapableBeanFactory.java:1429)
	at org.springframework.beans.factory.support.FactoryBeanRegistrySupport$1.run(FactoryBeanRegistrySupport.java:139)
	... 51 more
Caused by: org.codehaus.plexus.personality.plexus.lifecycle.phase.InitializationException:
A previous cache with name [url-failures-cache] exists.
	at org.codehaus.plexus.cache.ehcache.EhcacheCache.initialize(EhcacheCache.java:237)
	at org.codehaus.plexus.spring.PlexusLifecycleBeanPostProcessor.postProcessAfterInitialization(PlexusLifecycleBeanPostProcessor.java:217)
	... 54 more


  



Mime
View raw message