archiva-notifications mailing list archives

Site index · List index
Message view « Date » · « Thread »
Top « Date » · « Thread »
From "Continuum@vmbuild.apache.org" <contin...@apache.org>
Subject [continuum] BUILD FAILURE: Archiva - Archiva Web :: Application Tests -
Date Mon, 21 Sep 2009 16:14:26 GMT
Online report : http://vmbuild.apache.org/continuum/buildResult.action?buildId=217487&projectId=2464

Build statistics:
  State: Failed
  Previous State: Failed
  Started at: Mon 21 Sep 2009 08:55:11 -0700
  Finished at: Mon 21 Sep 2009 09:14:09 -0700
  Total time: 18m 57s
  Build Trigger: Schedule
  Build Number: 9
  Exit code: 1
  Building machine hostname: vmbuild.apache.org
  Operating system : Linux(unknown)
  Java Home version : 
          java version "1.5.0_12"
          Java(TM) 2 Runtime Environment, Standard Edition (build 1.5.0_12-b04)
          Java HotSpot(TM) Client VM (build 1.5.0_12-b04, mixed mode, sharing)
        
  Builder version :
          Maven version: 2.0.9
          Java version: 1.5.0_12
          OS name: "linux" version: "2.6.24-23-server" arch: "i386" Family: "unix"
    
****************************************************************************
SCM Changes:
****************************************************************************
No files changed

****************************************************************************
Dependencies Changes:
****************************************************************************
org.apache.archiva:archiva-webapp:1.2.3-SNAPSHOT

org.apache.archiva:archiva-web:1.2.3-SNAPSHOT


****************************************************************************
Build Definition:
****************************************************************************
POM filename: pom.xml
Goals: clean install   
Arguments: --batch-mode --non-recursive -PbuildWithAdditionalRepos,headless
Build Fresh: true
Always Build: false
Default Build Definition: true
Schedule: DEFAULT_SCHEDULE
Profile Name: Maven 2.0.9, Java 5
Description: 

****************************************************************************
Test Summary:
****************************************************************************
Tests: 93
Failures: 2
Errors: 0
Success Rate: 97
Total time: 951.049

****************************************************************************
Test Failures:
****************************************************************************

TestSuite
    testViewSearchedArtifact :
  com.thoughtworks.selenium.SeleniumException
  com.thoughtworks.selenium.SeleniumException: Timed out after 60000ms
	at com.thoughtworks.selenium.HttpCommandProcessor.throwAssertionFailureExceptionOrError(HttpCommandProcessor.java:90)
	at com.thoughtworks.selenium.HttpCommandProcessor.doCommand(HttpCommandProcessor.java:84)
	at com.thoughtworks.selenium.DefaultSelenium.waitForPageToLoad(DefaultSelenium.java:626)
	at org.apache.archiva.web.test.parent.AbstractSeleniumTest.waitPage(AbstractSeleniumTest.java:223)
	at org.apache.archiva.web.test.parent.AbstractSeleniumTest.clickLinkWithLocator(AbstractSeleniumTest.java:353)
	at org.apache.archiva.web.test.parent.AbstractSeleniumTest.clickLinkWithText(AbstractSeleniumTest.java:329)
	at org.apache.archiva.web.test.parent.AbstractSeleniumTest.clickLinkWithText(AbstractSeleniumTest.java:324)
	at org.apache.archiva.web.test.SearchTest.testViewSearchedArtifact(SearchTest.java:50)


    testBasicAddDeleteUser :
  com.thoughtworks.selenium.SeleniumException
  com.thoughtworks.selenium.SeleniumException: Timed out after 60000ms
	at com.thoughtworks.selenium.HttpCommandProcessor.throwAssertionFailureExceptionOrError(HttpCommandProcessor.java:90)
	at com.thoughtworks.selenium.HttpCommandProcessor.doCommand(HttpCommandProcessor.java:84)
	at com.thoughtworks.selenium.DefaultSelenium.waitForPageToLoad(DefaultSelenium.java:626)
	at org.apache.archiva.web.test.parent.AbstractSeleniumTest.waitPage(AbstractSeleniumTest.java:223)
	at org.apache.archiva.web.test.parent.AbstractSeleniumTest.clickLinkWithLocator(AbstractSeleniumTest.java:353)
	at org.apache.archiva.web.test.parent.AbstractSeleniumTest.clickLinkWithText(AbstractSeleniumTest.java:329)
	at org.apache.archiva.web.test.parent.AbstractSeleniumTest.clickLinkWithText(AbstractSeleniumTest.java:324)
	at org.apache.archiva.web.test.parent.AbstractArchivaTest.createUser(AbstractArchivaTest.java:228)
	at org.apache.archiva.web.test.parent.AbstractArchivaTest.createUser(AbstractArchivaTest.java:222)
	at org.apache.archiva.web.test.UserRolesTest.testBasicAddDeleteUser(UserRolesTest.java:35)


  



Mime
View raw message