archiva-notifications mailing list archives

Site index · List index
Message view « Date » · « Thread »
Top « Date » · « Thread »
From "Continuum@vmbuild.apache.org" <contin...@apache.org>
Subject [continuum] BUILD FAILURE: Archiva - Archiva Web :: Application Tests -
Date Sat, 19 Sep 2009 05:03:17 GMT
Online report : http://vmbuild.apache.org/continuum/buildResult.action?buildId=215997&projectId=2464

Build statistics:
  State: Failed
  Previous State: Failed
  Started at: Fri 18 Sep 2009 21:44:50 -0700
  Finished at: Fri 18 Sep 2009 22:03:00 -0700
  Total time: 18m 10s
  Build Trigger: Schedule
  Build Number: 6
  Exit code: 1
  Building machine hostname: vmbuild.apache.org
  Operating system : Linux(unknown)
  Java Home version : 
          java version "1.5.0_12"
          Java(TM) 2 Runtime Environment, Standard Edition (build 1.5.0_12-b04)
          Java HotSpot(TM) Client VM (build 1.5.0_12-b04, mixed mode, sharing)
        
  Builder version :
          Maven version: 2.0.9
          Java version: 1.5.0_12
          OS name: "linux" version: "2.6.24-23-server" arch: "i386" Family: "unix"
    
****************************************************************************
SCM Changes:
****************************************************************************
No files changed

****************************************************************************
Dependencies Changes:
****************************************************************************
org.apache.archiva:archiva-webapp:1.2.3-SNAPSHOT

org.apache.archiva:archiva-web:1.2.3-SNAPSHOT


****************************************************************************
Build Definition:
****************************************************************************
POM filename: pom.xml
Goals: clean install   
Arguments: --batch-mode --non-recursive -PbuildWithAdditionalRepos,headless
Build Fresh: true
Always Build: false
Default Build Definition: true
Schedule: DEFAULT_SCHEDULE
Profile Name: Maven 2.0.9, Java 5
Description: 

****************************************************************************
Test Summary:
****************************************************************************
Tests: 93
Failures: 5
Errors: 0
Success Rate: 94
Total time: 580.615

****************************************************************************
Test Failures:
****************************************************************************

TestSuite
    testUserWithGlobalRepoObserverRole :
  com.thoughtworks.selenium.SeleniumException
  com.thoughtworks.selenium.SeleniumException: Timed out after 30000ms
	at com.thoughtworks.selenium.HttpCommandProcessor.throwAssertionFailureExceptionOrError(HttpCommandProcessor.java:90)
	at com.thoughtworks.selenium.HttpCommandProcessor.doCommand(HttpCommandProcessor.java:84)
	at com.thoughtworks.selenium.DefaultSelenium.open(DefaultSelenium.java:334)
	at org.apache.archiva.web.test.parent.AbstractArchivaTest.goToLoginPage(AbstractArchivaTest.java:102)
	at org.apache.archiva.web.test.parent.AbstractArchivaTest.login(AbstractArchivaTest.java:276)
	at org.apache.archiva.web.test.parent.AbstractArchivaTest.login(AbstractArchivaTest.java:269)
	at org.apache.archiva.web.test.UserRolesTest.testUserWithGlobalRepoObserverRole(UserRolesTest.java:200)

    testAddManagedRepoValidValues :
  java.lang.AssertionError
  java.lang.AssertionError: 'link=Repositories' isn't present. expected:<true> but was:<false>
	at org.testng.Assert.fail(Assert.java:84)
	at org.testng.Assert.failNotEquals(Assert.java:438)
	at org.testng.Assert.assertTrue(Assert.java:32)
	at org.apache.archiva.web.test.parent.AbstractSeleniumTest.assertElementPresent(AbstractSeleniumTest.java:169)
	at org.apache.archiva.web.test.parent.AbstractSeleniumTest.clickLinkWithLocator(AbstractSeleniumTest.java:349)
	at org.apache.archiva.web.test.parent.AbstractSeleniumTest.clickLinkWithText(AbstractSeleniumTest.java:329)
	at org.apache.archiva.web.test.parent.AbstractSeleniumTest.clickLinkWithText(AbstractSeleniumTest.java:324)
	at org.apache.archiva.web.test.parent.AbstractRepositoryTest.goToRepositoriesPage(AbstractRepositoryTest.java:220)
	at org.apache.archiva.web.test.RepositoryTest.testAddManagedRepoValidValues(RepositoryTest.java:32)


    testAddAppearanceNullValues :
  java.lang.AssertionError
  java.lang.AssertionError: 'link=Appearance' isn't present. expected:<true> but was:<false>
	at org.testng.Assert.fail(Assert.java:84)
	at org.testng.Assert.failNotEquals(Assert.java:438)
	at org.testng.Assert.assertTrue(Assert.java:32)
	at org.apache.archiva.web.test.parent.AbstractSeleniumTest.assertElementPresent(AbstractSeleniumTest.java:169)
	at org.apache.archiva.web.test.parent.AbstractSeleniumTest.clickLinkWithLocator(AbstractSeleniumTest.java:349)
	at org.apache.archiva.web.test.parent.AbstractSeleniumTest.clickLinkWithText(AbstractSeleniumTest.java:329)
	at org.apache.archiva.web.test.parent.AbstractSeleniumTest.clickLinkWithText(AbstractSeleniumTest.java:324)
	at org.apache.archiva.web.test.parent.AbstractArchivaTest.goToAppearancePage(AbstractArchivaTest.java:430)
	at org.apache.archiva.web.test.AppearanceTest.testAddAppearanceNullValues(AppearanceTest.java:30)


    testAddArtifactFileType_NullValue :
  java.lang.AssertionError
  java.lang.AssertionError: 'link=Repository Scanning' isn't present. expected:<true>
but was:<false>
	at org.testng.Assert.fail(Assert.java:84)
	at org.testng.Assert.failNotEquals(Assert.java:438)
	at org.testng.Assert.assertTrue(Assert.java:32)
	at org.apache.archiva.web.test.parent.AbstractSeleniumTest.assertElementPresent(AbstractSeleniumTest.java:169)
	at org.apache.archiva.web.test.parent.AbstractSeleniumTest.clickLinkWithLocator(AbstractSeleniumTest.java:349)
	at org.apache.archiva.web.test.parent.AbstractSeleniumTest.clickLinkWithText(AbstractSeleniumTest.java:329)
	at org.apache.archiva.web.test.parent.AbstractSeleniumTest.clickLinkWithText(AbstractSeleniumTest.java:324)
	at org.apache.archiva.web.test.parent.AbstractRepositoryTest.goToRepositoryScanningPage(AbstractRepositoryTest.java:332)
	at org.apache.archiva.web.test.RepositoryScanningTest.testAddArtifactFileType_NullValue(RepositoryScanningTest.java:31)


    testAddLegacyArtifact_NullValues :
  java.lang.AssertionError
  java.lang.AssertionError: 'link=Legacy Support' isn't present. expected:<true> but
was:<false>
	at org.testng.Assert.fail(Assert.java:84)
	at org.testng.Assert.failNotEquals(Assert.java:438)
	at org.testng.Assert.assertTrue(Assert.java:32)
	at org.apache.archiva.web.test.parent.AbstractSeleniumTest.assertElementPresent(AbstractSeleniumTest.java:169)
	at org.apache.archiva.web.test.parent.AbstractSeleniumTest.clickLinkWithLocator(AbstractSeleniumTest.java:349)
	at org.apache.archiva.web.test.parent.AbstractSeleniumTest.clickLinkWithText(AbstractSeleniumTest.java:329)
	at org.apache.archiva.web.test.parent.AbstractSeleniumTest.clickLinkWithText(AbstractSeleniumTest.java:324)
	at org.apache.archiva.web.test.parent.AbstractArtifactManagementTest.goToLegacySupportPage(AbstractArtifactManagementTest.java:126)
	at org.apache.archiva.web.test.LegacySupportTest.testAddLegacyArtifact_NullValues(LegacySupportTest.java:31)


  



Mime
View raw message