archiva-notifications mailing list archives

Site index · List index
Message view « Date » · « Thread »
Top « Date » · « Thread »
From "Continuum@vmbuild.apache.org" <contin...@apache.org>
Subject [continuum] BUILD FAILURE: Archiva - Archiva Web :: Application Tests -
Date Mon, 21 Sep 2009 19:44:33 GMT
Online report : http://vmbuild.apache.org/continuum/buildResult.action?buildId=217587&projectId=2464

Build statistics:
  State: Failed
  Previous State: Failed
  Started at: Mon 21 Sep 2009 12:36:43 -0700
  Finished at: Mon 21 Sep 2009 12:43:59 -0700
  Total time: 7m 16s
  Build Trigger: Schedule
  Build Number: 9
  Exit code: 1
  Building machine hostname: vmbuild.apache.org
  Operating system : Linux(unknown)
  Java Home version : 
          java version "1.5.0_12"
          Java(TM) 2 Runtime Environment, Standard Edition (build 1.5.0_12-b04)
          Java HotSpot(TM) Client VM (build 1.5.0_12-b04, mixed mode, sharing)
        
  Builder version :
          Maven version: 2.0.9
          Java version: 1.5.0_12
          OS name: "linux" version: "2.6.24-23-server" arch: "i386" Family: "unix"
    
****************************************************************************
SCM Changes:
****************************************************************************
No files changed

****************************************************************************
Dependencies Changes:
****************************************************************************
org.apache.archiva:archiva-webapp:1.2.3-SNAPSHOT

org.apache.archiva:archiva-web:1.2.3-SNAPSHOT


****************************************************************************
Build Definition:
****************************************************************************
POM filename: pom.xml
Goals: clean install   
Arguments: --batch-mode --non-recursive -PbuildWithAdditionalRepos,headless
Build Fresh: true
Always Build: false
Default Build Definition: true
Schedule: DEFAULT_SCHEDULE
Profile Name: Maven 2.0.9, Java 5
Description: 

****************************************************************************
Test Summary:
****************************************************************************
Tests: 93
Failures: 17
Errors: 0
Success Rate: 81
Total time: 178.801

****************************************************************************
Test Failures:
****************************************************************************

TestSuite
    testAddArtifactValidValues :
  java.lang.AssertionError
  java.lang.AssertionError: 'Artifact 'test:test:1.0' was successfully deployed to repository
'internal'' isn't present. expected:<true> but was:<false>
	at org.testng.Assert.fail(Assert.java:84)
	at org.testng.Assert.failNotEquals(Assert.java:438)
	at org.testng.Assert.assertTrue(Assert.java:32)
	at org.apache.archiva.web.test.parent.AbstractSeleniumTest.assertTextPresent(AbstractSeleniumTest.java:159)
	at org.apache.archiva.web.test.ArtifactManagementTest.testAddArtifactValidValues(ArtifactManagementTest.java:89)


    testDeleteArtifactInvalidVersion :
  java.lang.AssertionError
  java.lang.AssertionError: 'link=Delete Artifact' isn't present. expected:<true> but
was:<false>
	at org.testng.Assert.fail(Assert.java:84)
	at org.testng.Assert.failNotEquals(Assert.java:438)
	at org.testng.Assert.assertTrue(Assert.java:32)
	at org.apache.archiva.web.test.parent.AbstractSeleniumTest.assertElementPresent(AbstractSeleniumTest.java:169)
	at org.apache.archiva.web.test.parent.AbstractSeleniumTest.clickLinkWithLocator(AbstractSeleniumTest.java:349)
	at org.apache.archiva.web.test.parent.AbstractSeleniumTest.clickLinkWithText(AbstractSeleniumTest.java:329)
	at org.apache.archiva.web.test.parent.AbstractSeleniumTest.clickLinkWithText(AbstractSeleniumTest.java:324)
	at org.apache.archiva.web.test.parent.AbstractArtifactManagementTest.goToDeleteArtifactPage(AbstractArtifactManagementTest.java:54)
	at org.apache.archiva.web.test.parent.AbstractArtifactManagementTest.deleteArtifact(AbstractArtifactManagementTest.java:84)
	at org.apache.archiva.web.test.ArtifactManagementTest.testDeleteArtifactInvalidVersion(ArtifactManagementTest.java:131)

    testSearchNonExistingArtifact :
  java.lang.AssertionError
  java.lang.AssertionError: 'link=Search' isn't present. expected:<true> but was:<false>
	at org.testng.Assert.fail(Assert.java:84)
	at org.testng.Assert.failNotEquals(Assert.java:438)
	at org.testng.Assert.assertTrue(Assert.java:32)
	at org.apache.archiva.web.test.parent.AbstractSeleniumTest.assertElementPresent(AbstractSeleniumTest.java:169)
	at org.apache.archiva.web.test.parent.AbstractSeleniumTest.clickLinkWithLocator(AbstractSeleniumTest.java:349)
	at org.apache.archiva.web.test.parent.AbstractSeleniumTest.clickLinkWithText(AbstractSeleniumTest.java:329)
	at org.apache.archiva.web.test.parent.AbstractSeleniumTest.clickLinkWithText(AbstractSeleniumTest.java:324)
	at org.apache.archiva.web.test.parent.AbstractSearchTest.searchForArtifact(AbstractSearchTest.java:47)
	at org.apache.archiva.web.test.SearchTest.testSearchNonExistingArtifact(SearchTest.java:33)

    testAddRepositoryGroupValidValue :
  java.lang.AssertionError
  java.lang.AssertionError: 'link=Repository Groups' isn't present. expected:<true>
but was:<false>
	at org.testng.Assert.fail(Assert.java:84)
	at org.testng.Assert.failNotEquals(Assert.java:438)
	at org.testng.Assert.assertTrue(Assert.java:32)
	at org.apache.archiva.web.test.parent.AbstractSeleniumTest.assertElementPresent(AbstractSeleniumTest.java:169)
	at org.apache.archiva.web.test.parent.AbstractSeleniumTest.clickLinkWithLocator(AbstractSeleniumTest.java:349)
	at org.apache.archiva.web.test.parent.AbstractSeleniumTest.clickLinkWithText(AbstractSeleniumTest.java:329)
	at org.apache.archiva.web.test.parent.AbstractSeleniumTest.clickLinkWithText(AbstractSeleniumTest.java:324)
	at org.apache.archiva.web.test.parent.AbstractRepositoryTest.goToRepositoryGroupsPage(AbstractRepositoryTest.java:11)
	at org.apache.archiva.web.test.parent.AbstractRepositoryTest.addRepositoryGroup(AbstractRepositoryTest.java:54)
	at org.apache.archiva.web.test.VirtualRepositoryTest.testAddRepositoryGroupValidValue(VirtualRepositoryTest.java:38)

    testDeleteArtifact :
  java.lang.AssertionError
  java.lang.AssertionError: 'link=Delete Artifact' isn't present. expected:<true> but
was:<false>
	at org.testng.Assert.fail(Assert.java:84)
	at org.testng.Assert.failNotEquals(Assert.java:438)
	at org.testng.Assert.assertTrue(Assert.java:32)
	at org.apache.archiva.web.test.parent.AbstractSeleniumTest.assertElementPresent(AbstractSeleniumTest.java:169)
	at org.apache.archiva.web.test.parent.AbstractSeleniumTest.clickLinkWithLocator(AbstractSeleniumTest.java:349)
	at org.apache.archiva.web.test.parent.AbstractSeleniumTest.clickLinkWithText(AbstractSeleniumTest.java:329)
	at org.apache.archiva.web.test.parent.AbstractSeleniumTest.clickLinkWithText(AbstractSeleniumTest.java:324)
	at org.apache.archiva.web.test.parent.AbstractArtifactManagementTest.goToDeleteArtifactPage(AbstractArtifactManagementTest.java:54)
	at org.apache.archiva.web.test.parent.AbstractArtifactManagementTest.deleteArtifact(AbstractArtifactManagementTest.java:84)
	at org.apache.archiva.web.test.ArtifactManagementTest.testDeleteArtifact(ArtifactManagementTest.java:106)

    testDeleteArtifactNoGroupId :
  java.lang.AssertionError
  java.lang.AssertionError: 'link=Delete Artifact' isn't present. expected:<true> but
was:<false>
	at org.testng.Assert.fail(Assert.java:84)
	at org.testng.Assert.failNotEquals(Assert.java:438)
	at org.testng.Assert.assertTrue(Assert.java:32)
	at org.apache.archiva.web.test.parent.AbstractSeleniumTest.assertElementPresent(AbstractSeleniumTest.java:169)
	at org.apache.archiva.web.test.parent.AbstractSeleniumTest.clickLinkWithLocator(AbstractSeleniumTest.java:349)
	at org.apache.archiva.web.test.parent.AbstractSeleniumTest.clickLinkWithText(AbstractSeleniumTest.java:329)
	at org.apache.archiva.web.test.parent.AbstractSeleniumTest.clickLinkWithText(AbstractSeleniumTest.java:324)
	at org.apache.archiva.web.test.parent.AbstractArtifactManagementTest.goToDeleteArtifactPage(AbstractArtifactManagementTest.java:54)
	at org.apache.archiva.web.test.parent.AbstractArtifactManagementTest.deleteArtifact(AbstractArtifactManagementTest.java:84)
	at org.apache.archiva.web.test.ArtifactManagementTest.testDeleteArtifactNoGroupId(ArtifactManagementTest.java:112)

    testAddRepositoryGroupNullValue :
  java.lang.AssertionError
  java.lang.AssertionError: 'link=Repository Groups' isn't present. expected:<true>
but was:<false>
	at org.testng.Assert.fail(Assert.java:84)
	at org.testng.Assert.failNotEquals(Assert.java:438)
	at org.testng.Assert.assertTrue(Assert.java:32)
	at org.apache.archiva.web.test.parent.AbstractSeleniumTest.assertElementPresent(AbstractSeleniumTest.java:169)
	at org.apache.archiva.web.test.parent.AbstractSeleniumTest.clickLinkWithLocator(AbstractSeleniumTest.java:349)
	at org.apache.archiva.web.test.parent.AbstractSeleniumTest.clickLinkWithText(AbstractSeleniumTest.java:329)
	at org.apache.archiva.web.test.parent.AbstractSeleniumTest.clickLinkWithText(AbstractSeleniumTest.java:324)
	at org.apache.archiva.web.test.parent.AbstractRepositoryTest.goToRepositoryGroupsPage(AbstractRepositoryTest.java:11)
	at org.apache.archiva.web.test.parent.AbstractRepositoryTest.addRepositoryGroup(AbstractRepositoryTest.java:54)
	at org.apache.archiva.web.test.VirtualRepositoryTest.testAddRepositoryGroupNullValue(VirtualRepositoryTest.java:31)

    testDeleteArtifactNoArtifactId :
  java.lang.AssertionError
  java.lang.AssertionError: 'link=Delete Artifact' isn't present. expected:<true> but
was:<false>
	at org.testng.Assert.fail(Assert.java:84)
	at org.testng.Assert.failNotEquals(Assert.java:438)
	at org.testng.Assert.assertTrue(Assert.java:32)
	at org.apache.archiva.web.test.parent.AbstractSeleniumTest.assertElementPresent(AbstractSeleniumTest.java:169)
	at org.apache.archiva.web.test.parent.AbstractSeleniumTest.clickLinkWithLocator(AbstractSeleniumTest.java:349)
	at org.apache.archiva.web.test.parent.AbstractSeleniumTest.clickLinkWithText(AbstractSeleniumTest.java:329)
	at org.apache.archiva.web.test.parent.AbstractSeleniumTest.clickLinkWithText(AbstractSeleniumTest.java:324)
	at org.apache.archiva.web.test.parent.AbstractArtifactManagementTest.goToDeleteArtifactPage(AbstractArtifactManagementTest.java:54)
	at org.apache.archiva.web.test.parent.AbstractArtifactManagementTest.deleteArtifact(AbstractArtifactManagementTest.java:84)
	at org.apache.archiva.web.test.ArtifactManagementTest.testDeleteArtifactNoArtifactId(ArtifactManagementTest.java:118)

    testAddRepositoryToRepositoryGroup :
  java.lang.AssertionError
  java.lang.AssertionError: 'link=Repository Groups' isn't present. expected:<true>
but was:<false>
	at org.testng.Assert.fail(Assert.java:84)
	at org.testng.Assert.failNotEquals(Assert.java:438)
	at org.testng.Assert.assertTrue(Assert.java:32)
	at org.apache.archiva.web.test.parent.AbstractSeleniumTest.assertElementPresent(AbstractSeleniumTest.java:169)
	at org.apache.archiva.web.test.parent.AbstractSeleniumTest.clickLinkWithLocator(AbstractSeleniumTest.java:349)
	at org.apache.archiva.web.test.parent.AbstractSeleniumTest.clickLinkWithText(AbstractSeleniumTest.java:329)
	at org.apache.archiva.web.test.parent.AbstractSeleniumTest.clickLinkWithText(AbstractSeleniumTest.java:324)
	at org.apache.archiva.web.test.parent.AbstractRepositoryTest.goToRepositoryGroupsPage(AbstractRepositoryTest.java:11)
	at org.apache.archiva.web.test.parent.AbstractRepositoryTest.addRepositoryToRepositoryGroup(AbstractRepositoryTest.java:61)
	at org.apache.archiva.web.test.VirtualRepositoryTest.testAddRepositoryToRepositoryGroup(VirtualRepositoryTest.java:46)


    testAddArtifactNullValues :
  java.lang.AssertionError
  java.lang.AssertionError: 'link=Upload Artifact' isn't present. expected:<true> but
was:<false>
	at org.testng.Assert.fail(Assert.java:84)
	at org.testng.Assert.failNotEquals(Assert.java:438)
	at org.testng.Assert.assertTrue(Assert.java:32)
	at org.apache.archiva.web.test.parent.AbstractSeleniumTest.assertElementPresent(AbstractSeleniumTest.java:169)
	at org.apache.archiva.web.test.parent.AbstractSeleniumTest.clickLinkWithLocator(AbstractSeleniumTest.java:349)
	at org.apache.archiva.web.test.parent.AbstractSeleniumTest.clickLinkWithText(AbstractSeleniumTest.java:329)
	at org.apache.archiva.web.test.parent.AbstractSeleniumTest.clickLinkWithText(AbstractSeleniumTest.java:324)
	at org.apache.archiva.web.test.parent.AbstractArtifactManagementTest.goToAddArtifactPage(AbstractArtifactManagementTest.java:48)
	at org.apache.archiva.web.test.ArtifactManagementTest.testAddArtifactNullValues(ArtifactManagementTest.java:33)


    testDeleteArtifactNoVersion :
  java.lang.AssertionError
  java.lang.AssertionError: 'link=Delete Artifact' isn't present. expected:<true> but
was:<false>
	at org.testng.Assert.fail(Assert.java:84)
	at org.testng.Assert.failNotEquals(Assert.java:438)
	at org.testng.Assert.assertTrue(Assert.java:32)
	at org.apache.archiva.web.test.parent.AbstractSeleniumTest.assertElementPresent(AbstractSeleniumTest.java:169)
	at org.apache.archiva.web.test.parent.AbstractSeleniumTest.clickLinkWithLocator(AbstractSeleniumTest.java:349)
	at org.apache.archiva.web.test.parent.AbstractSeleniumTest.clickLinkWithText(AbstractSeleniumTest.java:329)
	at org.apache.archiva.web.test.parent.AbstractSeleniumTest.clickLinkWithText(AbstractSeleniumTest.java:324)
	at org.apache.archiva.web.test.parent.AbstractArtifactManagementTest.goToDeleteArtifactPage(AbstractArtifactManagementTest.java:54)
	at org.apache.archiva.web.test.parent.AbstractArtifactManagementTest.deleteArtifact(AbstractArtifactManagementTest.java:84)
	at org.apache.archiva.web.test.ArtifactManagementTest.testDeleteArtifactNoVersion(ArtifactManagementTest.java:124)

    testBasicAddDeleteUser :
  java.lang.AssertionError
  java.lang.AssertionError: 'link=User Management' isn't present. expected:<true> but
was:<false>
	at org.testng.Assert.fail(Assert.java:84)
	at org.testng.Assert.failNotEquals(Assert.java:438)
	at org.testng.Assert.assertTrue(Assert.java:32)
	at org.apache.archiva.web.test.parent.AbstractSeleniumTest.assertElementPresent(AbstractSeleniumTest.java:169)
	at org.apache.archiva.web.test.parent.AbstractSeleniumTest.clickLinkWithLocator(AbstractSeleniumTest.java:349)
	at org.apache.archiva.web.test.parent.AbstractSeleniumTest.clickLinkWithText(AbstractSeleniumTest.java:329)
	at org.apache.archiva.web.test.parent.AbstractSeleniumTest.clickLinkWithText(AbstractSeleniumTest.java:324)
	at org.apache.archiva.web.test.parent.AbstractArchivaTest.createUser(AbstractArchivaTest.java:228)
	at org.apache.archiva.web.test.parent.AbstractArchivaTest.createUser(AbstractArchivaTest.java:222)
	at org.apache.archiva.web.test.UserRolesTest.testBasicAddDeleteUser(UserRolesTest.java:35)

    testAddManagedRepoValidValues :
  java.lang.AssertionError
  java.lang.AssertionError: 'link=Repositories' isn't present. expected:<true> but was:<false>
	at org.testng.Assert.fail(Assert.java:84)
	at org.testng.Assert.failNotEquals(Assert.java:438)
	at org.testng.Assert.assertTrue(Assert.java:32)
	at org.apache.archiva.web.test.parent.AbstractSeleniumTest.assertElementPresent(AbstractSeleniumTest.java:169)
	at org.apache.archiva.web.test.parent.AbstractSeleniumTest.clickLinkWithLocator(AbstractSeleniumTest.java:349)
	at org.apache.archiva.web.test.parent.AbstractSeleniumTest.clickLinkWithText(AbstractSeleniumTest.java:329)
	at org.apache.archiva.web.test.parent.AbstractSeleniumTest.clickLinkWithText(AbstractSeleniumTest.java:324)
	at org.apache.archiva.web.test.parent.AbstractRepositoryTest.goToRepositoriesPage(AbstractRepositoryTest.java:220)
	at org.apache.archiva.web.test.RepositoryTest.testAddManagedRepoValidValues(RepositoryTest.java:32)


    testAddAppearanceNullValues :
  java.lang.AssertionError
  java.lang.AssertionError: 'link=Appearance' isn't present. expected:<true> but was:<false>
	at org.testng.Assert.fail(Assert.java:84)
	at org.testng.Assert.failNotEquals(Assert.java:438)
	at org.testng.Assert.assertTrue(Assert.java:32)
	at org.apache.archiva.web.test.parent.AbstractSeleniumTest.assertElementPresent(AbstractSeleniumTest.java:169)
	at org.apache.archiva.web.test.parent.AbstractSeleniumTest.clickLinkWithLocator(AbstractSeleniumTest.java:349)
	at org.apache.archiva.web.test.parent.AbstractSeleniumTest.clickLinkWithText(AbstractSeleniumTest.java:329)
	at org.apache.archiva.web.test.parent.AbstractSeleniumTest.clickLinkWithText(AbstractSeleniumTest.java:324)
	at org.apache.archiva.web.test.parent.AbstractArchivaTest.goToAppearancePage(AbstractArchivaTest.java:430)
	at org.apache.archiva.web.test.AppearanceTest.testAddAppearanceNullValues(AppearanceTest.java:30)


    testAddArtifactFileType_NullValue :
  java.lang.AssertionError
  java.lang.AssertionError: 'link=Repository Scanning' isn't present. expected:<true>
but was:<false>
	at org.testng.Assert.fail(Assert.java:84)
	at org.testng.Assert.failNotEquals(Assert.java:438)
	at org.testng.Assert.assertTrue(Assert.java:32)
	at org.apache.archiva.web.test.parent.AbstractSeleniumTest.assertElementPresent(AbstractSeleniumTest.java:169)
	at org.apache.archiva.web.test.parent.AbstractSeleniumTest.clickLinkWithLocator(AbstractSeleniumTest.java:349)
	at org.apache.archiva.web.test.parent.AbstractSeleniumTest.clickLinkWithText(AbstractSeleniumTest.java:329)
	at org.apache.archiva.web.test.parent.AbstractSeleniumTest.clickLinkWithText(AbstractSeleniumTest.java:324)
	at org.apache.archiva.web.test.parent.AbstractRepositoryTest.goToRepositoryScanningPage(AbstractRepositoryTest.java:332)
	at org.apache.archiva.web.test.RepositoryScanningTest.testAddArtifactFileType_NullValue(RepositoryScanningTest.java:31)


    testAddLegacyArtifact_NullValues :
  java.lang.AssertionError
  java.lang.AssertionError: 'link=Legacy Support' isn't present. expected:<true> but
was:<false>
	at org.testng.Assert.fail(Assert.java:84)
	at org.testng.Assert.failNotEquals(Assert.java:438)
	at org.testng.Assert.assertTrue(Assert.java:32)
	at org.apache.archiva.web.test.parent.AbstractSeleniumTest.assertElementPresent(AbstractSeleniumTest.java:169)
	at org.apache.archiva.web.test.parent.AbstractSeleniumTest.clickLinkWithLocator(AbstractSeleniumTest.java:349)
	at org.apache.archiva.web.test.parent.AbstractSeleniumTest.clickLinkWithText(AbstractSeleniumTest.java:329)
	at org.apache.archiva.web.test.parent.AbstractSeleniumTest.clickLinkWithText(AbstractSeleniumTest.java:324)
	at org.apache.archiva.web.test.parent.AbstractArtifactManagementTest.goToLegacySupportPage(AbstractArtifactManagementTest.java:126)
	at org.apache.archiva.web.test.LegacySupportTest.testAddLegacyArtifact_NullValues(LegacySupportTest.java:31)


    testFindArtifactNullValues :
  java.lang.AssertionError
  java.lang.AssertionError: 'link=Find Artifact' isn't present. expected:<true> but
was:<false>
	at org.testng.Assert.fail(Assert.java:84)
	at org.testng.Assert.failNotEquals(Assert.java:438)
	at org.testng.Assert.assertTrue(Assert.java:32)
	at org.apache.archiva.web.test.parent.AbstractSeleniumTest.assertElementPresent(AbstractSeleniumTest.java:169)
	at org.apache.archiva.web.test.parent.AbstractSeleniumTest.clickLinkWithLocator(AbstractSeleniumTest.java:349)
	at org.apache.archiva.web.test.parent.AbstractSeleniumTest.clickLinkWithText(AbstractSeleniumTest.java:329)
	at org.apache.archiva.web.test.parent.AbstractSeleniumTest.clickLinkWithText(AbstractSeleniumTest.java:324)
	at org.apache.archiva.web.test.parent.AbstractArchivaTest.goToFindArtifactPage(AbstractArchivaTest.java:411)
	at org.apache.archiva.web.test.FindArtifactTest.testFindArtifactNullValues(FindArtifactTest.java:31)


  



Mime
View raw message