archiva-notifications mailing list archives

Site index · List index
Message view « Date » · « Thread »
Top « Date » · « Thread »
From "Continuum@vmbuild.apache.org" <contin...@apache.org>
Subject [continuum] BUILD FAILURE: Archiva - Archiva Web :: Application Tests -
Date Wed, 20 May 2009 19:42:14 GMT
Online report : http://vmbuild.apache.org/continuum/buildResult.action?buildId=192384&projectId=2464

Build statistics:
  State: Failed
  Previous State: Failed
  Started at: Wed 20 May 2009 12:37:51 -0700
  Finished at: Wed 20 May 2009 12:42:06 -0700
  Total time: 4m 14s
  Build Trigger: Forced
  Build Number: 0
  Exit code: 1
  Building machine hostname: vmbuild.apache.org
  Operating system : Linux(unknown)
  Java Home version : 
          java version "1.5.0_12"
          Java(TM) 2 Runtime Environment, Standard Edition (build 1.5.0_12-b04)
          Java HotSpot(TM) Client VM (build 1.5.0_12-b04, mixed mode, sharing)
        
  Builder version :
          Maven version: 2.0.9
          Java version: 1.5.0_12
          OS name: "linux" version: "2.6.24-23-server" arch: "i386" Family: "unix"
    
****************************************************************************
SCM Changes:
****************************************************************************
No files changed

****************************************************************************
Dependencies Changes:
****************************************************************************
org.apache.archiva:archiva-web:1.2.1-SNAPSHOT


****************************************************************************
Build Definition:
****************************************************************************
POM filename: pom.xml
Goals: clean install   
Arguments: --batch-mode --non-recursive -PbuildWithAdditionalRepos,headless
Build Fresh: false
Always Build: false
Default Build Definition: true
Schedule: DEFAULT_SCHEDULE
Profile Name: Maven 2.0.9, Java 5
Description: 

****************************************************************************
Test Summary:
****************************************************************************
Tests: 45
Failures: 1
Errors: 0
Success Rate: 97
Total time: 45.099

****************************************************************************
Test Failures:
****************************************************************************

TestSuite
    initializeContinuum :
  java.lang.AssertionError
  java.lang.AssertionError: 'Current User' isn't present. expected:<true> but was:<false>
	at org.testng.Assert.fail(Assert.java:84)
	at org.testng.Assert.failNotEquals(Assert.java:438)
	at org.testng.Assert.assertTrue(Assert.java:32)
	at org.apache.archiva.web.test.parent.AbstractSeleniumTest.assertTextPresent(AbstractSeleniumTest.java:117)
	at org.apache.archiva.web.test.parent.AbstractArchivaTest.assertAuthenticatedPage(AbstractArchivaTest.java:147)
	at org.apache.archiva.web.test.ArchivaAdminTest.initializeContinuum(ArchivaAdminTest.java:73)

  



Mime
View raw message