archiva-dev mailing list archives

Site index · List index
Message view « Date » · « Thread »
Top « Date » · « Thread »
From Brett Porter <br...@apache.org>
Subject Re: [continuum] BUILD FAILURE: Archiva Base :: Configuration
Date Fri, 14 Dec 2007 04:31:55 GMT
Actually, I see that the model needed it's version updated.

What are the implications for existing Archiva 1.0 configuration  
files? Will they update to this new one automatically?

On 14/12/2007, at 1:21 PM, Brett Porter wrote:

> Nicolas,
>
> Did you forget to check something in?
>
> - Brett
>
> On 14/12/2007, at 12:51 PM, Continuum@maven.zones.apache.org wrote:
>
>> Online report : http://maven.zones.apache.org/continuum/buildResult.action?buildId=38858&projectId=271
>>
>> Build statistics:
>> State: Failed
>> Previous State: Failed
>> Started at: Fri 14 Dec 2007 01:50:59 +0000
>> Finished at: Fri 14 Dec 2007 01:51:17 +0000
>> Total time: 17s
>> Build Trigger: Forced
>> Build Number: 215
>> Exit code: 1
>> Building machine hostname: maven.zones.apache.org
>> Operating system : SunOS(unknown)
>> Java Home version :          java version "1.5.0_13"
>>        Java(TM) 2 Runtime Environment, Standard Edition (build  
>> 1.5.0_13-b05)
>>        Java HotSpot(TM) Server VM (build 1.5.0_13-b05, mixed mode)
>>       Builder version :
>>        Maven version: 2.0.7
>>        Java version: 1.5.0_13
>>        OS name: "sunos" version: "5.10" arch: "x86"
>>   
>> ****************************************************************************
>> SCM Changes:
>> ****************************************************************************
>> No files changed
>>
>> ****************************************************************************
>> Dependencies Changes:
>> ****************************************************************************
>> No dependencies changed
>>
>>
>> ****************************************************************************
>> Build Defintion:
>> ****************************************************************************
>> POM filename: pom.xml
>> Goals: clean install   Arguments: --batch-mode --non-recursive
>> Build Fresh: false
>> Always Build: false
>> Default Build Definition: true
>> Schedule: DEFAULT_SCHEDULE
>> Description:
>>
>> ****************************************************************************
>> Test Summary:
>> ****************************************************************************
>> Tests: 0
>> Failures: 0
>> Total time: 0
>>
>> ****************************************************************************
>> Output:
>> ****************************************************************************
>> [INFO] Scanning for projects...
>> [INFO]  
>> ----------------------------------------------------------------------------
>> [INFO] Building Archiva Base :: Configuration
>> [INFO]    task-segment: [clean, install]
>> [INFO]  
>> ----------------------------------------------------------------------------
>> [INFO] [clean:clean]
>> [INFO] Deleting directory /export/home/build/data/continuum/ 
>> checkouts/271/target
>> [INFO] [modello:java {execution: default}]
>> [INFO] outputDirectory: /export/home/build/data/continuum/checkouts/ 
>> 271/target/generated-sources/modello
>> [INFO] Generating current version: 1.0.0
>> [INFO] [modello:registry-reader {execution: default}]
>> [INFO] outputDirectory: /export/home/build/data/continuum/checkouts/ 
>> 271/target/generated-sources/modello
>> [INFO] Generating current version: 1.0.0
>> [INFO] [modello:registry-writer {execution: default}]
>> [INFO] outputDirectory: /export/home/build/data/continuum/checkouts/ 
>> 271/target/generated-sources/modello
>> [INFO] Generating current version: 1.0.0
>> [INFO] [plexus:descriptor {execution: generate}]
>> [INFO] snapshot org.apache.maven.archiva:archiva-common:1.1- 
>> SNAPSHOT: checking for updates from apache.snapshots
>> [INFO] snapshot org.apache.maven.archiva:archiva-policies:1.1- 
>> SNAPSHOT: checking for updates from apache.snapshots
>> [INFO] snapshot org.apache.maven.archiva:archiva-model:1.1- 
>> SNAPSHOT: checking for updates from apache.snapshots
>> [INFO] Setting property: classpath.resource.loader.class =>  
>> 'org.codehaus.plexus.velocity.ContextClassLoaderResourceLoader'.
>> [INFO] Setting property: velocimacro.messages.on => 'false'.
>> [INFO] Setting property: resource.loader => 'classpath'.
>> [INFO] Setting property: resource.manager.logwhenfound => 'false'.
>> [INFO] [remote-resources:process {execution: default}]
>> [INFO] [resources:resources]
>> [INFO] Using default encoding to copy filtered resources.
>> [INFO] Copying 2 resources
>> [INFO] Copying 1 resource
>> [INFO] Copying 2 resources
>> [INFO] [compiler:compile]
>> [INFO] Compiling 33 source files to /export/home/build/data/ 
>> continuum/checkouts/271/target/classes
>> [INFO] [resources:testResources]
>> [INFO] Using default encoding to copy filtered resources.
>> [INFO] Copying 2 resources
>> [INFO] Copying 2 resources
>> [INFO] [compiler:testCompile]
>> [INFO] Compiling 6 source files to /export/home/build/data/ 
>> continuum/checkouts/271/target/test-classes
>> [INFO]  
>> ------------------------------------------------------------------------
>> [ERROR] BUILD FAILURE
>> [INFO]  
>> ------------------------------------------------------------------------
>> [INFO] Compilation failure
>>
>> /export/home/build/data/continuum/checkouts/271/src/test/java/org/ 
>> apache/maven/archiva/configuration/LegacyArtifactPathTest.java: 
>> [34,12] cannot find symbol
>> symbol  : class LegacyArtifactPath
>> location: class  
>> org.apache.maven.archiva.configuration.LegacyArtifactPathTest
>>
>> /export/home/build/data/continuum/checkouts/271/src/test/java/org/ 
>> apache/maven/archiva/configuration/LegacyArtifactPathTest.java: 
>> [34,56] cannot find symbol
>> symbol  : class LegacyArtifactPath
>> location: class  
>> org.apache.maven.archiva.configuration.LegacyArtifactPathTest
>>
>>
>> [INFO]  
>> ------------------------------------------------------------------------
>> [INFO] For more information, run Maven with the -e switch
>> [INFO]  
>> ------------------------------------------------------------------------
>> [INFO] Total time: 14 seconds
>> [INFO] Finished at: Fri Dec 14 01:51:16 GMT+00:00 2007
>> [INFO] Final Memory: 21M/326M
>> [INFO]  
>> ------------------------------------------------------------------------
>>
>> ****************************************************************************
>>
>>
>


Mime
View raw message