archiva-dev mailing list archives

Site index · List index
Message view « Date » · « Thread »
Top « Date » · « Thread »
From Brett Porter <br...@apache.org>
Subject Re: [continuum] BUILD FAILURE: Archiva Web :: Application
Date Thu, 01 Nov 2007 22:51:29 GMT
This had a "connection refused" message in the surefire logs, but it  
passed on a second attempt.

Are the proxy tests now making external connections, or was that the  
servletunit connection?

- Brett

On 02/11/2007, at 7:24 AM, Continuum@maven.zones.apache.org wrote:

> Online report : http://maven.zones.apache.org/continuum/ 
> buildResult.action?buildId=32827&projectId=296
>
> Build statistics:
>  State: Failed
>  Previous State: Ok
>  Started at: Thu 1 Nov 2007 20:22:05 +0000
>  Finished at: Thu 1 Nov 2007 20:24:18 +0000
>  Total time: 2m 13s
>  Build Trigger: Schedule
>  Build Number: 164
>  Exit code: 1
>  Building machine hostname: maven.zones.apache.org
>  Operating system : SunOS(unknown)
>  Java Home version :          java version "1.5.0_13"
>          Java(TM) 2 Runtime Environment, Standard Edition (build  
> 1.5.0_13-b05)
>          Java HotSpot(TM) Server VM (build 1.5.0_13-b05, mixed mode)
>         Builder version :
>          Maven version: 2.0.7
>          Java version: 1.5.0_13
>          OS name: "sunos" version: "5.10" arch: "x86"
>     
> ********************************************************************** 
> ******
> SCM Changes:
> ********************************************************************** 
> ******
> No files changed
>
> ********************************************************************** 
> ******
> Dependencies Changes:
> ********************************************************************** 
> ******
> org.apache.maven.archiva:archiva-report-manager:1.0-beta-4-SNAPSHOT
>
> org.apache.maven.archiva:archiva-scheduled:1.0-beta-4-SNAPSHOT
>
> org.apache.maven.archiva:archiva-indexer:1.0-beta-4-SNAPSHOT
>
> org.apache.maven.archiva:archiva-proxy:1.0-beta-4-SNAPSHOT
>
> org.apache.maven.archiva:archiva-database:1.0-beta-4-SNAPSHOT
>
> org.apache.maven.archiva:archiva-repository-layer:1.0-beta-4-SNAPSHOT
>
> org.apache.maven.archiva:archiva-security:1.0-beta-4-SNAPSHOT
>
> org.apache.maven.archiva:archiva-core-consumers:1.0-beta-4-SNAPSHOT
>
> org.apache.maven.archiva:archiva-database-consumers:1.0-beta-4- 
> SNAPSHOT
>
> org.apache.maven.archiva:archiva-lucene-consumers:1.0-beta-4-SNAPSHOT
>
> org.apache.maven.archiva:archiva-signature-consumers:1.0-beta-4- 
> SNAPSHOT
>
> org.apache.maven.archiva:archiva-applet:1.0-beta-4-SNAPSHOT
>
> org.apache.maven.archiva:archiva-web:1.0-beta-4-SNAPSHOT
>
>
> ********************************************************************** 
> ******
> Build Defintion:
> ********************************************************************** 
> ******
> POM filename: pom.xml
> Goals: clean install   Arguments: --batch-mode --non-recursive
> Build Fresh: false
> Always Build: false
> Default Build Definition: true
> Schedule: DEFAULT_SCHEDULE
> Description:
>
> ********************************************************************** 
> ******
> Test Summary:
> ********************************************************************** 
> ******
> Tests: 1940
> Failures: 1
> Total time: 103897
>
> ********************************************************************** 
> ******
> Output:
> ********************************************************************** 
> ******
> [INFO] Scanning for projects...
> [INFO]  
> ---------------------------------------------------------------------- 
> ------
> [INFO] Building Archiva Web :: Application
> [INFO]    task-segment: [clean, install]
> [INFO]  
> ---------------------------------------------------------------------- 
> ------
> [INFO] [clean:clean]
> [INFO] Deleting directory /export/home/build/data/continuum/ 
> checkouts/296/target
> [INFO] Deleting directory /export/home/build/data/continuum/ 
> checkouts/296/target/classes
> [INFO] Deleting directory /export/home/build/data/continuum/ 
> checkouts/296/target/test-classes
> [INFO] Deleting directory /export/home/build/data/continuum/ 
> checkouts/296/target/site
> [INFO] Deleting file-set: /export/home/build/data/continuum/ 
> checkouts/296/src/main/webapp (included: [META-INF, images/redback,  
> template/redback, WEB-INF/classes, WEB-INF/lib, WEB-INF/database,  
> WEB-INF/logs, redback, css/redback, WEB-INF/jsp/redback, WEB-INF/ 
> template/redback, WEB-INF/logs, WEB-INF/temp, WEB-INF/ 
> jasperreports], excluded: [])
> [INFO] [plexus:descriptor {execution: generate}]
> [INFO] Setting property: classpath.resource.loader.class =>  
> 'org.codehaus.plexus.velocity.ContextClassLoaderResourceLoader'.
> [INFO] Setting property: velocimacro.messages.on => 'false'.
> [INFO] Setting property: resource.loader => 'classpath'.
> [INFO] Setting property: resource.manager.logwhenfound => 'false'.
> [INFO] [remote-resources:process {execution: default}]
> [INFO] [resources:resources]
> [INFO] Using default encoding to copy filtered resources.
> [INFO] Copying 26 resources
> [INFO] Copying 1 resource
> [INFO] Copying 2 resources
> [INFO] [dependency:copy {execution: copy}]
> [INFO] Configured Artifact: org.apache.maven.archiva:archiva- 
> applet:null:1.0-beta-4-SNAPSHOT:jar
> [INFO] archiva-applet-1.0-beta-4-SNAPSHOT.jar already exists.
> [INFO] [compiler:compile]
> [INFO] Compiling 64 source files to /export/home/build/data/ 
> continuum/checkouts/296/target/classes
> [INFO] [war:inplace {execution: default}]
> [INFO] Generating webapp in source directory... /export/home/build/ 
> data/continuum/checkouts/296/src/main/webapp
> [INFO] Exploding webapp...
> [INFO] Assembling webapp archiva-webapp in /export/home/build/data/ 
> continuum/checkouts/296/src/main/webapp
> [INFO] Expanding: /export/home/build/.m2/repository/org/codehaus/ 
> plexus/redback/redback-xwork-content/1.0-alpha-3/redback-xwork- 
> content-1.0-alpha-3.war into /export/home/build/data/continuum/ 
> checkouts/296/target/war/work/redback-xwork-content-1.0-alpha-3
> [INFO] Overlaying 1 war(s).
> [INFO] [resources:testResources]
> [INFO] Using default encoding to copy filtered resources.
> [INFO] Copying 12 resources
> [INFO] Copying 2 resources
> [INFO] [compiler:testCompile]
> [INFO] Compiling 38 source files to /export/home/build/data/ 
> continuum/checkouts/296/target/test-classes
> [INFO] [surefire:test]
> [INFO] Surefire report directory: /export/home/build/data/continuum/ 
> checkouts/296/target/surefire-reports
>
> -------------------------------------------------------
> T E S T S
> -------------------------------------------------------
> Running  
> org.apache.maven.archiva.web.repository.RepositoryServletNoProxyMetada 
> taTest
> WARN|main|    0|ConfigurationFactory           - No configuration  
> found. Configuring ehcache from ehcache-failsafe.xml  found in the  
> classpath: jar:file:/export/home/build/.m2/repository/net/sf/ 
> ehcache/ehcache/1.3.0/ehcache-1.3.0.jar!/ehcache-failsafe.xml
> Rhino classes (js.jar) not found - Javascript disabled
> 2079 [main] INFO org.codehaus.plexus.cache.Cache:url-failures-cache  
> - Disposing cache: [ name = url-failures-cache status =  
> STATUS_ALIVE eternal = false overflowToDisk = false  
> maxElementsInMemory = 1000 maxElementsOnDisk = 0  
> memoryStoreEvictionPolicy = LRU timeToLiveSeconds = 1800  
> timeToIdleSeconds = 2700 diskPersistent = false  
> diskExpiryThreadIntervalSeconds = 600 cacheEventListeners:   
> hitCount = 0 memoryStoreHitCount = 0 diskStoreHitCount = 0  
> missCountNotFound = 0 missCountExpired = 0 ]
> There was no such logger  
> 'org.codehaus.plexus.redback.xwork.filter.authentication.HttpAuthentic 
> ator:basic' 7579563.
> 2080 [main] WARN org.codehaus.plexus.PlexusContainer - Component  
> manager not found for returned component. Ignored.  
> component=org.apache.maven.archiva.web.repository.ProxiedDavServer@17c 
> f6b6
> 2400 [main] INFO org.codehaus.plexus.cache.Cache:url-failures-cache  
> - Disposing cache: [ name = url-failures-cache status =  
> STATUS_ALIVE eternal = false overflowToDisk = false  
> maxElementsInMemory = 1000 maxElementsOnDisk = 0  
> memoryStoreEvictionPolicy = LRU timeToLiveSeconds = 1800  
> timeToIdleSeconds = 2700 diskPersistent = false  
> diskExpiryThreadIntervalSeconds = 600 cacheEventListeners:   
> hitCount = 0 memoryStoreHitCount = 0 diskStoreHitCount = 0  
> missCountNotFound = 0 missCountExpired = 0 ]
> There was no such logger  
> 'org.codehaus.plexus.redback.xwork.filter.authentication.HttpAuthentic 
> ator:basic' 14648293.
> 2402 [main] WARN org.codehaus.plexus.PlexusContainer - Component  
> manager not found for returned component. Ignored.  
> component=org.apache.maven.archiva.web.repository.ProxiedDavServer@1a2 
> f02e
> 2772 [main] INFO org.codehaus.plexus.cache.Cache:url-failures-cache  
> - Disposing cache: [ name = url-failures-cache status =  
> STATUS_ALIVE eternal = false overflowToDisk = false  
> maxElementsInMemory = 1000 maxElementsOnDisk = 0  
> memoryStoreEvictionPolicy = LRU timeToLiveSeconds = 1800  
> timeToIdleSeconds = 2700 diskPersistent = false  
> diskExpiryThreadIntervalSeconds = 600 cacheEventListeners:   
> hitCount = 0 memoryStoreHitCount = 0 diskStoreHitCount = 0  
> missCountNotFound = 0 missCountExpired = 0 ]
> There was no such logger  
> 'org.codehaus.plexus.redback.xwork.filter.authentication.HttpAuthentic 
> ator:basic' 8926039.
> 2773 [main] WARN org.codehaus.plexus.PlexusContainer - Component  
> manager not found for returned component. Ignored.  
> component=org.apache.maven.archiva.web.repository.ProxiedDavServer@cb4 
> 2cf
> Tests run: 3, Failures: 0, Errors: 0, Skipped: 0, Time elapsed:  
> 3.153 sec
> Running  
> org.apache.maven.archiva.web.repository.ArchivaMimeTypeLoaderTest
> Tests run: 1, Failures: 0, Errors: 0, Skipped: 0, Time elapsed:  
> 0.348 sec
> Running  
> org.apache.maven.archiva.web.repository.RepositoryServletProxiedPlugin 
> SnapshotPolicyTest
> 3354 [main] INFO org.mortbay.log - Logging to  
> org.slf4j.impl.SimpleLogger(org.mortbay.log) via  
> org.mortbay.log.Slf4jLog
> 3401 [main] INFO org.mortbay.log - jetty-6.1.5
> 3456 [main] INFO org.mortbay.log - Started  
> SocketConnector@0.0.0.0:44255
> Remote HTTP Server started on http://localhost:44255/snapshots
> 4692 [main] INFO org.codehaus.plexus.cache.Cache:url-failures-cache  
> - Disposing cache: [ name = url-failures-cache status =  
> STATUS_ALIVE eternal = false overflowToDisk = false  
> maxElementsInMemory = 1000 maxElementsOnDisk = 0  
> memoryStoreEvictionPolicy = LRU timeToLiveSeconds = 1800  
> timeToIdleSeconds = 2700 diskPersistent = false  
> diskExpiryThreadIntervalSeconds = 600 cacheEventListeners:   
> hitCount = 0 memoryStoreHitCount = 0 diskStoreHitCount = 0  
> missCountNotFound = 0 missCountExpired = 0 ]
> There was no such logger  
> 'org.codehaus.plexus.redback.xwork.filter.authentication.HttpAuthentic 
> ator:basic' 2950265.
> 4693 [main] WARN org.codehaus.plexus.PlexusContainer - Component  
> manager not found for returned component. Ignored.  
> component=org.apache.maven.archiva.web.repository.ProxiedDavServer@1b2 
> 2d99
> 5144 [main] INFO org.mortbay.log - jetty-6.1.5
> 5146 [main] INFO org.mortbay.log - Started  
> SocketConnector@0.0.0.0:44262
> Remote HTTP Server started on http://localhost:44262/snapshots
> 6261 [main] INFO org.codehaus.plexus.cache.Cache:url-failures-cache  
> - Disposing cache: [ name = url-failures-cache status =  
> STATUS_ALIVE eternal = false overflowToDisk = false  
> maxElementsInMemory = 1000 maxElementsOnDisk = 0  
> memoryStoreEvictionPolicy = LRU timeToLiveSeconds = 1800  
> timeToIdleSeconds = 2700 diskPersistent = false  
> diskExpiryThreadIntervalSeconds = 600 cacheEventListeners:   
> hitCount = 0 memoryStoreHitCount = 0 diskStoreHitCount = 0  
> missCountNotFound = 0 missCountExpired = 0 ]
> There was no such logger  
> 'org.codehaus.plexus.redback.xwork.filter.authentication.HttpAuthentic 
> ator:basic' 22106538.
> 6261 [main] WARN org.codehaus.plexus.PlexusContainer - Component  
> manager not found for returned component. Ignored.  
> component=org.apache.maven.archiva.web.repository.ProxiedDavServer@131 
> 36e5
> 6474 [main] INFO org.mortbay.log - jetty-6.1.5
> 6475 [main] INFO org.mortbay.log - Started  
> SocketConnector@0.0.0.0:44269
> Remote HTTP Server started on http://localhost:44269/snapshots
> 7581 [main] INFO org.codehaus.plexus.cache.Cache:url-failures-cache  
> - Disposing cache: [ name = url-failures-cache status =  
> STATUS_ALIVE eternal = false overflowToDisk = false  
> maxElementsInMemory = 1000 maxElementsOnDisk = 0  
> memoryStoreEvictionPolicy = LRU timeToLiveSeconds = 1800  
> timeToIdleSeconds = 2700 diskPersistent = false  
> diskExpiryThreadIntervalSeconds = 600 cacheEventListeners:   
> hitCount = 0 memoryStoreHitCount = 0 diskStoreHitCount = 0  
> missCountNotFound = 0 missCountExpired = 0 ]
> There was no such logger  
> 'org.codehaus.plexus.redback.xwork.filter.authentication.HttpAuthentic 
> ator:basic' 31517012.
> 7581 [main] WARN org.codehaus.plexus.PlexusContainer - Component  
> manager not found for returned component. Ignored.  
> component=org.apache.maven.archiva.web.repository.ProxiedDavServer@3c3 
> 5fd
> 7761 [main] INFO org.mortbay.log - jetty-6.1.5
> 7763 [main] INFO org.mortbay.log - Started  
> SocketConnector@0.0.0.0:44276
> Remote HTTP Server started on http://localhost:44276/snapshots
> 8701 [main] INFO  
> org.apache.maven.archiva.proxy.RepositoryProxyConnectors:default -  
> Transfer not attempted on http://localhost:44276/snapshotsorg/ 
> apache/archiva/archivatest-maven-plugin/4.0-alpha-1-SNAPSHOT/ 
> archivatest-maven-plugin-4.0-alpha-1-20070822.033400-42.jar : NO to  
> update snapshots, policy is DAILY, local file exist, and has been  
> updated within the last day.: using already present local file.
> 8715 [main] INFO org.codehaus.plexus.cache.Cache:url-failures-cache  
> - Disposing cache: [ name = url-failures-cache status =  
> STATUS_ALIVE eternal = false overflowToDisk = false  
> maxElementsInMemory = 1000 maxElementsOnDisk = 0  
> memoryStoreEvictionPolicy = LRU timeToLiveSeconds = 1800  
> timeToIdleSeconds = 2700 diskPersistent = false  
> diskExpiryThreadIntervalSeconds = 600 cacheEventListeners:   
> hitCount = 0 memoryStoreHitCount = 0 diskStoreHitCount = 0  
> missCountNotFound = 0 missCountExpired = 0 ]
> There was no such logger  
> 'org.codehaus.plexus.redback.xwork.filter.authentication.HttpAuthentic 
> ator:basic' 8593864.
> 8716 [main] WARN org.codehaus.plexus.PlexusContainer - Component  
> manager not found for returned component. Ignored.  
> component=org.apache.maven.archiva.web.repository.ProxiedDavServer@19d 
> 9c0d
> 8998 [main] INFO org.mortbay.log - jetty-6.1.5
> 8999 [main] INFO org.mortbay.log - Started  
> SocketConnector@0.0.0.0:44283
> Remote HTTP Server started on http://localhost:44283/snapshots
> 13510 [main] INFO org.codehaus.plexus.cache.Cache:url-failures- 
> cache - Disposing cache: [ name = url-failures-cache status =  
> STATUS_ALIVE eternal = false overflowToDisk = false  
> maxElementsInMemory = 1000 maxElementsOnDisk = 0  
> memoryStoreEvictionPolicy = LRU timeToLiveSeconds = 1800  
> timeToIdleSeconds = 2700 diskPersistent = false  
> diskExpiryThreadIntervalSeconds = 600 cacheEventListeners:   
> hitCount = 0 memoryStoreHitCount = 0 diskStoreHitCount = 0  
> missCountNotFound = 0 missCountExpired = 0 ]
> There was no such logger  
> 'org.codehaus.plexus.redback.xwork.filter.authentication.HttpAuthentic 
> ator:basic' 31599733.
> 13511 [main] WARN org.codehaus.plexus.PlexusContainer - Component  
> manager not found for returned component. Ignored.  
> component=org.apache.maven.archiva.web.repository.ProxiedDavServer@9da 
> a17
> 14069 [main] INFO org.mortbay.log - jetty-6.1.5
> 14070 [main] INFO org.mortbay.log - Started  
> SocketConnector@0.0.0.0:44311
> Remote HTTP Server started on http://localhost:44311/snapshots
> 15520 [main] INFO org.codehaus.plexus.cache.Cache:url-failures- 
> cache - Disposing cache: [ name = url-failures-cache status =  
> STATUS_ALIVE eternal = false overflowToDisk = false  
> maxElementsInMemory = 1000 maxElementsOnDisk = 0  
> memoryStoreEvictionPolicy = LRU timeToLiveSeconds = 1800  
> timeToIdleSeconds = 2700 diskPersistent = false  
> diskExpiryThreadIntervalSeconds = 600 cacheEventListeners:   
> hitCount = 0 memoryStoreHitCount = 0 diskStoreHitCount = 0  
> missCountNotFound = 0 missCountExpired = 0 ]
> There was no such logger  
> 'org.codehaus.plexus.redback.xwork.filter.authentication.HttpAuthentic 
> ator:basic' 25512760.
> 15520 [main] WARN org.codehaus.plexus.PlexusContainer - Component  
> manager not found for returned component. Ignored.  
> component=org.apache.maven.archiva.web.repository.ProxiedDavServer@1ee 
> b372
> Remote HTTP Server started on http://localhost:44324/snapshots
> 15628 [main] INFO org.mortbay.log - jetty-6.1.5
> 15629 [main] INFO org.mortbay.log - Started  
> SocketConnector@0.0.0.0:44324
> 16573 [main] INFO  
> org.apache.maven.archiva.proxy.RepositoryProxyConnectors:default -  
> Transfer not attempted on http://localhost:44324/snapshotsorg/ 
> apache/archiva/archivatest-maven-plugin/4.0-alpha-1-SNAPSHOT/ 
> archivatest-maven-plugin-4.0-alpha-1-20070822.033400-42.pom : NO to  
> update, snapshots policy set to NEVER.
> 16574 [main] INFO  
> org.apache.maven.archiva.proxy.RepositoryProxyConnectors:default -  
> Transfer not attempted on http://localhost:44324/snapshotsorg/ 
> apache/archiva/archivatest-maven-plugin/4.0-alpha-1-SNAPSHOT/ 
> archivatest-maven-plugin-4.0-alpha-1-20070822.033400-42.jar : NO to  
> update, snapshots policy set to NEVER.: using already present local  
> file.
> 16680 [main] INFO org.codehaus.plexus.cache.Cache:url-failures- 
> cache - Disposing cache: [ name = url-failures-cache status =  
> STATUS_ALIVE eternal = false overflowToDisk = false  
> maxElementsInMemory = 1000 maxElementsOnDisk = 0  
> memoryStoreEvictionPolicy = LRU timeToLiveSeconds = 1800  
> timeToIdleSeconds = 2700 diskPersistent = false  
> diskExpiryThreadIntervalSeconds = 600 cacheEventListeners:   
> hitCount = 0 memoryStoreHitCount = 0 diskStoreHitCount = 0  
> missCountNotFound = 0 missCountExpired = 0 ]
> There was no such logger  
> 'org.codehaus.plexus.redback.xwork.filter.authentication.HttpAuthentic 
> ator:basic' 12793391.
> 16681 [main] WARN org.codehaus.plexus.PlexusContainer - Component  
> manager not found for returned component. Ignored.  
> component=org.apache.maven.archiva.web.repository.ProxiedDavServer@10c 
> e397
> 16844 [main] INFO org.mortbay.log - jetty-6.1.5
> 16845 [main] INFO org.mortbay.log - Started  
> SocketConnector@0.0.0.0:44338
> Remote HTTP Server started on http://localhost:44338/snapshots
> 17753 [main] INFO  
> org.apache.maven.archiva.proxy.RepositoryProxyConnectors:default -  
> Transfer not attempted on http://localhost:44338/snapshotsorg/ 
> apache/archiva/archivatest-maven-plugin/4.0-alpha-1-SNAPSHOT/ 
> archivatest-maven-plugin-4.0-alpha-1-20070822.033400-42.pom : NO to  
> update, snapshots policy set to NEVER.
> 17754 [main] INFO  
> org.apache.maven.archiva.proxy.RepositoryProxyConnectors:default -  
> Transfer not attempted on http://localhost:44338/snapshotsorg/ 
> apache/archiva/archivatest-maven-plugin/4.0-alpha-1-SNAPSHOT/ 
> archivatest-maven-plugin-4.0-alpha-1-20070822.033400-42.jar : NO to  
> update, snapshots policy set to NEVER.
> 17870 [main] INFO org.codehaus.plexus.cache.Cache:url-failures- 
> cache - Disposing cache: [ name = url-failures-cache status =  
> STATUS_ALIVE eternal = false overflowToDisk = false  
> maxElementsInMemory = 1000 maxElementsOnDisk = 0  
> memoryStoreEvictionPolicy = LRU timeToLiveSeconds = 1800  
> timeToIdleSeconds = 2700 diskPersistent = false  
> diskExpiryThreadIntervalSeconds = 600 cacheEventListeners:   
> hitCount = 0 memoryStoreHitCount = 0 diskStoreHitCount = 0  
> missCountNotFound = 0 missCountExpired = 0 ]
> There was no such logger  
> 'org.codehaus.plexus.redback.xwork.filter.authentication.HttpAuthentic 
> ator:basic' 21059367.
> 17870 [main] WARN org.codehaus.plexus.PlexusContainer - Component  
> manager not found for returned component. Ignored.  
> component=org.apache.maven.archiva.web.repository.ProxiedDavServer@352 
> d87
> 18000 [main] INFO org.mortbay.log - jetty-6.1.5
> 18001 [main] INFO org.mortbay.log - Started  
> SocketConnector@0.0.0.0:44343
> Remote HTTP Server started on http://localhost:44343/snapshots
> 18919 [main] INFO  
> org.apache.maven.archiva.proxy.RepositoryProxyConnectors:default -  
> Transfer not attempted on http://localhost:44343/snapshotsorg/ 
> apache/archiva/archivatest-maven-plugin/4.0-alpha-1-SNAPSHOT/ 
> archivatest-maven-plugin-4.0-alpha-1-20070822.033400-42.pom : NO to  
> update, snapshots policy set to NEVER.
> 18921 [main] INFO  
> org.apache.maven.archiva.proxy.RepositoryProxyConnectors:default -  
> Transfer not attempted on http://localhost:44343/snapshotsorg/ 
> apache/archiva/archivatest-maven-plugin/4.0-alpha-1-SNAPSHOT/ 
> archivatest-maven-plugin-4.0-alpha-1-20070822.033400-42.jar : NO to  
> update, snapshots policy set to NEVER.: using already present local  
> file.
> 19050 [main] INFO org.codehaus.plexus.cache.Cache:url-failures- 
> cache - Disposing cache: [ name = url-failures-cache status =  
> STATUS_ALIVE eternal = false overflowToDisk = false  
> maxElementsInMemory = 1000 maxElementsOnDisk = 0  
> memoryStoreEvictionPolicy = LRU timeToLiveSeconds = 1800  
> timeToIdleSeconds = 2700 diskPersistent = false  
> diskExpiryThreadIntervalSeconds = 600 cacheEventListeners:   
> hitCount = 0 memoryStoreHitCount = 0 diskStoreHitCount = 0  
> missCountNotFound = 0 missCountExpired = 0 ]
> There was no such logger  
> 'org.codehaus.plexus.redback.xwork.filter.authentication.HttpAuthentic 
> ator:basic' 4799946.
> 19050 [main] WARN org.codehaus.plexus.PlexusContainer - Component  
> manager not found for returned component. Ignored.  
> component=org.apache.maven.archiva.web.repository.ProxiedDavServer@90e 
> bfe
> 19502 [main] INFO org.mortbay.log - jetty-6.1.5
> 19503 [main] INFO org.mortbay.log - Started  
> SocketConnector@0.0.0.0:44346
> Remote HTTP Server started on http://localhost:44346/snapshots
> 20462 [main] INFO  
> org.apache.maven.archiva.proxy.RepositoryProxyConnectors:default -  
> Transfer not attempted on http://localhost:44346/snapshotsorg/ 
> apache/archiva/archivatest-maven-plugin/4.0-alpha-1-SNAPSHOT/ 
> archivatest-maven-plugin-4.0-alpha-1-20070822.033400-42.jar : NO to  
> update snapshots, policy is HOURLY, local file exist, and has been  
> updated within the last hour.: using already present local file.
> 20466 [main] INFO org.codehaus.plexus.cache.Cache:url-failures- 
> cache - Disposing cache: [ name = url-failures-cache status =  
> STATUS_ALIVE eternal = false overflowToDisk = false  
> maxElementsInMemory = 1000 maxElementsOnDisk = 0  
> memoryStoreEvictionPolicy = LRU timeToLiveSeconds = 1800  
> timeToIdleSeconds = 2700 diskPersistent = false  
> diskExpiryThreadIntervalSeconds = 600 cacheEventListeners:   
> hitCount = 0 memoryStoreHitCount = 0 diskStoreHitCount = 0  
> missCountNotFound = 0 missCountExpired = 0 ]
> There was no such logger  
> 'org.codehaus.plexus.redback.xwork.filter.authentication.HttpAuthentic 
> ator:basic' 8202134.
> 20466 [main] WARN org.codehaus.plexus.PlexusContainer - Component  
> manager not found for returned component. Ignored.  
> component=org.apache.maven.archiva.web.repository.ProxiedDavServer@52a 
> 2e3
> 20570 [main] INFO org.mortbay.log - jetty-6.1.5
> 20571 [main] INFO org.mortbay.log - Started  
> SocketConnector@0.0.0.0:44352
> Remote HTTP Server started on http://localhost:44352/snapshots
> 21630 [main] INFO org.codehaus.plexus.cache.Cache:url-failures- 
> cache - Disposing cache: [ name = url-failures-cache status =  
> STATUS_ALIVE eternal = false overflowToDisk = false  
> maxElementsInMemory = 1000 maxElementsOnDisk = 0  
> memoryStoreEvictionPolicy = LRU timeToLiveSeconds = 1800  
> timeToIdleSeconds = 2700 diskPersistent = false  
> diskExpiryThreadIntervalSeconds = 600 cacheEventListeners:   
> hitCount = 0 memoryStoreHitCount = 0 diskStoreHitCount = 0  
> missCountNotFound = 0 missCountExpired = 0 ]
> There was no such logger  
> 'org.codehaus.plexus.redback.xwork.filter.authentication.HttpAuthentic 
> ator:basic' 25584663.
> 21630 [main] WARN org.codehaus.plexus.PlexusContainer - Component  
> manager not found for returned component. Ignored.  
> component=org.apache.maven.archiva.web.repository.ProxiedDavServer@169 
> a1c5
> 21751 [main] INFO org.mortbay.log - jetty-6.1.5
> 21753 [main] INFO org.mortbay.log - Started  
> SocketConnector@0.0.0.0:44357
> Remote HTTP Server started on http://localhost:44357/snapshots
> 22800 [main] INFO org.codehaus.plexus.cache.Cache:url-failures- 
> cache - Disposing cache: [ name = url-failures-cache status =  
> STATUS_ALIVE eternal = false overflowToDisk = false  
> maxElementsInMemory = 1000 maxElementsOnDisk = 0  
> memoryStoreEvictionPolicy = LRU timeToLiveSeconds = 1800  
> timeToIdleSeconds = 2700 diskPersistent = false  
> diskExpiryThreadIntervalSeconds = 600 cacheEventListeners:   
> hitCount = 0 memoryStoreHitCount = 0 diskStoreHitCount = 0  
> missCountNotFound = 0 missCountExpired = 0 ]
> There was no such logger  
> 'org.codehaus.plexus.redback.xwork.filter.authentication.HttpAuthentic 
> ator:basic' 25688828.
> 22800 [main] WARN org.codehaus.plexus.PlexusContainer - Component  
> manager not found for returned component. Ignored.  
> component=org.apache.maven.archiva.web.repository.ProxiedDavServer@18d 
> f055
> 22933 [main] INFO org.mortbay.log - jetty-6.1.5
> 22936 [main] INFO org.mortbay.log - Started  
> SocketConnector@0.0.0.0:44362
> Remote HTTP Server started on http://localhost:44362/snapshots
> 24085 [main] INFO  
> org.apache.maven.archiva.proxy.RepositoryProxyConnectors:default -  
> Transfer not attempted on http://localhost:44362/snapshotsorg/ 
> apache/archiva/archivatest-maven-plugin/4.0-alpha-1-SNAPSHOT/ 
> archivatest-maven-plugin-4.0-alpha-1-20070822.033400-42.jar : NO to  
> update snapshots, policy is ONCE, and local file exist.: using  
> already present local file.
> 24190 [main] INFO org.codehaus.plexus.cache.Cache:url-failures- 
> cache - Disposing cache: [ name = url-failures-cache status =  
> STATUS_ALIVE eternal = false overflowToDisk = false  
> maxElementsInMemory = 1000 maxElementsOnDisk = 0  
> memoryStoreEvictionPolicy = LRU timeToLiveSeconds = 1800  
> timeToIdleSeconds = 2700 diskPersistent = false  
> diskExpiryThreadIntervalSeconds = 600 cacheEventListeners:   
> hitCount = 0 memoryStoreHitCount = 0 diskStoreHitCount = 0  
> missCountNotFound = 0 missCountExpired = 0 ]
> There was no such logger  
> 'org.codehaus.plexus.redback.xwork.filter.authentication.HttpAuthentic 
> ator:basic' 21539046.
> 24190 [main] WARN org.codehaus.plexus.PlexusContainer - Component  
> manager not found for returned component. Ignored.  
> component=org.apache.maven.archiva.web.repository.ProxiedDavServer@171 
> bc3f
> 24285 [main] INFO org.mortbay.log - jetty-6.1.5
> 24286 [main] INFO org.mortbay.log - Started  
> SocketConnector@0.0.0.0:44365
> Remote HTTP Server started on http://localhost:44365/snapshots
> 25290 [main] INFO org.codehaus.plexus.cache.Cache:url-failures- 
> cache - Disposing cache: [ name = url-failures-cache status =  
> STATUS_ALIVE eternal = false overflowToDisk = false  
> maxElementsInMemory = 1000 maxElementsOnDisk = 0  
> memoryStoreEvictionPolicy = LRU timeToLiveSeconds = 1800  
> timeToIdleSeconds = 2700 diskPersistent = false  
> diskExpiryThreadIntervalSeconds = 600 cacheEventListeners:   
> hitCount = 0 memoryStoreHitCount = 0 diskStoreHitCount = 0  
> missCountNotFound = 0 missCountExpired = 0 ]
> There was no such logger  
> 'org.codehaus.plexus.redback.xwork.filter.authentication.HttpAuthentic 
> ator:basic' 12189822.
> 25290 [main] WARN org.codehaus.plexus.PlexusContainer - Component  
> manager not found for returned component. Ignored.  
> component=org.apache.maven.archiva.web.repository.ProxiedDavServer@d31 
> 99e
> 25380 [main] INFO org.mortbay.log - jetty-6.1.5
> 25382 [main] INFO org.mortbay.log - Started  
> SocketConnector@0.0.0.0:44371
> Remote HTTP Server started on http://localhost:44371/snapshots
> 26410 [main] INFO org.codehaus.plexus.cache.Cache:url-failures- 
> cache - Disposing cache: [ name = url-failures-cache status =  
> STATUS_ALIVE eternal = false overflowToDisk = false  
> maxElementsInMemory = 1000 maxElementsOnDisk = 0  
> memoryStoreEvictionPolicy = LRU timeToLiveSeconds = 1800  
> timeToIdleSeconds = 2700 diskPersistent = false  
> diskExpiryThreadIntervalSeconds = 600 cacheEventListeners:   
> hitCount = 0 memoryStoreHitCount = 0 diskStoreHitCount = 0  
> missCountNotFound = 0 missCountExpired = 0 ]
> There was no such logger  
> 'org.codehaus.plexus.redback.xwork.filter.authentication.HttpAuthentic 
> ator:basic' 18504142.
> 26410 [main] WARN org.codehaus.plexus.PlexusContainer - Component  
> manager not found for returned component. Ignored.  
> component=org.apache.maven.archiva.web.repository.ProxiedDavServer@928 
> 739
> Tests run: 15, Failures: 0, Errors: 0, Skipped: 0, Time elapsed:  
> 23.289 sec
> Running  
> org.apache.maven.archiva.web.action.admin.repositories.EditManagedRepo 
> sitoryActionTest
> Tests run: 3, Failures: 0, Errors: 0, Skipped: 0, Time elapsed:  
> 0.703 sec
> Running  
> org.apache.maven.archiva.web.action.admin.connectors.proxy.AddProxyCon 
> nectorActionTest
> 27217 [main] INFO org.codehaus.plexus.cache.Cache:url-failures- 
> cache - Disposing cache: [ name = url-failures-cache status =  
> STATUS_ALIVE eternal = false overflowToDisk = false  
> maxElementsInMemory = 1000 maxElementsOnDisk = 0  
> memoryStoreEvictionPolicy = LRU timeToLiveSeconds = 1800  
> timeToIdleSeconds = 2700 diskPersistent = false  
> diskExpiryThreadIntervalSeconds = 600 cacheEventListeners:   
> hitCount = 0 memoryStoreHitCount = 0 diskStoreHitCount = 0  
> missCountNotFound = 0 missCountExpired = 0 ]
> 27289 [main] INFO org.codehaus.plexus.cache.Cache:url-failures- 
> cache - Disposing cache: [ name = url-failures-cache status =  
> STATUS_ALIVE eternal = false overflowToDisk = false  
> maxElementsInMemory = 1000 maxElementsOnDisk = 0  
> memoryStoreEvictionPolicy = LRU timeToLiveSeconds = 1800  
> timeToIdleSeconds = 2700 diskPersistent = false  
> diskExpiryThreadIntervalSeconds = 600 cacheEventListeners:   
> hitCount = 0 memoryStoreHitCount = 0 diskStoreHitCount = 0  
> missCountNotFound = 0 missCountExpired = 0 ]
> 27645 [main] INFO org.codehaus.plexus.cache.Cache:url-failures- 
> cache - Disposing cache: [ name = url-failures-cache status =  
> STATUS_ALIVE eternal = false overflowToDisk = false  
> maxElementsInMemory = 1000 maxElementsOnDisk = 0  
> memoryStoreEvictionPolicy = LRU timeToLiveSeconds = 1800  
> timeToIdleSeconds = 2700 diskPersistent = false  
> diskExpiryThreadIntervalSeconds = 600 cacheEventListeners:   
> hitCount = 0 memoryStoreHitCount = 0 diskStoreHitCount = 0  
> missCountNotFound = 0 missCountExpired = 0 ]
> 27713 [main] INFO org.codehaus.plexus.cache.Cache:url-failures- 
> cache - Disposing cache: [ name = url-failures-cache status =  
> STATUS_ALIVE eternal = false overflowToDisk = false  
> maxElementsInMemory = 1000 maxElementsOnDisk = 0  
> memoryStoreEvictionPolicy = LRU timeToLiveSeconds = 1800  
> timeToIdleSeconds = 2700 diskPersistent = false  
> diskExpiryThreadIntervalSeconds = 600 cacheEventListeners:   
> hitCount = 0 memoryStoreHitCount = 0 diskStoreHitCount = 0  
> missCountNotFound = 0 missCountExpired = 0 ]
> 27783 [main] INFO org.codehaus.plexus.cache.Cache:url-failures- 
> cache - Disposing cache: [ name = url-failures-cache status =  
> STATUS_ALIVE eternal = false overflowToDisk = false  
> maxElementsInMemory = 1000 maxElementsOnDisk = 0  
> memoryStoreEvictionPolicy = LRU timeToLiveSeconds = 1800  
> timeToIdleSeconds = 2700 diskPersistent = false  
> diskExpiryThreadIntervalSeconds = 600 cacheEventListeners:   
> hitCount = 0 memoryStoreHitCount = 0 diskStoreHitCount = 0  
> missCountNotFound = 0 missCountExpired = 0 ]
> 27853 [main] INFO org.codehaus.plexus.cache.Cache:url-failures- 
> cache - Disposing cache: [ name = url-failures-cache status =  
> STATUS_ALIVE eternal = false overflowToDisk = false  
> maxElementsInMemory = 1000 maxElementsOnDisk = 0  
> memoryStoreEvictionPolicy = LRU timeToLiveSeconds = 1800  
> timeToIdleSeconds = 2700 diskPersistent = false  
> diskExpiryThreadIntervalSeconds = 600 cacheEventListeners:   
> hitCount = 0 memoryStoreHitCount = 0 diskStoreHitCount = 0  
> missCountNotFound = 0 missCountExpired = 0 ]
> 28168 [main] INFO org.codehaus.plexus.cache.Cache:url-failures- 
> cache - Disposing cache: [ name = url-failures-cache status =  
> STATUS_ALIVE eternal = false overflowToDisk = false  
> maxElementsInMemory = 1000 maxElementsOnDisk = 0  
> memoryStoreEvictionPolicy = LRU timeToLiveSeconds = 1800  
> timeToIdleSeconds = 2700 diskPersistent = false  
> diskExpiryThreadIntervalSeconds = 600 cacheEventListeners:   
> hitCount = 0 memoryStoreHitCount = 0 diskStoreHitCount = 0  
> missCountNotFound = 0 missCountExpired = 0 ]
> 28238 [main] INFO org.codehaus.plexus.cache.Cache:url-failures- 
> cache - Disposing cache: [ name = url-failures-cache status =  
> STATUS_ALIVE eternal = false overflowToDisk = false  
> maxElementsInMemory = 1000 maxElementsOnDisk = 0  
> memoryStoreEvictionPolicy = LRU timeToLiveSeconds = 1800  
> timeToIdleSeconds = 2700 diskPersistent = false  
> diskExpiryThreadIntervalSeconds = 600 cacheEventListeners:   
> hitCount = 0 memoryStoreHitCount = 0 diskStoreHitCount = 0  
> missCountNotFound = 0 missCountExpired = 0 ]
> 28307 [main] INFO org.codehaus.plexus.cache.Cache:url-failures- 
> cache - Disposing cache: [ name = url-failures-cache status =  
> STATUS_ALIVE eternal = false overflowToDisk = false  
> maxElementsInMemory = 1000 maxElementsOnDisk = 0  
> memoryStoreEvictionPolicy = LRU timeToLiveSeconds = 1800  
> timeToIdleSeconds = 2700 diskPersistent = false  
> diskExpiryThreadIntervalSeconds = 600 cacheEventListeners:   
> hitCount = 0 memoryStoreHitCount = 0 diskStoreHitCount = 0  
> missCountNotFound = 0 missCountExpired = 0 ]
> Tests run: 9, Failures: 0, Errors: 0, Skipped: 0, Time elapsed:  
> 1.165 sec
> Running  
> org.apache.maven.archiva.web.action.admin.repositories.DeleteManagedRe 
> positoryActionTest
> 28558 [main] INFO  
> com.opensymphony.xwork.Action:deleteManagedRepositoryAction -  
> Removing artifact org.apache.maven.archiva:test-artifact:jar:1.0  
> from the database.
> 28646 [main] INFO  
> com.opensymphony.xwork.Action:deleteManagedRepositoryAction -  
> Removing artifact org.apache.maven.archiva:test-artifact:jar:1.0  
> from the database.
> 28778 [main] INFO  
> com.opensymphony.xwork.Action:deleteManagedRepositoryAction -  
> Removing artifact org.apache.maven.archiva:test-artifact:jar:1.0  
> from the database.
> Tests run: 6, Failures: 0, Errors: 0, Skipped: 0, Time elapsed:  
> 0.529 sec
> Running org.apache.maven.archiva.web.startup.BannerTest
> Tests run: 3, Failures: 0, Errors: 0, Skipped: 0, Time elapsed:  
> 0.005 sec
> Running  
> org.apache.maven.archiva.web.action.admin.connectors.proxy.DeleteProxy 
> ConnectorActionTest
> [INFO] Disposing cache: [ name = url-failures-cache status =  
> STATUS_ALIVE eternal = false overflowToDisk = false  
> maxElementsInMemory = 1000 maxElementsOnDisk = 0  
> memoryStoreEvictionPolicy = LRU timeToLiveSeconds = 1800  
> timeToIdleSeconds = 2700 diskPersistent = true  
> diskExpiryThreadIntervalSeconds = 600 cacheEventListeners:   
> hitCount = 0 memoryStoreHitCount = 0 diskStoreHitCount = 0  
> missCountNotFound = 0 missCountExpired = 0 ]
> [INFO] Disposing cache: [ name = url-failures-cache status =  
> STATUS_ALIVE eternal = false overflowToDisk = false  
> maxElementsInMemory = 1000 maxElementsOnDisk = 0  
> memoryStoreEvictionPolicy = LRU timeToLiveSeconds = 1800  
> timeToIdleSeconds = 2700 diskPersistent = true  
> diskExpiryThreadIntervalSeconds = 600 cacheEventListeners:   
> hitCount = 0 memoryStoreHitCount = 0 diskStoreHitCount = 0  
> missCountNotFound = 0 missCountExpired = 0 ]
> [INFO] Disposing cache: [ name = url-failures-cache status =  
> STATUS_ALIVE eternal = false overflowToDisk = false  
> maxElementsInMemory = 1000 maxElementsOnDisk = 0  
> memoryStoreEvictionPolicy = LRU timeToLiveSeconds = 1800  
> timeToIdleSeconds = 2700 diskPersistent = true  
> diskExpiryThreadIntervalSeconds = 600 cacheEventListeners:   
> hitCount = 0 memoryStoreHitCount = 0 diskStoreHitCount = 0  
> missCountNotFound = 0 missCountExpired = 0 ]
> [INFO] Disposing cache: [ name = url-failures-cache status =  
> STATUS_ALIVE eternal = false overflowToDisk = false  
> maxElementsInMemory = 1000 maxElementsOnDisk = 0  
> memoryStoreEvictionPolicy = LRU timeToLiveSeconds = 1800  
> timeToIdleSeconds = 2700 diskPersistent = true  
> diskExpiryThreadIntervalSeconds = 600 cacheEventListeners:   
> hitCount = 0 memoryStoreHitCount = 0 diskStoreHitCount = 0  
> missCountNotFound = 0 missCountExpired = 0 ]
> [INFO] Disposing cache: [ name = url-failures-cache status =  
> STATUS_ALIVE eternal = false overflowToDisk = false  
> maxElementsInMemory = 1000 maxElementsOnDisk = 0  
> memoryStoreEvictionPolicy = LRU timeToLiveSeconds = 1800  
> timeToIdleSeconds = 2700 diskPersistent = true  
> diskExpiryThreadIntervalSeconds = 600 cacheEventListeners:   
> hitCount = 0 memoryStoreHitCount = 0 diskStoreHitCount = 0  
> missCountNotFound = 0 missCountExpired = 0 ]
> Tests run: 5, Failures: 0, Errors: 0, Skipped: 0, Time elapsed:  
> 0.685 sec
> Running  
> org.apache.maven.archiva.web.action.admin.repositories.DeleteRemoteRep 
> ositoryActionTest
> [INFO] Disposing cache: [ name = url-failures-cache status =  
> STATUS_ALIVE eternal = false overflowToDisk = false  
> maxElementsInMemory = 1000 maxElementsOnDisk = 0  
> memoryStoreEvictionPolicy = LRU timeToLiveSeconds = 1800  
> timeToIdleSeconds = 2700 diskPersistent = true  
> diskExpiryThreadIntervalSeconds = 600 cacheEventListeners:   
> hitCount = 0 memoryStoreHitCount = 0 diskStoreHitCount = 0  
> missCountNotFound = 0 missCountExpired = 0 ]
> [INFO] Disposing cache: [ name = url-failures-cache status =  
> STATUS_ALIVE eternal = false overflowToDisk = false  
> maxElementsInMemory = 1000 maxElementsOnDisk = 0  
> memoryStoreEvictionPolicy = LRU timeToLiveSeconds = 1800  
> timeToIdleSeconds = 2700 diskPersistent = true  
> diskExpiryThreadIntervalSeconds = 600 cacheEventListeners:   
> hitCount = 0 memoryStoreHitCount = 0 diskStoreHitCount = 0  
> missCountNotFound = 0 missCountExpired = 0 ]
> [INFO] Disposing cache: [ name = url-failures-cache status =  
> STATUS_ALIVE eternal = false overflowToDisk = false  
> maxElementsInMemory = 1000 maxElementsOnDisk = 0  
> memoryStoreEvictionPolicy = LRU timeToLiveSeconds = 1800  
> timeToIdleSeconds = 2700 diskPersistent = true  
> diskExpiryThreadIntervalSeconds = 600 cacheEventListeners:   
> hitCount = 0 memoryStoreHitCount = 0 diskStoreHitCount = 0  
> missCountNotFound = 0 missCountExpired = 0 ]
> Tests run: 3, Failures: 0, Errors: 0, Skipped: 0, Time elapsed:  
> 0.322 sec
> Running  
> org.apache.maven.archiva.web.action.admin.connectors.proxy.EditProxyCo 
> nnectorActionTest
> 30170 [main] INFO org.codehaus.plexus.cache.Cache:url-failures- 
> cache - Disposing cache: [ name = url-failures-cache status =  
> STATUS_ALIVE eternal = false overflowToDisk = false  
> maxElementsInMemory = 1000 maxElementsOnDisk = 0  
> memoryStoreEvictionPolicy = LRU timeToLiveSeconds = 1800  
> timeToIdleSeconds = 2700 diskPersistent = false  
> diskExpiryThreadIntervalSeconds = 600 cacheEventListeners:   
> hitCount = 0 memoryStoreHitCount = 0 diskStoreHitCount = 0  
> missCountNotFound = 0 missCountExpired = 0 ]
> 30246 [main] INFO org.codehaus.plexus.cache.Cache:url-failures- 
> cache - Disposing cache: [ name = url-failures-cache status =  
> STATUS_ALIVE eternal = false overflowToDisk = false  
> maxElementsInMemory = 1000 maxElementsOnDisk = 0  
> memoryStoreEvictionPolicy = LRU timeToLiveSeconds = 1800  
> timeToIdleSeconds = 2700 diskPersistent = false  
> diskExpiryThreadIntervalSeconds = 600 cacheEventListeners:   
> hitCount = 0 memoryStoreHitCount = 0 diskStoreHitCount = 0  
> missCountNotFound = 0 missCountExpired = 0 ]
> 30349 [main] INFO org.codehaus.plexus.cache.Cache:url-failures- 
> cache - Disposing cache: [ name = url-failures-cache status =  
> STATUS_ALIVE eternal = false overflowToDisk = false  
> maxElementsInMemory = 1000 maxElementsOnDisk = 0  
> memoryStoreEvictionPolicy = LRU timeToLiveSeconds = 1800  
> timeToIdleSeconds = 2700 diskPersistent = false  
> diskExpiryThreadIntervalSeconds = 600 cacheEventListeners:   
> hitCount = 0 memoryStoreHitCount = 0 diskStoreHitCount = 0  
> missCountNotFound = 0 missCountExpired = 0 ]
> 30414 [main] INFO org.codehaus.plexus.cache.Cache:url-failures- 
> cache - Disposing cache: [ name = url-failures-cache status =  
> STATUS_ALIVE eternal = false overflowToDisk = false  
> maxElementsInMemory = 1000 maxElementsOnDisk = 0  
> memoryStoreEvictionPolicy = LRU timeToLiveSeconds = 1800  
> timeToIdleSeconds = 2700 diskPersistent = false  
> diskExpiryThreadIntervalSeconds = 600 cacheEventListeners:   
> hitCount = 0 memoryStoreHitCount = 0 diskStoreHitCount = 0  
> missCountNotFound = 0 missCountExpired = 0 ]
> 30476 [main] INFO org.codehaus.plexus.cache.Cache:url-failures- 
> cache - Disposing cache: [ name = url-failures-cache status =  
> STATUS_ALIVE eternal = false overflowToDisk = false  
> maxElementsInMemory = 1000 maxElementsOnDisk = 0  
> memoryStoreEvictionPolicy = LRU timeToLiveSeconds = 1800  
> timeToIdleSeconds = 2700 diskPersistent = false  
> diskExpiryThreadIntervalSeconds = 600 cacheEventListeners:   
> hitCount = 0 memoryStoreHitCount = 0 diskStoreHitCount = 0  
> missCountNotFound = 0 missCountExpired = 0 ]
> 30542 [main] INFO org.codehaus.plexus.cache.Cache:url-failures- 
> cache - Disposing cache: [ name = url-failures-cache status =  
> STATUS_ALIVE eternal = false overflowToDisk = false  
> maxElementsInMemory = 1000 maxElementsOnDisk = 0  
> memoryStoreEvictionPolicy = LRU timeToLiveSeconds = 1800  
> timeToIdleSeconds = 2700 diskPersistent = false  
> diskExpiryThreadIntervalSeconds = 600 cacheEventListeners:   
> hitCount = 0 memoryStoreHitCount = 0 diskStoreHitCount = 0  
> missCountNotFound = 0 missCountExpired = 0 ]
> 30802 [main] INFO org.codehaus.plexus.cache.Cache:url-failures- 
> cache - Disposing cache: [ name = url-failures-cache status =  
> STATUS_ALIVE eternal = false overflowToDisk = false  
> maxElementsInMemory = 1000 maxElementsOnDisk = 0  
> memoryStoreEvictionPolicy = LRU timeToLiveSeconds = 1800  
> timeToIdleSeconds = 2700 diskPersistent = false  
> diskExpiryThreadIntervalSeconds = 600 cacheEventListeners:   
> hitCount = 0 memoryStoreHitCount = 0 diskStoreHitCount = 0  
> missCountNotFound = 0 missCountExpired = 0 ]
> 30915 [main] INFO org.codehaus.plexus.cache.Cache:url-failures- 
> cache - Disposing cache: [ name = url-failures-cache status =  
> STATUS_ALIVE eternal = false overflowToDisk = false  
> maxElementsInMemory = 1000 maxElementsOnDisk = 0  
> memoryStoreEvictionPolicy = LRU timeToLiveSeconds = 1800  
> timeToIdleSeconds = 2700 diskPersistent = false  
> diskExpiryThreadIntervalSeconds = 600 cacheEventListeners:   
> hitCount = 0 memoryStoreHitCount = 0 diskStoreHitCount = 0  
> missCountNotFound = 0 missCountExpired = 0 ]
> 30996 [main] INFO org.codehaus.plexus.cache.Cache:url-failures- 
> cache - Disposing cache: [ name = url-failures-cache status =  
> STATUS_ALIVE eternal = false overflowToDisk = false  
> maxElementsInMemory = 1000 maxElementsOnDisk = 0  
> memoryStoreEvictionPolicy = LRU timeToLiveSeconds = 1800  
> timeToIdleSeconds = 2700 diskPersistent = false  
> diskExpiryThreadIntervalSeconds = 600 cacheEventListeners:   
> hitCount = 0 memoryStoreHitCount = 0 diskStoreHitCount = 0  
> missCountNotFound = 0 missCountExpired = 0 ]
> Tests run: 9, Failures: 0, Errors: 0, Skipped: 0, Time elapsed:  
> 1.12 sec
> Running  
> org.apache.maven.archiva.web.action.admin.repositories.AddRemoteReposi 
> toryActionTest
> [INFO] Disposing cache: [ name = url-failures-cache status =  
> STATUS_ALIVE eternal = false overflowToDisk = false  
> maxElementsInMemory = 1000 maxElementsOnDisk = 0  
> memoryStoreEvictionPolicy = LRU timeToLiveSeconds = 1800  
> timeToIdleSeconds = 2700 diskPersistent = true  
> diskExpiryThreadIntervalSeconds = 600 cacheEventListeners:   
> hitCount = 0 memoryStoreHitCount = 0 diskStoreHitCount = 0  
> missCountNotFound = 0 missCountExpired = 0 ]
> [INFO] Disposing cache: [ name = url-failures-cache status =  
> STATUS_ALIVE eternal = false overflowToDisk = false  
> maxElementsInMemory = 1000 maxElementsOnDisk = 0  
> memoryStoreEvictionPolicy = LRU timeToLiveSeconds = 1800  
> timeToIdleSeconds = 2700 diskPersistent = true  
> diskExpiryThreadIntervalSeconds = 600 cacheEventListeners:   
> hitCount = 0 memoryStoreHitCount = 0 diskStoreHitCount = 0  
> missCountNotFound = 0 missCountExpired = 0 ]
> [INFO] Disposing cache: [ name = url-failures-cache status =  
> STATUS_ALIVE eternal = false overflowToDisk = false  
> maxElementsInMemory = 1000 maxElementsOnDisk = 0  
> memoryStoreEvictionPolicy = LRU timeToLiveSeconds = 1800  
> timeToIdleSeconds = 2700 diskPersistent = true  
> diskExpiryThreadIntervalSeconds = 600 cacheEventListeners:   
> hitCount = 0 memoryStoreHitCount = 0 diskStoreHitCount = 0  
> missCountNotFound = 0 missCountExpired = 0 ]
> Tests run: 3, Failures: 0, Errors: 0, Skipped: 0, Time elapsed:  
> 0.58 sec
> Running  
> org.apache.maven.archiva.web.action.admin.repositories.AddManagedRepos 
> itoryActionTest
> Tests run: 3, Failures: 0, Errors: 0, Skipped: 0, Time elapsed:  
> 0.433 sec
> Running  
> org.apache.maven.archiva.web.repository.RepositoryServletSecurityTest
> There was no such logger  
> 'org.apache.maven.archiva.configuration.ArchivaConfiguration:default'  
> 26665879.
> 32104 [main] INFO org.codehaus.plexus.cache.Cache:url-failures- 
> cache - Disposing cache: [ name = url-failures-cache status =  
> STATUS_ALIVE eternal = false overflowToDisk = false  
> maxElementsInMemory = 1000 maxElementsOnDisk = 0  
> memoryStoreEvictionPolicy = LRU timeToLiveSeconds = 1800  
> timeToIdleSeconds = 2700 diskPersistent = false  
> diskExpiryThreadIntervalSeconds = 600 cacheEventListeners:   
> hitCount = 0 memoryStoreHitCount = 0 diskStoreHitCount = 0  
> missCountNotFound = 0 missCountExpired = 0 ]
> There was no such logger  
> 'org.apache.maven.archiva.configuration.ArchivaConfiguration:default'  
> 18546164.
> 32187 [main] INFO org.codehaus.plexus.cache.Cache:url-failures- 
> cache - Disposing cache: [ name = url-failures-cache status =  
> STATUS_ALIVE eternal = false overflowToDisk = false  
> maxElementsInMemory = 1000 maxElementsOnDisk = 0  
> memoryStoreEvictionPolicy = LRU timeToLiveSeconds = 1800  
> timeToIdleSeconds = 2700 diskPersistent = false  
> diskExpiryThreadIntervalSeconds = 600 cacheEventListeners:   
> hitCount = 0 memoryStoreHitCount = 0 diskStoreHitCount = 0  
> missCountNotFound = 0 missCountExpired = 0 ]
> Tests run: 2, Failures: 0, Errors: 0, Skipped: 0, Time elapsed:  
> 0.167 sec
> Running  
> org.apache.maven.archiva.web.repository.RepositoryServletProxiedMetada 
> taRemoteOnlyTest
> 32276 [main] INFO org.mortbay.log - jetty-6.1.5
> 32277 [main] INFO org.mortbay.log - Started  
> SocketConnector@0.0.0.0:44404
> Remote HTTP Server started on http://localhost:44404/snapshots
> 33154 [main] INFO org.mortbay.log - jetty-6.1.5
> 33155 [main] INFO org.mortbay.log - Started  
> SocketConnector@0.0.0.0:44407
> Remote HTTP Server started on http://localhost:44407/private-snapshots
> 34529 [main] INFO org.codehaus.plexus.cache.Cache:url-failures- 
> cache - Disposing cache: [ name = url-failures-cache status =  
> STATUS_ALIVE eternal = false overflowToDisk = false  
> maxElementsInMemory = 1000 maxElementsOnDisk = 0  
> memoryStoreEvictionPolicy = LRU timeToLiveSeconds = 1800  
> timeToIdleSeconds = 2700 diskPersistent = false  
> diskExpiryThreadIntervalSeconds = 600 cacheEventListeners:   
> hitCount = 0 memoryStoreHitCount = 0 diskStoreHitCount = 0  
> missCountNotFound = 0 missCountExpired = 0 ]
> There was no such logger  
> 'org.codehaus.plexus.redback.xwork.filter.authentication.HttpAuthentic 
> ator:basic' 19831230.
> 34529 [main] WARN org.codehaus.plexus.PlexusContainer - Component  
> manager not found for returned component. Ignored.  
> component=org.apache.maven.archiva.web.repository.ProxiedDavServer@19d 
> bc5c
> 34617 [main] INFO org.mortbay.log - jetty-6.1.5
> 34618 [main] INFO org.mortbay.log - Started  
> SocketConnector@0.0.0.0:44410
> Remote HTTP Server started on http://localhost:44410/snapshots
> 35494 [main] INFO org.mortbay.log - jetty-6.1.5
> 35495 [main] INFO org.mortbay.log - Started  
> SocketConnector@0.0.0.0:44426
> Remote HTTP Server started on http://localhost:44426/private-snapshots
> 36649 [main] INFO org.codehaus.plexus.cache.Cache:url-failures- 
> cache - Disposing cache: [ name = url-failures-cache status =  
> STATUS_ALIVE eternal = false overflowToDisk = false  
> maxElementsInMemory = 1000 maxElementsOnDisk = 0  
> memoryStoreEvictionPolicy = LRU timeToLiveSeconds = 1800  
> timeToIdleSeconds = 2700 diskPersistent = false  
> diskExpiryThreadIntervalSeconds = 600 cacheEventListeners:   
> hitCount = 0 memoryStoreHitCount = 0 diskStoreHitCount = 0  
> missCountNotFound = 0 missCountExpired = 0 ]
> There was no such logger  
> 'org.codehaus.plexus.redback.xwork.filter.authentication.HttpAuthentic 
> ator:basic' 29779986.
> 36649 [main] WARN org.codehaus.plexus.PlexusContainer - Component  
> manager not found for returned component. Ignored.  
> component=org.apache.maven.archiva.web.repository.ProxiedDavServer@1ee 
> c0c5
> 36737 [main] INFO org.mortbay.log - jetty-6.1.5
> 36738 [main] INFO org.mortbay.log - Started  
> SocketConnector@0.0.0.0:44430
> Remote HTTP Server started on http://localhost:44430/snapshots
> 37623 [main] INFO org.mortbay.log - jetty-6.1.5
> 37624 [main] INFO org.mortbay.log - Started  
> SocketConnector@0.0.0.0:44437
> Remote HTTP Server started on http://localhost:44437/private-snapshots
> 38789 [main] INFO org.codehaus.plexus.cache.Cache:url-failures- 
> cache - Disposing cache: [ name = url-failures-cache status =  
> STATUS_ALIVE eternal = false overflowToDisk = false  
> maxElementsInMemory = 1000 maxElementsOnDisk = 0  
> memoryStoreEvictionPolicy = LRU timeToLiveSeconds = 1800  
> timeToIdleSeconds = 2700 diskPersistent = false  
> diskExpiryThreadIntervalSeconds = 600 cacheEventListeners:   
> hitCount = 0 memoryStoreHitCount = 0 diskStoreHitCount = 0  
> missCountNotFound = 0 missCountExpired = 0 ]
> There was no such logger  
> 'org.codehaus.plexus.redback.xwork.filter.authentication.HttpAuthentic 
> ator:basic' 24718636.
> 38789 [main] WARN org.codehaus.plexus.PlexusContainer - Component  
> manager not found for returned component. Ignored.  
> component=org.apache.maven.archiva.web.repository.ProxiedDavServer@17f 
> dc2d
> 38876 [main] INFO org.mortbay.log - jetty-6.1.5
> 38877 [main] INFO org.mortbay.log - Started  
> SocketConnector@0.0.0.0:44441
> Remote HTTP Server started on http://localhost:44441/snapshots
> 39743 [main] INFO org.mortbay.log - jetty-6.1.5
> 39744 [main] INFO org.mortbay.log - Started  
> SocketConnector@0.0.0.0:44446
> Remote HTTP Server started on http://localhost:44446/private-snapshots
> 40909 [main] INFO org.codehaus.plexus.cache.Cache:url-failures- 
> cache - Disposing cache: [ name = url-failures-cache status =  
> STATUS_ALIVE eternal = false overflowToDisk = false  
> maxElementsInMemory = 1000 maxElementsOnDisk = 0  
> memoryStoreEvictionPolicy = LRU timeToLiveSeconds = 1800  
> timeToIdleSeconds = 2700 diskPersistent = false  
> diskExpiryThreadIntervalSeconds = 600 cacheEventListeners:   
> hitCount = 0 memoryStoreHitCount = 0 diskStoreHitCount = 0  
> missCountNotFound = 0 missCountExpired = 0 ]
> There was no such logger  
> 'org.codehaus.plexus.redback.xwork.filter.authentication.HttpAuthentic 
> ator:basic' 17174249.
> 40909 [main] WARN org.codehaus.plexus.PlexusContainer - Component  
> manager not found for returned component. Ignored.  
> component=org.apache.maven.archiva.web.repository.ProxiedDavServer@1d1 
> 8707
> Tests run: 4, Failures: 0, Errors: 0, Skipped: 0, Time elapsed:  
> 8.72 sec
> Running  
> org.apache.maven.archiva.web.repository.RepositoryServletProxiedTimest 
> ampedSnapshotPolicyTest
> 41002 [main] INFO org.mortbay.log - jetty-6.1.5
> 41003 [main] INFO org.mortbay.log - Started  
> SocketConnector@0.0.0.0:44461
> Remote HTTP Server started on http://localhost:44461/snapshots
> 42039 [main] INFO org.codehaus.plexus.cache.Cache:url-failures- 
> cache - Disposing cache: [ name = url-failures-cache status =  
> STATUS_ALIVE eternal = false overflowToDisk = false  
> maxElementsInMemory = 1000 maxElementsOnDisk = 0  
> memoryStoreEvictionPolicy = LRU timeToLiveSeconds = 1800  
> timeToIdleSeconds = 2700 diskPersistent = false  
> diskExpiryThreadIntervalSeconds = 600 cacheEventListeners:   
> hitCount = 0 memoryStoreHitCount = 0 diskStoreHitCount = 0  
> missCountNotFound = 0 missCountExpired = 0 ]
> There was no such logger  
> 'org.codehaus.plexus.redback.xwork.filter.authentication.HttpAuthentic 
> ator:basic' 23218716.
> 42039 [main] WARN org.codehaus.plexus.PlexusContainer - Component  
> manager not found for returned component. Ignored.  
> component=org.apache.maven.archiva.web.repository.ProxiedDavServer@1ce 
> 58c1
> 42142 [main] INFO org.mortbay.log - jetty-6.1.5
> 42143 [main] INFO org.mortbay.log - Started  
> SocketConnector@0.0.0.0:44472
> Remote HTTP Server started on http://localhost:44472/snapshots
> 43229 [main] INFO org.codehaus.plexus.cache.Cache:url-failures- 
> cache - Disposing cache: [ name = url-failures-cache status =  
> STATUS_ALIVE eternal = false overflowToDisk = false  
> maxElementsInMemory = 1000 maxElementsOnDisk = 0  
> memoryStoreEvictionPolicy = LRU timeToLiveSeconds = 1800  
> timeToIdleSeconds = 2700 diskPersistent = false  
> diskExpiryThreadIntervalSeconds = 600 cacheEventListeners:   
> hitCount = 0 memoryStoreHitCount = 0 diskStoreHitCount = 0  
> missCountNotFound = 0 missCountExpired = 0 ]
> There was no such logger  
> 'org.codehaus.plexus.redback.xwork.filter.authentication.HttpAuthentic 
> ator:basic' 18384787.
> 43229 [main] WARN org.codehaus.plexus.PlexusContainer - Component  
> manager not found for returned component. Ignored.  
> component=org.apache.maven.archiva.web.repository.ProxiedDavServer@1f8 
> c10e
> 43317 [main] INFO org.mortbay.log - jetty-6.1.5
> 43318 [main] INFO org.mortbay.log - Started  
> SocketConnector@0.0.0.0:44479
> Remote HTTP Server started on http://localhost:44479/snapshots
> 44369 [main] INFO org.codehaus.plexus.cache.Cache:url-failures- 
> cache - Disposing cache: [ name = url-failures-cache status =  
> STATUS_ALIVE eternal = false overflowToDisk = false  
> maxElementsInMemory = 1000 maxElementsOnDisk = 0  
> memoryStoreEvictionPolicy = LRU timeToLiveSeconds = 1800  
> timeToIdleSeconds = 2700 diskPersistent = false  
> diskExpiryThreadIntervalSeconds = 600 cacheEventListeners:   
> hitCount = 0 memoryStoreHitCount = 0 diskStoreHitCount = 0  
> missCountNotFound = 0 missCountExpired = 0 ]
> There was no such logger  
> 'org.codehaus.plexus.redback.xwork.filter.authentication.HttpAuthentic 
> ator:basic' 20472158.
> 44369 [main] WARN org.codehaus.plexus.PlexusContainer - Component  
> manager not found for returned component. Ignored.  
> component=org.apache.maven.archiva.web.repository.ProxiedDavServer@b28 
> 5b6
> 44741 [main] INFO org.mortbay.log - jetty-6.1.5
> 44742 [main] INFO org.mortbay.log - Started  
> SocketConnector@0.0.0.0:44484
> Remote HTTP Server started on http://localhost:44484/snapshots
> 45647 [main] INFO  
> org.apache.maven.archiva.proxy.RepositoryProxyConnectors:default -  
> Transfer not attempted on http://localhost:44484/snapshotsorg/ 
> apache/archiva/test/3.0-SNAPSHOT/test-3.0-20070822.033400-42.jar :  
> NO to update snapshots, policy is DAILY, local file exist, and has  
> been updated within the last day.: using already present local file.
> 45759 [main] INFO org.codehaus.plexus.cache.Cache:url-failures- 
> cache - Disposing cache: [ name = url-failures-cache status =  
> STATUS_ALIVE eternal = false overflowToDisk = false  
> maxElementsInMemory = 1000 maxElementsOnDisk = 0  
> memoryStoreEvictionPolicy = LRU timeToLiveSeconds = 1800  
> timeToIdleSeconds = 2700 diskPersistent = false  
> diskExpiryThreadIntervalSeconds = 600 cacheEventListeners:   
> hitCount = 0 memoryStoreHitCount = 0 diskStoreHitCount = 0  
> missCountNotFound = 0 missCountExpired = 0 ]
> There was no such logger  
> 'org.codehaus.plexus.redback.xwork.filter.authentication.HttpAuthentic 
> ator:basic' 2465937.
> 45759 [main] WARN org.codehaus.plexus.PlexusContainer - Component  
> manager not found for returned component. Ignored.  
> component=org.apache.maven.archiva.web.repository.ProxiedDavServer@a88 
> 765
> 45846 [main] INFO org.mortbay.log - jetty-6.1.5
> 45847 [main] INFO org.mortbay.log - Started  
> SocketConnector@0.0.0.0:44509
> Remote HTTP Server started on http://localhost:44509/snapshots
> 46889 [main] INFO org.codehaus.plexus.cache.Cache:url-failures- 
> cache - Disposing cache: [ name = url-failures-cache status =  
> STATUS_ALIVE eternal = false overflowToDisk = false  
> maxElementsInMemory = 1000 maxElementsOnDisk = 0  
> memoryStoreEvictionPolicy = LRU timeToLiveSeconds = 1800  
> timeToIdleSeconds = 2700 diskPersistent = false  
> diskExpiryThreadIntervalSeconds = 600 cacheEventListeners:   
> hitCount = 0 memoryStoreHitCount = 0 diskStoreHitCount = 0  
> missCountNotFound = 0 missCountExpired = 0 ]
> There was no such logger  
> 'org.codehaus.plexus.redback.xwork.filter.authentication.HttpAuthentic 
> ator:basic' 8633270.
> 46889 [main] WARN org.codehaus.plexus.PlexusContainer - Component  
> manager not found for returned component. Ignored.  
> component=org.apache.maven.archiva.web.repository.ProxiedDavServer@b97 
> 275
> 46978 [main] INFO org.mortbay.log - jetty-6.1.5
> 46979 [main] INFO org.mortbay.log - Started  
> SocketConnector@0.0.0.0:44513
> Remote HTTP Server started on http://localhost:44513/snapshots
> 48019 [main] INFO org.codehaus.plexus.cache.Cache:url-failures- 
> cache - Disposing cache: [ name = url-failures-cache status =  
> STATUS_ALIVE eternal = false overflowToDisk = false  
> maxElementsInMemory = 1000 maxElementsOnDisk = 0  
> memoryStoreEvictionPolicy = LRU timeToLiveSeconds = 1800  
> timeToIdleSeconds = 2700 diskPersistent = false  
> diskExpiryThreadIntervalSeconds = 600 cacheEventListeners:   
> hitCount = 0 memoryStoreHitCount = 0 diskStoreHitCount = 0  
> missCountNotFound = 0 missCountExpired = 0 ]
> There was no such logger  
> 'org.codehaus.plexus.redback.xwork.filter.authentication.HttpAuthentic 
> ator:basic' 20180842.
> 48019 [main] WARN org.codehaus.plexus.PlexusContainer - Component  
> manager not found for returned component. Ignored.  
> component=org.apache.maven.archiva.web.repository.ProxiedDavServer@1f2 
> 1112
> 48410 [main] INFO org.mortbay.log - jetty-6.1.5
> 48411 [main] INFO org.mortbay.log - Started  
> SocketConnector@0.0.0.0:44523
> Remote HTTP Server started on http://localhost:44523/snapshots
> 49337 [main] INFO  
> org.apache.maven.archiva.proxy.RepositoryProxyConnectors:default -  
> Transfer not attempted on http://localhost:44523/snapshotsorg/ 
> apache/archiva/test/3.0-SNAPSHOT/test-3.0-20070822.033400-42.pom :  
> NO to update, snapshots policy set to NEVER.
> 49338 [main] INFO  
> org.apache.maven.archiva.proxy.RepositoryProxyConnectors:default -  
> Transfer not attempted on http://localhost:44523/snapshotsorg/ 
> apache/archiva/test/3.0-SNAPSHOT/test-3.0-20070822.033400-42.jar :  
> NO to update, snapshots policy set to NEVER.: using already present  
> local file.
> 49449 [main] INFO org.codehaus.plexus.cache.Cache:url-failures- 
> cache - Disposing cache: [ name = url-failures-cache status =  
> STATUS_ALIVE eternal = false overflowToDisk = false  
> maxElementsInMemory = 1000 maxElementsOnDisk = 0  
> memoryStoreEvictionPolicy = LRU timeToLiveSeconds = 1800  
> timeToIdleSeconds = 2700 diskPersistent = false  
> diskExpiryThreadIntervalSeconds = 600 cacheEventListeners:   
> hitCount = 0 memoryStoreHitCount = 0 diskStoreHitCount = 0  
> missCountNotFound = 0 missCountExpired = 0 ]
> There was no such logger  
> 'org.codehaus.plexus.redback.xwork.filter.authentication.HttpAuthentic 
> ator:basic' 28180743.
> 49449 [main] WARN org.codehaus.plexus.PlexusContainer - Component  
> manager not found for returned component. Ignored.  
> component=org.apache.maven.archiva.web.repository.ProxiedDavServer@1ae 
> 1081
> 49532 [main] INFO org.mortbay.log - jetty-6.1.5
> 49533 [main] INFO org.mortbay.log - Started  
> SocketConnector@0.0.0.0:44532
> Remote HTTP Server started on http://localhost:44532/snapshots
> 50414 [main] INFO  
> org.apache.maven.archiva.proxy.RepositoryProxyConnectors:default -  
> Transfer not attempted on http://localhost:44532/snapshotsorg/ 
> apache/archiva/test/3.0-SNAPSHOT/test-3.0-20070822.033400-42.pom :  
> NO to update, snapshots policy set to NEVER.
> 50414 [main] INFO  
> org.apache.maven.archiva.proxy.RepositoryProxyConnectors:default -  
> Transfer not attempted on http://localhost:44532/snapshotsorg/ 
> apache/archiva/test/3.0-SNAPSHOT/test-3.0-20070822.033400-42.jar :  
> NO to update, snapshots policy set to NEVER.
> 50518 [main] INFO org.codehaus.plexus.cache.Cache:url-failures- 
> cache - Disposing cache: [ name = url-failures-cache status =  
> STATUS_ALIVE eternal = false overflowToDisk = false  
> maxElementsInMemory = 1000 maxElementsOnDisk = 0  
> memoryStoreEvictionPolicy = LRU timeToLiveSeconds = 1800  
> timeToIdleSeconds = 2700 diskPersistent = false  
> diskExpiryThreadIntervalSeconds = 600 cacheEventListeners:   
> hitCount = 0 memoryStoreHitCount = 0 diskStoreHitCount = 0  
> missCountNotFound = 0 missCountExpired = 0 ]
> There was no such logger  
> 'org.codehaus.plexus.redback.xwork.filter.authentication.HttpAuthentic 
> ator:basic' 32047771.
> 50519 [main] WARN org.codehaus.plexus.PlexusContainer - Component  
> manager not found for returned component. Ignored.  
> component=org.apache.maven.archiva.web.repository.ProxiedDavServer@a7a 
> 434
> 50604 [main] INFO org.mortbay.log - jetty-6.1.5
> 50604 [main] INFO org.mortbay.log - Started  
> SocketConnector@0.0.0.0:44534
> Remote HTTP Server started on http://localhost:44534/snapshots
> 51531 [main] INFO  
> org.apache.maven.archiva.proxy.RepositoryProxyConnectors:default -  
> Transfer not attempted on http://localhost:44534/snapshotsorg/ 
> apache/archiva/test/3.0-SNAPSHOT/test-3.0-20070822.033400-42.pom :  
> NO to update, snapshots policy set to NEVER.
> 51532 [main] INFO  
> org.apache.maven.archiva.proxy.RepositoryProxyConnectors:default -  
> Transfer not attempted on http://localhost:44534/snapshotsorg/ 
> apache/archiva/test/3.0-SNAPSHOT/test-3.0-20070822.033400-42.jar :  
> NO to update, snapshots policy set to NEVER.: using already present  
> local file.
> 51639 [main] INFO org.codehaus.plexus.cache.Cache:url-failures- 
> cache - Disposing cache: [ name = url-failures-cache status =  
> STATUS_ALIVE eternal = false overflowToDisk = false  
> maxElementsInMemory = 1000 maxElementsOnDisk = 0  
> memoryStoreEvictionPolicy = LRU timeToLiveSeconds = 1800  
> timeToIdleSeconds = 2700 diskPersistent = false  
> diskExpiryThreadIntervalSeconds = 600 cacheEventListeners:   
> hitCount = 0 memoryStoreHitCount = 0 diskStoreHitCount = 0  
> missCountNotFound = 0 missCountExpired = 0 ]
> There was no such logger  
> 'org.codehaus.plexus.redback.xwork.filter.authentication.HttpAuthentic 
> ator:basic' 409300.
> 51639 [main] WARN org.codehaus.plexus.PlexusContainer - Component  
> manager not found for returned component. Ignored.  
> component=org.apache.maven.archiva.web.repository.ProxiedDavServer@19e 
> 97b
> 51727 [main] INFO org.mortbay.log - jetty-6.1.5
> Remote HTTP Server started on http://localhost:44558/snapshots
> 51729 [main] INFO org.mortbay.log - Started  
> SocketConnector@0.0.0.0:44558
> 52668 [main] INFO  
> org.apache.maven.archiva.proxy.RepositoryProxyConnectors:default -  
> Transfer not attempted on http://localhost:44558/snapshotsorg/ 
> apache/archiva/test/3.0-SNAPSHOT/test-3.0-20070822.033400-42.jar :  
> NO to update snapshots, policy is HOURLY, local file exist, and has  
> been updated within the last hour.: using already present local file.
> 52778 [main] INFO org.codehaus.plexus.cache.Cache:url-failures- 
> cache - Disposing cache: [ name = url-failures-cache status =  
> STATUS_ALIVE eternal = false overflowToDisk = false  
> maxElementsInMemory = 1000 maxElementsOnDisk = 0  
> memoryStoreEvictionPolicy = LRU timeToLiveSeconds = 1800  
> timeToIdleSeconds = 2700 diskPersistent = false  
> diskExpiryThreadIntervalSeconds = 600 cacheEventListeners:   
> hitCount = 0 memoryStoreHitCount = 0 diskStoreHitCount = 0  
> missCountNotFound = 0 missCountExpired = 0 ]
> There was no such logger  
> 'org.codehaus.plexus.redback.xwork.filter.authentication.HttpAuthentic 
> ator:basic' 25632624.
> 52779 [main] WARN org.codehaus.plexus.PlexusContainer - Component  
> manager not found for returned component. Ignored.  
> component=org.apache.maven.archiva.web.repository.ProxiedDavServer@f33 
> e2d
> 53210 [main] INFO org.mortbay.log - jetty-6.1.5
> 53211 [main] INFO org.mortbay.log - Started  
> SocketConnector@0.0.0.0:44560
> Remote HTTP Server started on http://localhost:44560/snapshots
> 54288 [main] INFO org.codehaus.plexus.cache.Cache:url-failures- 
> cache - Disposing cache: [ name = url-failures-cache status =  
> STATUS_ALIVE eternal = false overflowToDisk = false  
> maxElementsInMemory = 1000 maxElementsOnDisk = 0  
> memoryStoreEvictionPolicy = LRU timeToLiveSeconds = 1800  
> timeToIdleSeconds = 2700 diskPersistent = false  
> diskExpiryThreadIntervalSeconds = 600 cacheEventListeners:   
> hitCount = 0 memoryStoreHitCount = 0 diskStoreHitCount = 0  
> missCountNotFound = 0 missCountExpired = 0 ]
> There was no such logger  
> 'org.codehaus.plexus.redback.xwork.filter.authentication.HttpAuthentic 
> ator:basic' 33040763.
> 54289 [main] WARN org.codehaus.plexus.PlexusContainer - Component  
> manager not found for returned component. Ignored.  
> component=org.apache.maven.archiva.web.repository.ProxiedDavServer@4ef 
> 185
> 54373 [main] INFO org.mortbay.log - jetty-6.1.5
> 54374 [main] INFO org.mortbay.log - Started  
> SocketConnector@0.0.0.0:44565
> Remote HTTP Server started on http://localhost:44565/snapshots
> 55378 [main] INFO org.codehaus.plexus.cache.Cache:url-failures- 
> cache - Disposing cache: [ name = url-failures-cache status =  
> STATUS_ALIVE eternal = false overflowToDisk = false  
> maxElementsInMemory = 1000 maxElementsOnDisk = 0  
> memoryStoreEvictionPolicy = LRU timeToLiveSeconds = 1800  
> timeToIdleSeconds = 2700 diskPersistent = false  
> diskExpiryThreadIntervalSeconds = 600 cacheEventListeners:   
> hitCount = 0 memoryStoreHitCount = 0 diskStoreHitCount = 0  
> missCountNotFound = 0 missCountExpired = 0 ]
> There was no such logger  
> 'org.codehaus.plexus.redback.xwork.filter.authentication.HttpAuthentic 
> ator:basic' 591409.
> 55378 [main] WARN org.codehaus.plexus.PlexusContainer - Component  
> manager not found for returned component. Ignored.  
> component=org.apache.maven.archiva.web.repository.ProxiedDavServer@176 
> 829e
> 55464 [main] INFO org.mortbay.log - jetty-6.1.5
> 55464 [main] INFO org.mortbay.log - Started  
> SocketConnector@0.0.0.0:44569
> Remote HTTP Server started on http://localhost:44569/snapshots
> 56382 [main] INFO  
> org.apache.maven.archiva.proxy.RepositoryProxyConnectors:default -  
> Transfer not attempted on http://localhost:44569/snapshotsorg/ 
> apache/archiva/test/3.0-SNAPSHOT/test-3.0-20070822.033400-42.jar :  
> NO to update snapshots, policy is ONCE, and local file exist.:  
> using already present local file.
> 56488 [main] INFO org.codehaus.plexus.cache.Cache:url-failures- 
> cache - Disposing cache: [ name = url-failures-cache status =  
> STATUS_ALIVE eternal = false overflowToDisk = false  
> maxElementsInMemory = 1000 maxElementsOnDisk = 0  
> memoryStoreEvictionPolicy = LRU timeToLiveSeconds = 1800  
> timeToIdleSeconds = 2700 diskPersistent = false  
> diskExpiryThreadIntervalSeconds = 600 cacheEventListeners:   
> hitCount = 0 memoryStoreHitCount = 0 diskStoreHitCount = 0  
> missCountNotFound = 0 missCountExpired = 0 ]
> There was no such logger  
> 'org.codehaus.plexus.redback.xwork.filter.authentication.HttpAuthentic 
> ator:basic' 31961965.
> 56489 [main] WARN org.codehaus.plexus.PlexusContainer - Component  
> manager not found for returned component. Ignored.  
> component=org.apache.maven.archiva.web.repository.ProxiedDavServer@134 
> b58c
> 56908 [main] INFO org.mortbay.log - jetty-6.1.5
> 56909 [main] INFO org.mortbay.log - Started  
> SocketConnector@0.0.0.0:44572
> Remote HTTP Server started on http://localhost:44572/snapshots
> 57928 [main] INFO org.codehaus.plexus.cache.Cache:url-failures- 
> cache - Disposing cache: [ name = url-failures-cache status =  
> STATUS_ALIVE eternal = false overflowToDisk = false  
> maxElementsInMemory = 1000 maxElementsOnDisk = 0  
> memoryStoreEvictionPolicy = LRU timeToLiveSeconds = 1800  
> timeToIdleSeconds = 2700 diskPersistent = false  
> diskExpiryThreadIntervalSeconds = 600 cacheEventListeners:   
> hitCount = 0 memoryStoreHitCount = 0 diskStoreHitCount = 0  
> missCountNotFound = 0 missCountExpired = 0 ]
> There was no such logger  
> 'org.codehaus.plexus.redback.xwork.filter.authentication.HttpAuthentic 
> ator:basic' 14213340.
> 57929 [main] WARN org.codehaus.plexus.PlexusContainer - Component  
> manager not found for returned component. Ignored.  
> component=org.apache.maven.archiva.web.repository.ProxiedDavServer@7f9 
> d70
> 58015 [main] INFO org.mortbay.log - jetty-6.1.5
> 58016 [main] INFO org.mortbay.log - Started  
> SocketConnector@0.0.0.0:44576
> Remote HTTP Server started on http://localhost:44576/snapshots
> 59148 [main] INFO org.codehaus.plexus.cache.Cache:url-failures- 
> cache - Disposing cache: [ name = url-failures-cache status =  
> STATUS_ALIVE eternal = false overflowToDisk = false  
> maxElementsInMemory = 1000 maxElementsOnDisk = 0  
> memoryStoreEvictionPolicy = LRU timeToLiveSeconds = 1800  
> timeToIdleSeconds = 2700 diskPersistent = false  
> diskExpiryThreadIntervalSeconds = 600 cacheEventListeners:   
> hitCount = 0 memoryStoreHitCount = 0 diskStoreHitCount = 0  
> missCountNotFound = 0 missCountExpired = 0 ]
> There was no such logger  
> 'org.codehaus.plexus.redback.xwork.filter.authentication.HttpAuthentic 
> ator:basic' 33333330.
> 59149 [main] WARN org.codehaus.plexus.PlexusContainer - Component  
> manager not found for returned component. Ignored.  
> component=org.apache.maven.archiva.web.repository.ProxiedDavServer@91a 
> 129
> Tests run: 15, Failures: 0, Errors: 0, Skipped: 0, Time elapsed:  
> 18.237 sec
> Running  
> org.apache.maven.archiva.web.action.admin.repositories.RepositoriesAct 
> ionTest
> 59222 [main] INFO org.codehaus.plexus.cache.Cache:url-failures- 
> cache - Disposing cache: [ name = url-failures-cache status =  
> STATUS_ALIVE eternal = false overflowToDisk = false  
> maxElementsInMemory = 1000 maxElementsOnDisk = 0  
> memoryStoreEvictionPolicy = LRU timeToLiveSeconds = 1800  
> timeToIdleSeconds = 2700 diskPersistent = true  
> diskExpiryThreadIntervalSeconds = 600 cacheEventListeners:   
> hitCount = 0 memoryStoreHitCount = 0 diskStoreHitCount = 0  
> missCountNotFound = 0 missCountExpired = 0 ]
> 59310 [main] INFO org.codehaus.plexus.cache.Cache:url-failures- 
> cache - Disposing cache: [ name = url-failures-cache status =  
> STATUS_ALIVE eternal = false overflowToDisk = false  
> maxElementsInMemory = 1000 maxElementsOnDisk = 0  
> memoryStoreEvictionPolicy = LRU timeToLiveSeconds = 1800  
> timeToIdleSeconds = 2700 diskPersistent = true  
> diskExpiryThreadIntervalSeconds = 600 cacheEventListeners:   
> hitCount = 0 memoryStoreHitCount = 0 diskStoreHitCount = 0  
> missCountNotFound = 0 missCountExpired = 0 ]
> Tests run: 2, Failures: 0, Errors: 0, Skipped: 0, Time elapsed:  
> 0.159 sec
> Running  
> org.apache.maven.archiva.web.repository.RepositoryServletProxiedSnapsh 
> otPolicyTest
> 59399 [main] INFO org.mortbay.log - jetty-6.1.5
> 59400 [main] INFO org.mortbay.log - Started  
> SocketConnector@0.0.0.0:44580
> Remote HTTP Server started on http://localhost:44580/snapshots
> 60788 [main] INFO org.codehaus.plexus.cache.Cache:url-failures- 
> cache - Disposing cache: [ name = url-failures-cache status =  
> STATUS_ALIVE eternal = false overflowToDisk = false  
> maxElementsInMemory = 1000 maxElementsOnDisk = 0  
> memoryStoreEvictionPolicy = LRU timeToLiveSeconds = 1800  
> timeToIdleSeconds = 2700 diskPersistent = false  
> diskExpiryThreadIntervalSeconds = 600 cacheEventListeners:   
> hitCount = 0 memoryStoreHitCount = 0 diskStoreHitCount = 0  
> missCountNotFound = 0 missCountExpired = 0 ]
> There was no such logger  
> 'org.codehaus.plexus.redback.xwork.filter.authentication.HttpAuthentic 
> ator:basic' 1666978.
> 60788 [main] WARN org.codehaus.plexus.PlexusContainer - Component  
> manager not found for returned component. Ignored.  
> component=org.apache.maven.archiva.web.repository.ProxiedDavServer@181 
> c4a1
> 60865 [main] INFO org.mortbay.log - jetty-6.1.5
> 60866 [main] INFO org.mortbay.log - Started  
> SocketConnector@0.0.0.0:44584
> Remote HTTP Server started on http://localhost:44584/snapshots
> 61776 [main] INFO org.codehaus.plexus.cache.Cache:url-failures- 
> cache - Disposing cache: [ name = url-failures-cache status =  
> STATUS_ALIVE eternal = false overflowToDisk = false  
> maxElementsInMemory = 1000 maxElementsOnDisk = 0  
> memoryStoreEvictionPolicy = LRU timeToLiveSeconds = 1800  
> timeToIdleSeconds = 2700 diskPersistent = false  
> diskExpiryThreadIntervalSeconds = 600 cacheEventListeners:   
> hitCount = 0 memoryStoreHitCount = 0 diskStoreHitCount = 0  
> missCountNotFound = 0 missCountExpired = 0 ]
> There was no such logger  
> 'org.codehaus.plexus.redback.xwork.filter.authentication.HttpAuthentic 
> ator:basic' 20147650.
> 61776 [main] WARN org.codehaus.plexus.PlexusContainer - Component  
> manager not found for returned component. Ignored.  
> component=org.apache.maven.archiva.web.repository.ProxiedDavServer@4e7 
> 60b
> 61853 [main] INFO org.mortbay.log - jetty-6.1.5
> 61854 [main] INFO org.mortbay.log - Started  
> SocketConnector@0.0.0.0:44588
> Remote HTTP Server started on http://localhost:44588/snapshots
> 62828 [main] INFO org.codehaus.plexus.cache.Cache:url-failures- 
> cache - Disposing cache: [ name = url-failures-cache status =  
> STATUS_ALIVE eternal = false overflowToDisk = false  
> maxElementsInMemory = 1000 maxElementsOnDisk = 0  
> memoryStoreEvictionPolicy = LRU timeToLiveSeconds = 1800  
> timeToIdleSeconds = 2700 diskPersistent = false  
> diskExpiryThreadIntervalSeconds = 600 cacheEventListeners:   
> hitCount = 0 memoryStoreHitCount = 0 diskStoreHitCount = 0  
> missCountNotFound = 0 missCountExpired = 0 ]
> There was no such logger  
> 'org.codehaus.plexus.redback.xwork.filter.authentication.HttpAuthentic 
> ator:basic' 28556801.
> 62828 [main] WARN org.codehaus.plexus.PlexusContainer - Component  
> manager not found for returned component. Ignored.  
> component=org.apache.maven.archiva.web.repository.ProxiedDavServer@f9d 
> e08
> 62907 [main] INFO org.mortbay.log - jetty-6.1.5
> 62908 [main] INFO org.mortbay.log - Started  
> SocketConnector@0.0.0.0:44593
> Remote HTTP Server started on http://localhost:44593/snapshots
> 63805 [main] INFO  
> org.apache.maven.archiva.proxy.RepositoryProxyConnectors:default -  
> Transfer not attempted on http://localhost:44593/snapshotsorg/ 
> apache/archiva/test/2.0-SNAPSHOT/test-2.0-SNAPSHOT.jar : NO to  
> update snapshots, policy is DAILY, local file exist, and has been  
> updated within the last day.: using already present local file.
> 63908 [main] INFO org.codehaus.plexus.cache.Cache:url-failures- 
> cache - Disposing cache: [ name = url-failures-cache status =  
> STATUS_ALIVE eternal = false overflowToDisk = false  
> maxElementsInMemory = 1000 maxElementsOnDisk = 0  
> memoryStoreEvictionPolicy = LRU timeToLiveSeconds = 1800  
> timeToIdleSeconds = 2700 diskPersistent = false  
> diskExpiryThreadIntervalSeconds = 600 cacheEventListeners:   
> hitCount = 0 memoryStoreHitCount = 0 diskStoreHitCount = 0  
> missCountNotFound = 0 missCountExpired = 0 ]
> There was no such logger  
> 'org.codehaus.plexus.redback.xwork.filter.authentication.HttpAuthentic 
> ator:basic' 6700255.
> 63908 [main] WARN org.codehaus.plexus.PlexusContainer - Component  
> manager not found for returned component. Ignored.  
> component=org.apache.maven.archiva.web.repository.ProxiedDavServer@f6e 
> 9d
> 64176 [main] INFO org.mortbay.log - jetty-6.1.5
> 64177 [main] INFO org.mortbay.log - Started  
> SocketConnector@0.0.0.0:44596
> Remote HTTP Server started on http://localhost:44596/snapshots
> 65158 [main] INFO org.codehaus.plexus.cache.Cache:url-failures- 
> cache - Disposing cache: [ name = url-failures-cache status =  
> STATUS_ALIVE eternal = false overflowToDisk = false  
> maxElementsInMemory = 1000 maxElementsOnDisk = 0  
> memoryStoreEvictionPolicy = LRU timeToLiveSeconds = 1800  
> timeToIdleSeconds = 2700 diskPersistent = false  
> diskExpiryThreadIntervalSeconds = 600 cacheEventListeners:   
> hitCount = 0 memoryStoreHitCount = 0 diskStoreHitCount = 0  
> missCountNotFound = 0 missCountExpired = 0 ]
> There was no such logger  
> 'org.codehaus.plexus.redback.xwork.filter.authentication.HttpAuthentic 
> ator:basic' 9605583.
> 65158 [main] WARN org.codehaus.plexus.PlexusContainer - Component  
> manager not found for returned component. Ignored.  
> component=org.apache.maven.archiva.web.repository.ProxiedDavServer@165 
> b124
> 65234 [main] INFO org.mortbay.log - jetty-6.1.5
> 65235 [main] INFO org.mortbay.log - Started  
> SocketConnector@0.0.0.0:44600
> Remote HTTP Server started on http://localhost:44600/snapshots
> 66258 [main] INFO org.codehaus.plexus.cache.Cache:url-failures- 
> cache - Disposing cache: [ name = url-failures-cache status =  
> STATUS_ALIVE eternal = false overflowToDisk = false  
> maxElementsInMemory = 1000 maxElementsOnDisk = 0  
> memoryStoreEvictionPolicy = LRU timeToLiveSeconds = 1800  
> timeToIdleSeconds = 2700 diskPersistent = false  
> diskExpiryThreadIntervalSeconds = 600 cacheEventListeners:   
> hitCount = 0 memoryStoreHitCount = 0 diskStoreHitCount = 0  
> missCountNotFound = 0 missCountExpired = 0 ]
> There was no such logger  
> 'org.codehaus.plexus.redback.xwork.filter.authentication.HttpAuthentic 
> ator:basic' 12685710.
> 66258 [main] WARN org.codehaus.plexus.PlexusContainer - Component  
> manager not found for returned component. Ignored.  
> component=org.apache.maven.archiva.web.repository.ProxiedDavServer@677 
> 646
> 66334 [main] INFO org.mortbay.log - jetty-6.1.5
> 66335 [main] INFO org.mortbay.log - Started  
> SocketConnector@0.0.0.0:44605
> Remote HTTP Server started on http://localhost:44605/snapshots
> 67198 [main] INFO  
> org.apache.maven.archiva.proxy.RepositoryProxyConnectors:default -  
> Transfer not attempted on http://localhost:44605/snapshotsorg/ 
> apache/archiva/test/2.0-SNAPSHOT/test-2.0-SNAPSHOT.pom : NO to  
> update, snapshots policy set to NEVER.
> 67198 [main] INFO  
> org.apache.maven.archiva.proxy.RepositoryProxyConnectors:default -  
> Transfer not attempted on http://localhost:44605/snapshotsorg/ 
> apache/archiva/test/2.0-SNAPSHOT/test-2.0-SNAPSHOT.jar : NO to  
> update, snapshots policy set to NEVER.: using already present local  
> file.
> 67308 [main] INFO org.codehaus.plexus.cache.Cache:url-failures- 
> cache - Disposing cache: [ name = url-failures-cache status =  
> STATUS_ALIVE eternal = false overflowToDisk = false  
> maxElementsInMemory = 1000 maxElementsOnDisk = 0  
> memoryStoreEvictionPolicy = LRU timeToLiveSeconds = 1800  
> timeToIdleSeconds = 2700 diskPersistent = false  
> diskExpiryThreadIntervalSeconds = 600 cacheEventListeners:   
> hitCount = 0 memoryStoreHitCount = 0 diskStoreHitCount = 0  
> missCountNotFound = 0 missCountExpired = 0 ]
> There was no such logger  
> 'org.codehaus.plexus.redback.xwork.filter.authentication.HttpAuthentic 
> ator:basic' 13968172.
> 67308 [main] WARN org.codehaus.plexus.PlexusContainer - Component  
> manager not found for returned component. Ignored.  
> component=org.apache.maven.archiva.web.repository.ProxiedDavServer@7ae 
> c07
> 67395 [main] INFO org.mortbay.log - jetty-6.1.5
> 67395 [main] INFO org.mortbay.log - Started  
> SocketConnector@0.0.0.0:44608
> Remote HTTP Server started on http://localhost:44608/snapshots
> 68332 [main] INFO  
> org.apache.maven.archiva.proxy.RepositoryProxyConnectors:default -  
> Transfer not attempted on http://localhost:44608/snapshotsorg/ 
> apache/archiva/test/2.0-SNAPSHOT/test-2.0-SNAPSHOT.pom : NO to  
> update, snapshots policy set to NEVER.
> 68332 [main] INFO  
> org.apache.maven.archiva.proxy.RepositoryProxyConnectors:default -  
> Transfer not attempted on http://localhost:44608/snapshotsorg/ 
> apache/archiva/test/2.0-SNAPSHOT/test-2.0-SNAPSHOT.jar : NO to  
> update, snapshots policy set to NEVER.
> 68438 [main] INFO org.codehaus.plexus.cache.Cache:url-failures- 
> cache - Disposing cache: [ name = url-failures-cache status =  
> STATUS_ALIVE eternal = false overflowToDisk = false  
> maxElementsInMemory = 1000 maxElementsOnDisk = 0  
> memoryStoreEvictionPolicy = LRU timeToLiveSeconds = 1800  
> timeToIdleSeconds = 2700 diskPersistent = false  
> diskExpiryThreadIntervalSeconds = 600 cacheEventListeners:   
> hitCount = 0 memoryStoreHitCount = 0 diskStoreHitCount = 0  
> missCountNotFound = 0 missCountExpired = 0 ]
> There was no such logger  
> 'org.codehaus.plexus.redback.xwork.filter.authentication.HttpAuthentic 
> ator:basic' 21752005.
> 68438 [main] WARN org.codehaus.plexus.PlexusContainer - Component  
> manager not found for returned component. Ignored.  
> component=org.apache.maven.archiva.web.repository.ProxiedDavServer@c1b 
> eab
> 68889 [main] INFO org.mortbay.log - jetty-6.1.5
> 68890 [main] INFO org.mortbay.log - Started  
> SocketConnector@0.0.0.0:44611
> Remote HTTP Server started on http://localhost:44611/snapshots
> 69734 [main] INFO  
> org.apache.maven.archiva.proxy.RepositoryProxyConnectors:default -  
> Transfer not attempted on http://localhost:44611/snapshotsorg/ 
> apache/archiva/test/2.0-SNAPSHOT/test-2.0-SNAPSHOT.pom : NO to  
> update, snapshots policy set to NEVER.
> 69734 [main] INFO  
> org.apache.maven.archiva.proxy.RepositoryProxyConnectors:default -  
> Transfer not attempted on http://localhost:44611/snapshotsorg/ 
> apache/archiva/test/2.0-SNAPSHOT/test-2.0-SNAPSHOT.jar : NO to  
> update, snapshots policy set to NEVER.: using already present local  
> file.
> 69838 [main] INFO org.codehaus.plexus.cache.Cache:url-failures- 
> cache - Disposing cache: [ name = url-failures-cache status =  
> STATUS_ALIVE eternal = false overflowToDisk = false  
> maxElementsInMemory = 1000 maxElementsOnDisk = 0  
> memoryStoreEvictionPolicy = LRU timeToLiveSeconds = 1800  
> timeToIdleSeconds = 2700 diskPersistent = false  
> diskExpiryThreadIntervalSeconds = 600 cacheEventListeners:   
> hitCount = 0 memoryStoreHitCount = 0 diskStoreHitCount = 0  
> missCountNotFound = 0 missCountExpired = 0 ]
> There was no such logger  
> 'org.codehaus.plexus.redback.xwork.filter.authentication.HttpAuthentic 
> ator:basic' 12016576.
> 69838 [main] WARN org.codehaus.plexus.PlexusContainer - Component  
> manager not found for returned component. Ignored.  
> component=org.apache.maven.archiva.web.repository.ProxiedDavServer@138 
> 554d
> 69916 [main] INFO org.mortbay.log - jetty-6.1.5
> 69917 [main] INFO org.mortbay.log - Started  
> SocketConnector@0.0.0.0:44615
> Remote HTTP Server started on http://localhost:44615/snapshots
> 70817 [main] INFO  
> org.apache.maven.archiva.proxy.RepositoryProxyConnectors:default -  
> Transfer not attempted on http://localhost:44615/snapshotsorg/ 
> apache/archiva/test/2.0-SNAPSHOT/test-2.0-SNAPSHOT.jar : NO to  
> update snapshots, policy is HOURLY, local file exist, and has been  
> updated within the last hour.: using already present local file.
> 70820 [main] INFO org.codehaus.plexus.cache.Cache:url-failures- 
> cache - Disposing cache: [ name = url-failures-cache status =  
> STATUS_ALIVE eternal = false overflowToDisk = false  
> maxElementsInMemory = 1000 maxElementsOnDisk = 0  
> memoryStoreEvictionPolicy = LRU timeToLiveSeconds = 1800  
> timeToIdleSeconds = 2700 diskPersistent = false  
> diskExpiryThreadIntervalSeconds = 600 cacheEventListeners:   
> hitCount = 0 memoryStoreHitCount = 0 diskStoreHitCount = 0  
> missCountNotFound = 0 missCountExpired = 0 ]
> There was no such logger  
> 'org.codehaus.plexus.redback.xwork.filter.authentication.HttpAuthentic 
> ator:basic' 13577801.
> 70821 [main] WARN org.codehaus.plexus.PlexusContainer - Component  
> manager not found for returned component. Ignored.  
> component=org.apache.maven.archiva.web.repository.ProxiedDavServer@105 
> 40f
> 70906 [main] INFO org.mortbay.log - jetty-6.1.5
> 70907 [main] INFO org.mortbay.log - Started  
> SocketConnector@0.0.0.0:44623
> Remote HTTP Server started on http://localhost:44623/snapshots
> 71927 [main] INFO org.codehaus.plexus.cache.Cache:url-failures- 
> cache - Disposing cache: [ name = url-failures-cache status =  
> STATUS_ALIVE eternal = false overflowToDisk = false  
> maxElementsInMemory = 1000 maxElementsOnDisk = 0  
> memoryStoreEvictionPolicy = LRU timeToLiveSeconds = 1800  
> timeToIdleSeconds = 2700 diskPersistent = false  
> diskExpiryThreadIntervalSeconds = 600 cacheEventListeners:   
> hitCount = 0 memoryStoreHitCount = 0 diskStoreHitCount = 0  
> missCountNotFound = 0 missCountExpired = 0 ]
> There was no such logger  
> 'org.codehaus.plexus.redback.xwork.filter.authentication.HttpAuthentic 
> ator:basic' 9157440.
> 71928 [main] WARN org.codehaus.plexus.PlexusContainer - Component  
> manager not found for returned component. Ignored.  
> component=org.apache.maven.archiva.web.repository.ProxiedDavServer@187 
> 0cfc
> 72009 [main] INFO org.mortbay.log - jetty-6.1.5
> 72010 [main] INFO org.mortbay.log - Started  
> SocketConnector@0.0.0.0:44628
> Remote HTTP Server started on http://localhost:44628/snapshots
> 73007 [main] INFO org.codehaus.plexus.cache.Cache:url-failures- 
> cache - Disposing cache: [ name = url-failures-cache status =  
> STATUS_ALIVE eternal = false overflowToDisk = false  
> maxElementsInMemory = 1000 maxElementsOnDisk = 0  
> memoryStoreEvictionPolicy = LRU timeToLiveSeconds = 1800  
> timeToIdleSeconds = 2700 diskPersistent = false  
> diskExpiryThreadIntervalSeconds = 600 cacheEventListeners:   
> hitCount = 0 memoryStoreHitCount = 0 diskStoreHitCount = 0  
> missCountNotFound = 0 missCountExpired = 0 ]
> There was no such logger  
> 'org.codehaus.plexus.redback.xwork.filter.authentication.HttpAuthentic 
> ator:basic' 11734264.
> 73008 [main] WARN org.codehaus.plexus.PlexusContainer - Component  
> manager not found for returned component. Ignored.  
> component=org.apache.maven.archiva.web.repository.ProxiedDavServer@e1f 
> 6c
> 73442 [main] INFO org.mortbay.log - jetty-6.1.5
> 73443 [main] INFO org.mortbay.log - Started  
> SocketConnector@0.0.0.0:44632
> Remote HTTP Server started on http://localhost:44632/snapshots
> 74333 [main] INFO  
> org.apache.maven.archiva.proxy.RepositoryProxyConnectors:default -  
> Transfer not attempted on http://localhost:44632/snapshotsorg/ 
> apache/archiva/test/2.0-SNAPSHOT/test-2.0-SNAPSHOT.jar : NO to  
> update snapshots, policy is ONCE, and local file exist.: using  
> already present local file.
> 74437 [main] INFO org.codehaus.plexus.cache.Cache:url-failures- 
> cache - Disposing cache: [ name = url-failures-cache status =  
> STATUS_ALIVE eternal = false overflowToDisk = false  
> maxElementsInMemory = 1000 maxElementsOnDisk = 0  
> memoryStoreEvictionPolicy = LRU timeToLiveSeconds = 1800  
> timeToIdleSeconds = 2700 diskPersistent = false  
> diskExpiryThreadIntervalSeconds = 600 cacheEventListeners:   
> hitCount = 0 memoryStoreHitCount = 0 diskStoreHitCount = 0  
> missCountNotFound = 0 missCountExpired = 0 ]
> There was no such logger  
> 'org.codehaus.plexus.redback.xwork.filter.authentication.HttpAuthentic 
> ator:basic' 11383312.
> 74438 [main] WARN org.codehaus.plexus.PlexusContainer - Component  
> manager not found for returned component. Ignored.  
> component=org.apache.maven.archiva.web.repository.ProxiedDavServer@10e 
> 4408
> 74518 [main] INFO org.mortbay.log - jetty-6.1.5
> 74519 [main] INFO org.mortbay.log - Started  
> SocketConnector@0.0.0.0:44634
> Remote HTTP Server started on http://localhost:44634/snapshots
> 75548 [main] INFO org.codehaus.plexus.cache.Cache:url-failures- 
> cache - Disposing cache: [ name = url-failures-cache status =  
> STATUS_ALIVE eternal = false overflowToDisk = false  
> maxElementsInMemory = 1000 maxElementsOnDisk = 0  
> memoryStoreEvictionPolicy = LRU timeToLiveSeconds = 1800  
> timeToIdleSeconds = 2700 diskPersistent = false  
> diskExpiryThreadIntervalSeconds = 600 cacheEventListeners:   
> hitCount = 0 memoryStoreHitCount = 0 diskStoreHitCount = 0  
> missCountNotFound = 0 missCountExpired = 0 ]
> There was no such logger  
> 'org.codehaus.plexus.redback.xwork.filter.authentication.HttpAuthentic 
> ator:basic' 16602814.
> 75548 [main] WARN org.codehaus.plexus.PlexusContainer - Component  
> manager not found for returned component. Ignored.  
> component=org.apache.maven.archiva.web.repository.ProxiedDavServer@fa6 
> 240
> 75633 [main] INFO org.mortbay.log - jetty-6.1.5
> 75634 [main] INFO org.mortbay.log - Started  
> SocketConnector@0.0.0.0:44639
> Remote HTTP Server started on http://localhost:44639/snapshots
> 76837 [main] INFO org.codehaus.plexus.cache.Cache:url-failures- 
> cache - Disposing cache: [ name = url-failures-cache status =  
> STATUS_ALIVE eternal = false overflowToDisk = false  
> maxElementsInMemory = 1000 maxElementsOnDisk = 0  
> memoryStoreEvictionPolicy = LRU timeToLiveSeconds = 1800  
> timeToIdleSeconds = 2700 diskPersistent = false  
> diskExpiryThreadIntervalSeconds = 600 cacheEventListeners:   
> hitCount = 0 memoryStoreHitCount = 0 diskStoreHitCount = 0  
> missCountNotFound = 0 missCountExpired = 0 ]
> There was no such logger  
> 'org.codehaus.plexus.redback.xwork.filter.authentication.HttpAuthentic 
> ator:basic' 18661784.
> 76838 [main] WARN org.codehaus.plexus.PlexusContainer - Component  
> manager not found for returned component. Ignored.  
> component=org.apache.maven.archiva.web.repository.ProxiedDavServer@157 
> f55f
> Tests run: 15, Failures: 0, Errors: 0, Skipped: 0, Time elapsed:  
> 17.525 sec
> Running  
> org.apache.maven.archiva.web.repository.RepositoryServletBrowseTest
> 76946 [main] INFO org.codehaus.plexus.cache.Cache:url-failures- 
> cache - Disposing cache: [ name = url-failures-cache status =  
> STATUS_ALIVE eternal = false overflowToDisk = false  
> maxElementsInMemory = 1000 maxElementsOnDisk = 0  
> memoryStoreEvictionPolicy = LRU timeToLiveSeconds = 1800  
> timeToIdleSeconds = 2700 diskPersistent = false  
> diskExpiryThreadIntervalSeconds = 600 cacheEventListeners:   
> hitCount = 0 memoryStoreHitCount = 0 diskStoreHitCount = 0  
> missCountNotFound = 0 missCountExpired = 0 ]
> There was no such logger  
> 'org.codehaus.plexus.redback.xwork.filter.authentication.HttpAuthentic 
> ator:basic' 24490290.
> 76947 [main] WARN org.codehaus.plexus.PlexusContainer - Component  
> manager not found for returned component. Ignored.  
> component=org.apache.maven.archiva.web.repository.ProxiedDavServer@12c 
> f9bd
> Tests run: 1, Failures: 0, Errors: 0, Skipped: 0, Time elapsed:  
> 0.106 sec
> Running  
> org.apache.maven.archiva.web.repository.RepositoryServletProxiedMetada 
> taLocalOnlyTest
> 77402 [main] INFO org.mortbay.log - jetty-6.1.5
> 77403 [main] INFO org.mortbay.log - Started  
> SocketConnector@0.0.0.0:44643
> Remote HTTP Server started on http://localhost:44643/snapshots
> 78271 [main] INFO org.mortbay.log - jetty-6.1.5
> 78272 [main] INFO org.mortbay.log - Started  
> SocketConnector@0.0.0.0:44646
> Remote HTTP Server started on http://localhost:44646/private-snapshots
> 79407 [main] INFO org.codehaus.plexus.cache.Cache:url-failures- 
> cache - Disposing cache: [ name = url-failures-cache status =  
> STATUS_ALIVE eternal = false overflowToDisk = false  
> maxElementsInMemory = 1000 maxElementsOnDisk = 0  
> memoryStoreEvictionPolicy = LRU timeToLiveSeconds = 1800  
> timeToIdleSeconds = 2700 diskPersistent = false  
> diskExpiryThreadIntervalSeconds = 600 cacheEventListeners:   
> hitCount = 0 memoryStoreHitCount = 0 diskStoreHitCount = 0  
> missCountNotFound = 0 missCountExpired = 0 ]
> There was no such logger  
> 'org.codehaus.plexus.redback.xwork.filter.authentication.HttpAuthentic 
> ator:basic' 820241.
> 79407 [main] WARN org.codehaus.plexus.PlexusContainer - Component  
> manager not found for returned component. Ignored.  
> component=org.apache.maven.archiva.web.repository.ProxiedDavServer@153 
> 9e8b
> 79489 [main] INFO org.mortbay.log - jetty-6.1.5
> 79489 [main] INFO org.mortbay.log - Started  
> SocketConnector@0.0.0.0:44648
> Remote HTTP Server started on http://localhost:44648/snapshots
> 80371 [main] INFO org.mortbay.log - jetty-6.1.5
> 80372 [main] INFO org.mortbay.log - Started  
> SocketConnector@0.0.0.0:44650
> Remote HTTP Server started on http://localhost:44650/private-snapshots
> 81497 [main] INFO org.codehaus.plexus.cache.Cache:url-failures- 
> cache - Disposing cache: [ name = url-failures-cache status =  
> STATUS_ALIVE eternal = false overflowToDisk = false  
> maxElementsInMemory = 1000 maxElementsOnDisk = 0  
> memoryStoreEvictionPolicy = LRU timeToLiveSeconds = 1800  
> timeToIdleSeconds = 2700 diskPersistent = false  
> diskExpiryThreadIntervalSeconds = 600 cacheEventListeners:   
> hitCount = 0 memoryStoreHitCount = 0 diskStoreHitCount = 0  
> missCountNotFound = 0 missCountExpired = 0 ]
> There was no such logger  
> 'org.codehaus.plexus.redback.xwork.filter.authentication.HttpAuthentic 
> ator:basic' 9890043.
> 81497 [main] WARN org.codehaus.plexus.PlexusContainer - Component  
> manager not found for returned component. Ignored.  
> component=org.apache.maven.archiva.web.repository.ProxiedDavServer@1d1 
> f39a
> 81578 [main] INFO org.mortbay.log - jetty-6.1.5
> 81579 [main] INFO org.mortbay.log - Started  
> SocketConnector@0.0.0.0:44653
> Remote HTTP Server started on http://localhost:44653/snapshots
> 82461 [main] INFO org.mortbay.log - jetty-6.1.5
> 82462 [main] INFO org.mortbay.log - Started  
> SocketConnector@0.0.0.0:44655
> Remote HTTP Server started on http://localhost:44655/private-snapshots
> 83637 [main] INFO org.codehaus.plexus.cache.Cache:url-failures- 
> cache - Disposing cache: [ name = url-failures-cache status =  
> STATUS_ALIVE eternal = false overflowToDisk = false  
> maxElementsInMemory = 1000 maxElementsOnDisk = 0  
> memoryStoreEvictionPolicy = LRU timeToLiveSeconds = 1800  
> timeToIdleSeconds = 2700 diskPersistent = false  
> diskExpiryThreadIntervalSeconds = 600 cacheEventListeners:   
> hitCount = 0 memoryStoreHitCount = 0 diskStoreHitCount = 0  
> missCountNotFound = 0 missCountExpired = 0 ]
> There was no such logger  
> 'org.codehaus.plexus.redback.xwork.filter.authentication.HttpAuthentic 
> ator:basic' 1426599.
> 83637 [main] WARN org.codehaus.plexus.PlexusContainer - Component  
> manager not found for returned component. Ignored.  
> component=org.apache.maven.archiva.web.repository.ProxiedDavServer@164 
> 690
> Tests run: 3, Failures: 0, Errors: 0, Skipped: 0, Time elapsed:  
> 6.687 sec
> Running  
> org.apache.maven.archiva.web.repository.RepositoryServletNoProxyTest
> 83735 [main] INFO org.codehaus.plexus.cache.Cache:url-failures- 
> cache - Disposing cache: [ name = url-failures-cache status =  
> STATUS_ALIVE eternal = false overflowToDisk = false  
> maxElementsInMemory = 1000 maxElementsOnDisk = 0  
> memoryStoreEvictionPolicy = LRU timeToLiveSeconds = 1800  
> timeToIdleSeconds = 2700 diskPersistent = false  
> diskExpiryThreadIntervalSeconds = 600 cacheEventListeners:   
> hitCount = 0 memoryStoreHitCount = 0 diskStoreHitCount = 0  
> missCountNotFound = 0 missCountExpired = 0 ]
> There was no such logger  
> 'org.codehaus.plexus.redback.xwork.filter.authentication.HttpAuthentic 
> ator:basic' 32706760.
> 83735 [main] WARN org.codehaus.plexus.PlexusContainer - Component  
> manager not found for returned component. Ignored.  
> component=org.apache.maven.archiva.web.repository.ProxiedDavServer@458 
> c1e
> 84080 [main] INFO org.codehaus.plexus.cache.Cache:url-failures- 
> cache - Disposing cache: [ name = url-failures-cache status =  
> STATUS_ALIVE eternal = false overflowToDisk = false  
> maxElementsInMemory = 1000 maxElementsOnDisk = 0  
> memoryStoreEvictionPolicy = LRU timeToLiveSeconds = 1800  
> timeToIdleSeconds = 2700 diskPersistent = false  
> diskExpiryThreadIntervalSeconds = 600 cacheEventListeners:   
> hitCount = 0 memoryStoreHitCount = 0 diskStoreHitCount = 0  
> missCountNotFound = 0 missCountExpired = 0 ]
> There was no such logger  
> 'org.codehaus.plexus.redback.xwork.filter.authentication.HttpAuthentic 
> ator:basic' 1509625.
> 84081 [main] WARN org.codehaus.plexus.PlexusContainer - Component  
> manager not found for returned component. Ignored.  
> component=org.apache.maven.archiva.web.repository.ProxiedDavServer@114 
> ca44
> 84172 [main] INFO org.codehaus.plexus.cache.Cache:url-failures- 
> cache - Disposing cache: [ name = url-failures-cache status =  
> STATUS_ALIVE eternal = false overflowToDisk = false  
> maxElementsInMemory = 1000 maxElementsOnDisk = 0  
> memoryStoreEvictionPolicy = LRU timeToLiveSeconds = 1800  
> timeToIdleSeconds = 2700 diskPersistent = false  
> diskExpiryThreadIntervalSeconds = 600 cacheEventListeners:   
> hitCount = 0 memoryStoreHitCount = 0 diskStoreHitCount = 0  
> missCountNotFound = 0 missCountExpired = 0 ]
> There was no such logger  
> 'org.codehaus.plexus.redback.xwork.filter.authentication.HttpAuthentic 
> ator:basic' 22986285.
> 84172 [main] WARN org.codehaus.plexus.PlexusContainer - Component  
> manager not found for returned component. Ignored.  
> component=org.apache.maven.archiva.web.repository.ProxiedDavServer@1f5 
> 8a0e
> 84266 [main] INFO org.codehaus.plexus.cache.Cache:url-failures- 
> cache - Disposing cache: [ name = url-failures-cache status =  
> STATUS_ALIVE eternal = false overflowToDisk = false  
> maxElementsInMemory = 1000 maxElementsOnDisk = 0  
> memoryStoreEvictionPolicy = LRU timeToLiveSeconds = 1800  
> timeToIdleSeconds = 2700 diskPersistent = false  
> diskExpiryThreadIntervalSeconds = 600 cacheEventListeners:   
> hitCount = 0 memoryStoreHitCount = 0 diskStoreHitCount = 0  
> missCountNotFound = 0 missCountExpired = 0 ]
> There was no such logger  
> 'org.codehaus.plexus.redback.xwork.filter.authentication.HttpAuthentic 
> ator:basic' 20288556.
> 84267 [main] WARN org.codehaus.plexus.PlexusContainer - Component  
> manager not found for returned component. Ignored.  
> component=org.apache.maven.archiva.web.repository.ProxiedDavServer@116 
> e1c9
> 84359 [main] INFO org.codehaus.plexus.cache.Cache:url-failures- 
> cache - Disposing cache: [ name = url-failures-cache status =  
> STATUS_ALIVE eternal = false overflowToDisk = false  
> maxElementsInMemory = 1000 maxElementsOnDisk = 0  
> memoryStoreEvictionPolicy = LRU timeToLiveSeconds = 1800  
> timeToIdleSeconds = 2700 diskPersistent = false  
> diskExpiryThreadIntervalSeconds = 600 cacheEventListeners:   
> hitCount = 0 memoryStoreHitCount = 0 diskStoreHitCount = 0  
> missCountNotFound = 0 missCountExpired = 0 ]
> There was no such logger  
> 'org.codehaus.plexus.redback.xwork.filter.authentication.HttpAuthentic 
> ator:basic' 3557553.
> 84359 [main] WARN org.codehaus.plexus.PlexusContainer - Component  
> manager not found for returned component. Ignored.  
> component=org.apache.maven.archiva.web.repository.ProxiedDavServer@1db 
> c091
> 84611 [main] INFO org.codehaus.plexus.cache.Cache:url-failures- 
> cache - Disposing cache: [ name = url-failures-cache status =  
> STATUS_ALIVE eternal = false overflowToDisk = false  
> maxElementsInMemory = 1000 maxElementsOnDisk = 0  
> memoryStoreEvictionPolicy = LRU timeToLiveSeconds = 1800  
> timeToIdleSeconds = 2700 diskPersistent = false  
> diskExpiryThreadIntervalSeconds = 600 cacheEventListeners:   
> hitCount = 0 memoryStoreHitCount = 0 diskStoreHitCount = 0  
> missCountNotFound = 0 missCountExpired = 0 ]
> There was no such logger  
> 'org.codehaus.plexus.redback.xwork.filter.authentication.HttpAuthentic 
> ator:basic' 29748839.
> 84611 [main] WARN org.codehaus.plexus.PlexusContainer - Component  
> manager not found for returned component. Ignored.  
> component=org.apache.maven.archiva.web.repository.ProxiedDavServer@1a2 
> 87b7
> 84704 [main] INFO org.codehaus.plexus.cache.Cache:url-failures- 
> cache - Disposing cache: [ name = url-failures-cache status =  
> STATUS_ALIVE eternal = false overflowToDisk = false  
> maxElementsInMemory = 1000 maxElementsOnDisk = 0  
> memoryStoreEvictionPolicy = LRU timeToLiveSeconds = 1800  
> timeToIdleSeconds = 2700 diskPersistent = false  
> diskExpiryThreadIntervalSeconds = 600 cacheEventListeners:   
> hitCount = 0 memoryStoreHitCount = 0 diskStoreHitCount = 0  
> missCountNotFound = 0 missCountExpired = 0 ]
> There was no such logger  
> 'org.codehaus.plexus.redback.xwork.filter.authentication.HttpAuthentic 
> ator:basic' 26154958.
> 84705 [main] WARN org.codehaus.plexus.PlexusContainer - Component  
> manager not found for returned component. Ignored.  
> component=org.apache.maven.archiva.web.repository.ProxiedDavServer@b8c 
> dc7
> 84803 [main] INFO org.codehaus.plexus.cache.Cache:url-failures- 
> cache - Disposing cache: [ name = url-failures-cache status =  
> STATUS_ALIVE eternal = false overflowToDisk = false  
> maxElementsInMemory = 1000 maxElementsOnDisk = 0  
> memoryStoreEvictionPolicy = LRU timeToLiveSeconds = 1800  
> timeToIdleSeconds = 2700 diskPersistent = false  
> diskExpiryThreadIntervalSeconds = 600 cacheEventListeners:   
> hitCount = 0 memoryStoreHitCount = 0 diskStoreHitCount = 0  
> missCountNotFound = 0 missCountExpired = 0 ]
> There was no such logger  
> 'org.codehaus.plexus.redback.xwork.filter.authentication.HttpAuthentic 
> ator:basic' 13467611.
> 84803 [main] WARN org.codehaus.plexus.PlexusContainer - Component  
> manager not found for returned component. Ignored.  
> component=org.apache.maven.archiva.web.repository.ProxiedDavServer@46d 
> b0d
> 84899 [main] INFO org.codehaus.plexus.cache.Cache:url-failures- 
> cache - Disposing cache: [ name = url-failures-cache status =  
> STATUS_ALIVE eternal = false overflowToDisk = false  
> maxElementsInMemory = 1000 maxElementsOnDisk = 0  
> memoryStoreEvictionPolicy = LRU timeToLiveSeconds = 1800  
> timeToIdleSeconds = 2700 diskPersistent = false  
> diskExpiryThreadIntervalSeconds = 600 cacheEventListeners:   
> hitCount = 0 memoryStoreHitCount = 0 diskStoreHitCount = 0  
> missCountNotFound = 0 missCountExpired = 0 ]
> There was no such logger  
> 'org.codehaus.plexus.redback.xwork.filter.authentication.HttpAuthentic 
> ator:basic' 32974142.
> 84899 [main] WARN org.codehaus.plexus.PlexusContainer - Component  
> manager not found for returned component. Ignored.  
> component=org.apache.maven.archiva.web.repository.ProxiedDavServer@4a6 
> 010
> 85013 [main] INFO org.codehaus.plexus.cache.Cache:url-failures- 
> cache - Disposing cache: [ name = url-failures-cache status =  
> STATUS_ALIVE eternal = false overflowToDisk = false  
> maxElementsInMemory = 1000 maxElementsOnDisk = 0  
> memoryStoreEvictionPolicy = LRU timeToLiveSeconds = 1800  
> timeToIdleSeconds = 2700 diskPersistent = false  
> diskExpiryThreadIntervalSeconds = 600 cacheEventListeners:   
> hitCount = 0 memoryStoreHitCount = 0 diskStoreHitCount = 0  
> missCountNotFound = 0 missCountExpired = 0 ]
> There was no such logger  
> 'org.codehaus.plexus.redback.xwork.filter.authentication.HttpAuthentic 
> ator:basic' 19112777.
> 85014 [main] WARN org.codehaus.plexus.PlexusContainer - Component  
> manager not found for returned component. Ignored.  
> component=org.apache.maven.archiva.web.repository.ProxiedDavServer@181 
> dd44
> 85512 [main] INFO org.codehaus.plexus.cache.Cache:url-failures- 
> cache - Disposing cache: [ name = url-failures-cache status =  
> STATUS_ALIVE eternal = false overflowToDisk = false  
> maxElementsInMemory = 1000 maxElementsOnDisk = 0  
> memoryStoreEvictionPolicy = LRU timeToLiveSeconds = 1800  
> timeToIdleSeconds = 2700 diskPersistent = false  
> diskExpiryThreadIntervalSeconds = 600 cacheEventListeners:   
> hitCount = 0 memoryStoreHitCount = 0 diskStoreHitCount = 0  
> missCountNotFound = 0 missCountExpired = 0 ]
> There was no such logger  
> 'org.codehaus.plexus.redback.xwork.filter.authentication.HttpAuthentic 
> ator:basic' 15284467.
> 85512 [main] WARN org.codehaus.plexus.PlexusContainer - Component  
> manager not found for returned component. Ignored.  
> component=org.apache.maven.archiva.web.repository.ProxiedDavServer@15e 
> d12c
> Tests run: 11, Failures: 0, Errors: 0, Skipped: 0, Time elapsed:  
> 1.872 sec
> Running  
> org.apache.maven.archiva.web.action.admin.connectors.proxy.ProxyConnec 
> torsActionTest
> [INFO] Disposing cache: [ name = url-failures-cache status =  
> STATUS_ALIVE eternal = false overflowToDisk = false  
> maxElementsInMemory = 1000 maxElementsOnDisk = 0  
> memoryStoreEvictionPolicy = LRU timeToLiveSeconds = 1800  
> timeToIdleSeconds = 2700 diskPersistent = true  
> diskExpiryThreadIntervalSeconds = 600 cacheEventListeners:   
> hitCount = 0 memoryStoreHitCount = 0 diskStoreHitCount = 0  
> missCountNotFound = 0 missCountExpired = 0 ]
> [INFO] Disposing cache: [ name = url-failures-cache status =  
> STATUS_ALIVE eternal = false overflowToDisk = false  
> maxElementsInMemory = 1000 maxElementsOnDisk = 0  
> memoryStoreEvictionPolicy = LRU timeToLiveSeconds = 1800  
> timeToIdleSeconds = 2700 diskPersistent = true  
> diskExpiryThreadIntervalSeconds = 600 cacheEventListeners:   
> hitCount = 0 memoryStoreHitCount = 0 diskStoreHitCount = 0  
> missCountNotFound = 0 missCountExpired = 0 ]
> Tests run: 2, Failures: 0, Errors: 0, Skipped: 0, Time elapsed:  
> 0.129 sec
> Running  
> org.apache.maven.archiva.web.action.admin.repositories.EditRemoteRepos 
> itoryActionTest
> [INFO] Disposing cache: [ name = url-failures-cache status =  
> STATUS_ALIVE eternal = false overflowToDisk = false  
> maxElementsInMemory = 1000 maxElementsOnDisk = 0  
> memoryStoreEvictionPolicy = LRU timeToLiveSeconds = 1800  
> timeToIdleSeconds = 2700 diskPersistent = true  
> diskExpiryThreadIntervalSeconds = 600 cacheEventListeners:   
> hitCount = 0 memoryStoreHitCount = 0 diskStoreHitCount = 0  
> missCountNotFound = 0 missCountExpired = 0 ]
> [INFO] Disposing cache: [ name = url-failures-cache status =  
> STATUS_ALIVE eternal = false overflowToDisk = false  
> maxElementsInMemory = 1000 maxElementsOnDisk = 0  
> memoryStoreEvictionPolicy = LRU timeToLiveSeconds = 1800  
> timeToIdleSeconds = 2700 diskPersistent = true  
> diskExpiryThreadIntervalSeconds = 600 cacheEventListeners:   
> hitCount = 0 memoryStoreHitCount = 0 diskStoreHitCount = 0  
> missCountNotFound = 0 missCountExpired = 0 ]
> [INFO] Disposing cache: [ name = url-failures-cache status =  
> STATUS_ALIVE eternal = false overflowToDisk = false  
> maxElementsInMemory = 1000 maxElementsOnDisk = 0  
> memoryStoreEvictionPolicy = LRU timeToLiveSeconds = 1800  
> timeToIdleSeconds = 2700 diskPersistent = true  
> diskExpiryThreadIntervalSeconds = 600 cacheEventListeners:   
> hitCount = 0 memoryStoreHitCount = 0 diskStoreHitCount = 0  
> missCountNotFound = 0 missCountExpired = 0 ]
> Tests run: 3, Failures: 0, Errors: 0, Skipped: 0, Time elapsed:  
> 1.009 sec
> Running  
> org.apache.maven.archiva.web.action.admin.connectors.proxy.SortProxyCo 
> nnectorsActionTest
> [INFO] Disposing cache: [ name = url-failures-cache status =  
> STATUS_ALIVE eternal = false overflowToDisk = false  
> maxElementsInMemory = 1000 maxElementsOnDisk = 0  
> memoryStoreEvictionPolicy = LRU timeToLiveSeconds = 1800  
> timeToIdleSeconds = 2700 diskPersistent = true  
> diskExpiryThreadIntervalSeconds = 600 cacheEventListeners:   
> hitCount = 0 memoryStoreHitCount = 0 diskStoreHitCount = 0  
> missCountNotFound = 0 missCountExpired = 0 ]
> [INFO] Disposing cache: [ name = url-failures-cache status =  
> STATUS_ALIVE eternal = false overflowToDisk = false  
> maxElementsInMemory = 1000 maxElementsOnDisk = 0  
> memoryStoreEvictionPolicy = LRU timeToLiveSeconds = 1800  
> timeToIdleSeconds = 2700 diskPersistent = true  
> diskExpiryThreadIntervalSeconds = 600 cacheEventListeners:   
> hitCount = 0 memoryStoreHitCount = 0 diskStoreHitCount = 0  
> missCountNotFound = 0 missCountExpired = 0 ]
> [INFO] Disposing cache: [ name = url-failures-cache status =  
> STATUS_ALIVE eternal = false overflowToDisk = false  
> maxElementsInMemory = 1000 maxElementsOnDisk = 0  
> memoryStoreEvictionPolicy = LRU timeToLiveSeconds = 1800  
> timeToIdleSeconds = 2700 diskPersistent = true  
> diskExpiryThreadIntervalSeconds = 600 cacheEventListeners:   
> hitCount = 0 memoryStoreHitCount = 0 diskStoreHitCount = 0  
> missCountNotFound = 0 missCountExpired = 0 ]
> [INFO] Disposing cache: [ name = url-failures-cache status =  
> STATUS_ALIVE eternal = false overflowToDisk = false  
> maxElementsInMemory = 1000 maxElementsOnDisk = 0  
> memoryStoreEvictionPolicy = LRU timeToLiveSeconds = 1800  
> timeToIdleSeconds = 2700 diskPersistent = true  
> diskExpiryThreadIntervalSeconds = 600 cacheEventListeners:   
> hitCount = 0 memoryStoreHitCount = 0 diskStoreHitCount = 0  
> missCountNotFound = 0 missCountExpired = 0 ]
> [INFO] Disposing cache: [ name = url-failures-cache status =  
> STATUS_ALIVE eternal = false overflowToDisk = false  
> maxElementsInMemory = 1000 maxElementsOnDisk = 0  
> memoryStoreEvictionPolicy = LRU timeToLiveSeconds = 1800  
> timeToIdleSeconds = 2700 diskPersistent = true  
> diskExpiryThreadIntervalSeconds = 600 cacheEventListeners:   
> hitCount = 0 memoryStoreHitCount = 0 diskStoreHitCount = 0  
> missCountNotFound = 0 missCountExpired = 0 ]
> Tests run: 5, Failures: 0, Errors: 0, Skipped: 0, Time elapsed:  
> 0.406 sec
> Running org.apache.maven.archiva.web.repository.RepositoryServletTest
> 87185 [main] INFO org.codehaus.plexus.cache.Cache:url-failures- 
> cache - Disposing cache: [ name = url-failures-cache status =  
> STATUS_ALIVE eternal = false overflowToDisk = false  
> maxElementsInMemory = 1000 maxElementsOnDisk = 0  
> memoryStoreEvictionPolicy = LRU timeToLiveSeconds = 1800  
> timeToIdleSeconds = 2700 diskPersistent = false  
> diskExpiryThreadIntervalSeconds = 600 cacheEventListeners:   
> hitCount = 0 memoryStoreHitCount = 0 diskStoreHitCount = 0  
> missCountNotFound = 0 missCountExpired = 0 ]
> There was no such logger  
> 'org.codehaus.plexus.redback.xwork.filter.authentication.HttpAuthentic 
> ator:basic' 33068612.
> 87185 [main] WARN org.codehaus.plexus.PlexusContainer - Component  
> manager not found for returned component. Ignored.  
> component=org.apache.maven.archiva.web.repository.ProxiedDavServer@2c4 
> 8a6
> 87301 [main] INFO org.codehaus.plexus.cache.Cache:url-failures- 
> cache - Disposing cache: [ name = url-failures-cache status =  
> STATUS_ALIVE eternal = false overflowToDisk = false  
> maxElementsInMemory = 1000 maxElementsOnDisk = 0  
> memoryStoreEvictionPolicy = LRU timeToLiveSeconds = 1800  
> timeToIdleSeconds = 2700 diskPersistent = false  
> diskExpiryThreadIntervalSeconds = 600 cacheEventListeners:   
> hitCount = 0 memoryStoreHitCount = 0 diskStoreHitCount = 0  
> missCountNotFound = 0 missCountExpired = 0 ]
> There was no such logger  
> 'org.codehaus.plexus.redback.xwork.filter.authentication.HttpAuthentic 
> ator:basic' 21677003.
> 87424 [main] INFO org.codehaus.plexus.cache.Cache:url-failures- 
> cache - Disposing cache: [ name = url-failures-cache status =  
> STATUS_ALIVE eternal = false overflowToDisk = false  
> maxElementsInMemory = 1000 maxElementsOnDisk = 0  
> memoryStoreEvictionPolicy = LRU timeToLiveSeconds = 1800  
> timeToIdleSeconds = 2700 diskPersistent = false  
> diskExpiryThreadIntervalSeconds = 600 cacheEventListeners:   
> hitCount = 0 memoryStoreHitCount = 0 diskStoreHitCount = 0  
> missCountNotFound = 0 missCountExpired = 0 ]
> There was no such logger  
> 'org.codehaus.plexus.redback.xwork.filter.authentication.HttpAuthentic 
> ator:basic' 14390956.
> 87424 [main] WARN org.codehaus.plexus.PlexusContainer - Component  
> manager not found for returned component. Ignored.  
> component=org.apache.maven.archiva.web.repository.ProxiedDavServer@505 
> 508
> 87424 [main] WARN org.codehaus.plexus.PlexusContainer - Component  
> manager not found for returned component. Ignored.  
> component=org.apache.maven.archiva.web.repository.ProxiedDavServer@16d 
> 4a3e
> Tests run: 3, Failures: 0, Errors: 0, Skipped: 0, Time elapsed:  
> 0.355 sec
> Running  
> org.apache.maven.archiva.web.repository.RepositoryServletProxiedReleas 
> ePolicyTest
> 87529 [main] INFO org.mortbay.log - jetty-6.1.5
> 87531 [main] INFO org.mortbay.log - Started  
> SocketConnector@0.0.0.0:44662
> Remote HTTP Server started on http://localhost:44662/central
> 88547 [main] INFO org.codehaus.plexus.cache.Cache:url-failures- 
> cache - Disposing cache: [ name = url-failures-cache status =  
> STATUS_ALIVE eternal = false overflowToDisk = false  
> maxElementsInMemory = 1000 maxElementsOnDisk = 0  
> memoryStoreEvictionPolicy = LRU timeToLiveSeconds = 1800  
> timeToIdleSeconds = 2700 diskPersistent = false  
> diskExpiryThreadIntervalSeconds = 600 cacheEventListeners:   
> hitCount = 0 memoryStoreHitCount = 0 diskStoreHitCount = 0  
> missCountNotFound = 0 missCountExpired = 0 ]
> There was no such logger  
> 'org.codehaus.plexus.redback.xwork.filter.authentication.HttpAuthentic 
> ator:basic' 9509791.
> 88547 [main] WARN org.codehaus.plexus.PlexusContainer - Component  
> manager not found for returned component. Ignored.  
> component=org.apache.maven.archiva.web.repository.ProxiedDavServer@9ec 
> 9cd
> 88644 [main] INFO org.mortbay.log - jetty-6.1.5
> 88645 [main] INFO org.mortbay.log - Started  
> SocketConnector@0.0.0.0:44665
> Remote HTTP Server started on http://localhost:44665/central
> 89657 [main] INFO org.codehaus.plexus.cache.Cache:url-failures- 
> cache - Disposing cache: [ name = url-failures-cache status =  
> STATUS_ALIVE eternal = false overflowToDisk = false  
> maxElementsInMemory = 1000 maxElementsOnDisk = 0  
> memoryStoreEvictionPolicy = LRU timeToLiveSeconds = 1800  
> timeToIdleSeconds = 2700 diskPersistent = false  
> diskExpiryThreadIntervalSeconds = 600 cacheEventListeners:   
> hitCount = 0 memoryStoreHitCount = 0 diskStoreHitCount = 0  
> missCountNotFound = 0 missCountExpired = 0 ]
> There was no such logger  
> 'org.codehaus.plexus.redback.xwork.filter.authentication.HttpAuthentic 
> ator:basic' 16748090.
> 89657 [main] WARN org.codehaus.plexus.PlexusContainer - Component  
> manager not found for returned component. Ignored.  
> component=org.apache.maven.archiva.web.repository.ProxiedDavServer@1ee 
> 1bee
> 89741 [main] INFO org.mortbay.log - jetty-6.1.5
> 89742 [main] INFO org.mortbay.log - Started  
> SocketConnector@0.0.0.0:44670
> Remote HTTP Server started on http://localhost:44670/central
> 90757 [main] INFO org.codehaus.plexus.cache.Cache:url-failures- 
> cache - Disposing cache: [ name = url-failures-cache status =  
> STATUS_ALIVE eternal = false overflowToDisk = false  
> maxElementsInMemory = 1000 maxElementsOnDisk = 0  
> memoryStoreEvictionPolicy = LRU timeToLiveSeconds = 1800  
> timeToIdleSeconds = 2700 diskPersistent = false  
> diskExpiryThreadIntervalSeconds = 600 cacheEventListeners:   
> hitCount = 0 memoryStoreHitCount = 0 diskStoreHitCount = 0  
> missCountNotFound = 0 missCountExpired = 0 ]
> There was no such logger  
> 'org.codehaus.plexus.redback.xwork.filter.authentication.HttpAuthentic 
> ator:basic' 21920469.
> 90757 [main] WARN org.codehaus.plexus.PlexusContainer - Component  
> manager not found for returned component. Ignored.  
> component=org.apache.maven.archiva.web.repository.ProxiedDavServer@b10 
> 54b
> 90837 [main] INFO org.mortbay.log - jetty-6.1.5
> 90838 [main] INFO org.mortbay.log - Started  
> SocketConnector@0.0.0.0:44674
> Remote HTTP Server started on http://localhost:44674/central
> 91771 [main] INFO  
> org.apache.maven.archiva.proxy.RepositoryProxyConnectors:default -  
> Transfer not attempted on http://localhost:44674/centralorg/apache/ 
> archiva/test/1.0/test-1.0.jar : NO to update releases, policy is  
> DAILY, local file exist, and has been updated within the last day.:  
> using already present local file.
> 91877 [main] INFO org.codehaus.plexus.cache.Cache:url-failures- 
> cache - Disposing cache: [ name = url-failures-cache status =  
> STATUS_ALIVE eternal = false overflowToDisk = false  
> maxElementsInMemory = 1000 maxElementsOnDisk = 0  
> memoryStoreEvictionPolicy = LRU timeToLiveSeconds = 1800  
> timeToIdleSeconds = 2700 diskPersistent = false  
> diskExpiryThreadIntervalSeconds = 600 cacheEventListeners:   
> hitCount = 0 memoryStoreHitCount = 0 diskStoreHitCount = 0  
> missCountNotFound = 0 missCountExpired = 0 ]
> There was no such logger  
> 'org.codehaus.plexus.redback.xwork.filter.authentication.HttpAuthentic 
> ator:basic' 5939149.
> 91877 [main] WARN org.codehaus.plexus.PlexusContainer - Component  
> manager not found for returned component. Ignored.  
> component=org.apache.maven.archiva.web.repository.ProxiedDavServer@45d 
> 9b1
> 92061 [main] INFO org.mortbay.log - jetty-6.1.5
> Remote HTTP Server started on http://localhost:44676/central
> 92062 [main] INFO org.mortbay.log - Started  
> SocketConnector@0.0.0.0:44676
> 93087 [main] INFO org.codehaus.plexus.cache.Cache:url-failures- 
> cache - Disposing cache: [ name = url-failures-cache status =  
> STATUS_ALIVE eternal = false overflowToDisk = false  
> maxElementsInMemory = 1000 maxElementsOnDisk = 0  
> memoryStoreEvictionPolicy = LRU timeToLiveSeconds = 1800  
> timeToIdleSeconds = 2700 diskPersistent = false  
> diskExpiryThreadIntervalSeconds = 600 cacheEventListeners:   
> hitCount = 0 memoryStoreHitCount = 0 diskStoreHitCount = 0  
> missCountNotFound = 0 missCountExpired = 0 ]
> There was no such logger  
> 'org.codehaus.plexus.redback.xwork.filter.authentication.HttpAuthentic 
> ator:basic' 16970947.
> 93087 [main] WARN org.codehaus.plexus.PlexusContainer - Component  
> manager not found for returned component. Ignored.  
> component=org.apache.maven.archiva.web.repository.ProxiedDavServer@1b4 
> cff
> 93177 [main] INFO org.mortbay.log - jetty-6.1.5
> 93178 [main] INFO org.mortbay.log - Started  
> SocketConnector@0.0.0.0:44684
> Remote HTTP Server started on http://localhost:44684/central
> 94177 [main] INFO org.codehaus.plexus.cache.Cache:url-failures- 
> cache - Disposing cache: [ name = url-failures-cache status =  
> STATUS_ALIVE eternal = false overflowToDisk = false  
> maxElementsInMemory = 1000 maxElementsOnDisk = 0  
> memoryStoreEvictionPolicy = LRU timeToLiveSeconds = 1800  
> timeToIdleSeconds = 2700 diskPersistent = false  
> diskExpiryThreadIntervalSeconds = 600 cacheEventListeners:   
> hitCount = 0 memoryStoreHitCount = 0 diskStoreHitCount = 0  
> missCountNotFound = 0 missCountExpired = 0 ]
> There was no such logger  
> 'org.codehaus.plexus.redback.xwork.filter.authentication.HttpAuthentic 
> ator:basic' 26216510.
> 94177 [main] WARN org.codehaus.plexus.PlexusContainer - Component  
> manager not found for returned component. Ignored.  
> component=org.apache.maven.archiva.web.repository.ProxiedDavServer@6bc 
> 02d
> 94266 [main] INFO org.mortbay.log - jetty-6.1.5
> 94267 [main] INFO org.mortbay.log - Started  
> SocketConnector@0.0.0.0:44691
> Remote HTTP Server started on http://localhost:44691/central
> 95136 [main] INFO  
> org.apache.maven.archiva.proxy.RepositoryProxyConnectors:default -  
> Transfer not attempted on http://localhost:44691/centralorg/apache/ 
> archiva/test/1.0/test-1.0.pom : NO to update, releases policy set  
> to NEVER.
> 95136 [main] INFO  
> org.apache.maven.archiva.proxy.RepositoryProxyConnectors:default -  
> Transfer not attempted on http://localhost:44691/centralorg/apache/ 
> archiva/test/1.0/test-1.0.jar : NO to update, releases policy set  
> to NEVER.: using already present local file.
> 95247 [main] INFO org.codehaus.plexus.cache.Cache:url-failures- 
> cache - Disposing cache: [ name = url-failures-cache status =  
> STATUS_ALIVE eternal = false overflowToDisk = false  
> maxElementsInMemory = 1000 maxElementsOnDisk = 0  
> memoryStoreEvictionPolicy = LRU timeToLiveSeconds = 1800  
> timeToIdleSeconds = 2700 diskPersistent = false  
> diskExpiryThreadIntervalSeconds = 600 cacheEventListeners:   
> hitCount = 0 memoryStoreHitCount = 0 diskStoreHitCount = 0  
> missCountNotFound = 0 missCountExpired = 0 ]
> There was no such logger  
> 'org.codehaus.plexus.redback.xwork.filter.authentication.HttpAuthentic 
> ator:basic' 7795881.
> 95253 [main] WARN org.codehaus.plexus.PlexusContainer - Component  
> manager not found for returned component. Ignored.  
> component=org.apache.maven.archiva.web.repository.ProxiedDavServer@1c5 
> f0ba
> 95343 [main] INFO org.mortbay.log - jetty-6.1.5
> 95344 [main] INFO org.mortbay.log - Started  
> SocketConnector@0.0.0.0:44694
> Remote HTTP Server started on http://localhost:44694/central
> 96319 [main] INFO  
> org.apache.maven.archiva.proxy.RepositoryProxyConnectors:default -  
> Transfer not attempted on http://localhost:44694/centralorg/apache/ 
> archiva/test/1.0/test-1.0.pom : NO to update, releases policy set  
> to NEVER.
> 96320 [main] INFO  
> org.apache.maven.archiva.proxy.RepositoryProxyConnectors:default -  
> Transfer not attempted on http://localhost:44694/centralorg/apache/ 
> archiva/test/1.0/test-1.0.jar : NO to update, releases policy set  
> to NEVER.
> 96427 [main] INFO org.codehaus.plexus.cache.Cache:url-failures- 
> cache - Disposing cache: [ name = url-failures-cache status =  
> STATUS_ALIVE eternal = false overflowToDisk = false  
> maxElementsInMemory = 1000 maxElementsOnDisk = 0  
> memoryStoreEvictionPolicy = LRU timeToLiveSeconds = 1800  
> timeToIdleSeconds = 2700 diskPersistent = false  
> diskExpiryThreadIntervalSeconds = 600 cacheEventListeners:   
> hitCount = 0 memoryStoreHitCount = 0 diskStoreHitCount = 0  
> missCountNotFound = 0 missCountExpired = 0 ]
> There was no such logger  
> 'org.codehaus.plexus.redback.xwork.filter.authentication.HttpAuthentic 
> ator:basic' 18508941.
> 96427 [main] WARN org.codehaus.plexus.PlexusContainer - Component  
> manager not found for returned component. Ignored.  
> component=org.apache.maven.archiva.web.repository.ProxiedDavServer@1c4 
> 048c
> 96517 [main] INFO org.mortbay.log - jetty-6.1.5
> 96518 [main] INFO org.mortbay.log - Started  
> SocketConnector@0.0.0.0:44697
> Remote HTTP Server started on http://localhost:44697/central
> 97370 [main] INFO  
> org.apache.maven.archiva.proxy.RepositoryProxyConnectors:default -  
> Transfer not attempted on http://localhost:44697/centralorg/apache/ 
> archiva/test/1.0/test-1.0.pom : NO to update, releases policy set  
> to NEVER.
> 97371 [main] INFO  
> org.apache.maven.archiva.proxy.RepositoryProxyConnectors:default -  
> Transfer not attempted on http://localhost:44697/centralorg/apache/ 
> archiva/test/1.0/test-1.0.jar : NO to update, releases policy set  
> to NEVER.: using already present local file.
> 97476 [main] INFO org.codehaus.plexus.cache.Cache:url-failures- 
> cache - Disposing cache: [ name = url-failures-cache status =  
> STATUS_ALIVE eternal = false overflowToDisk = false  
> maxElementsInMemory = 1000 maxElementsOnDisk = 0  
> memoryStoreEvictionPolicy = LRU timeToLiveSeconds = 1800  
> timeToIdleSeconds = 2700 diskPersistent = false  
> diskExpiryThreadIntervalSeconds = 600 cacheEventListeners:   
> hitCount = 0 memoryStoreHitCount = 0 diskStoreHitCount = 0  
> missCountNotFound = 0 missCountExpired = 0 ]
> There was no such logger  
> 'org.codehaus.plexus.redback.xwork.filter.authentication.HttpAuthentic 
> ator:basic' 17005019.
> 97479 [main] WARN org.codehaus.plexus.PlexusContainer - Component  
> manager not found for returned component. Ignored.  
> component=org.apache.maven.archiva.web.repository.ProxiedDavServer@10b 
> 589d
> 97558 [main] INFO org.mortbay.log - jetty-6.1.5
> 97559 [main] INFO org.mortbay.log - Started  
> SocketConnector@0.0.0.0:44699
> Remote HTTP Server started on http://localhost:44699/central
> 98454 [main] INFO  
> org.apache.maven.archiva.proxy.RepositoryProxyConnectors:default -  
> Transfer not attempted on http://localhost:44699/centralorg/apache/ 
> archiva/test/1.0/test-1.0.jar : NO to update releases, policy is  
> HOURLY, local file exist, and has been updated within the last  
> hour.: using already present local file.
> 98557 [main] INFO org.codehaus.plexus.cache.Cache:url-failures- 
> cache - Disposing cache: [ name = url-failures-cache status =  
> STATUS_ALIVE eternal = false overflowToDisk = false  
> maxElementsInMemory = 1000 maxElementsOnDisk = 0  
> memoryStoreEvictionPolicy = LRU timeToLiveSeconds = 1800  
> timeToIdleSeconds = 2700 diskPersistent = false  
> diskExpiryThreadIntervalSeconds = 600 cacheEventListeners:   
> hitCount = 0 memoryStoreHitCount = 0 diskStoreHitCount = 0  
> missCountNotFound = 0 missCountExpired = 0 ]
> There was no such logger  
> 'org.codehaus.plexus.redback.xwork.filter.authentication.HttpAuthentic 
> ator:basic' 21756913.
> 98558 [main] WARN org.codehaus.plexus.PlexusContainer - Component  
> manager not found for returned component. Ignored.  
> component=org.apache.maven.archiva.web.repository.ProxiedDavServer@ef9 
> 712
> 98643 [main] INFO org.mortbay.log - jetty-6.1.5
> 98644 [main] INFO org.mortbay.log - Started  
> SocketConnector@0.0.0.0:44702
> Remote HTTP Server started on http://localhost:44702/central
> 99646 [main] INFO org.codehaus.plexus.cache.Cache:url-failures- 
> cache - Disposing cache: [ name = url-failures-cache status =  
> STATUS_ALIVE eternal = false overflowToDisk = false  
> maxElementsInMemory = 1000 maxElementsOnDisk = 0  
> memoryStoreEvictionPolicy = LRU timeToLiveSeconds = 1800  
> timeToIdleSeconds = 2700 diskPersistent = false  
> diskExpiryThreadIntervalSeconds = 600 cacheEventListeners:   
> hitCount = 0 memoryStoreHitCount = 0 diskStoreHitCount = 0  
> missCountNotFound = 0 missCountExpired = 0 ]
> There was no such logger  
> 'org.codehaus.plexus.redback.xwork.filter.authentication.HttpAuthentic 
> ator:basic' 32795741.
> 99646 [main] WARN org.codehaus.plexus.PlexusContainer - Component  
> manager not found for returned component. Ignored.  
> component=org.apache.maven.archiva.web.repository.ProxiedDavServer@a91 
> 761
> 99861 [main] INFO org.mortbay.log - jetty-6.1.5
> 99862 [main] INFO org.mortbay.log - Started  
> SocketConnector@0.0.0.0:44706
> Remote HTTP Server started on http://localhost:44706/central
> 100877 [main] INFO org.codehaus.plexus.cache.Cache:url-failures- 
> cache - Disposing cache: [ name = url-failures-cache status =  
> STATUS_ALIVE eternal = false overflowToDisk = false  
> maxElementsInMemory = 1000 maxElementsOnDisk = 0  
> memoryStoreEvictionPolicy = LRU timeToLiveSeconds = 1800  
> timeToIdleSeconds = 2700 diskPersistent = false  
> diskExpiryThreadIntervalSeconds = 600 cacheEventListeners:   
> hitCount = 0 memoryStoreHitCount = 0 diskStoreHitCount = 0  
> missCountNotFound = 0 missCountExpired = 0 ]
> There was no such logger  
> 'org.codehaus.plexus.redback.xwork.filter.authentication.HttpAuthentic 
> ator:basic' 5556014.
> 100877 [main] WARN org.codehaus.plexus.PlexusContainer - Component  
> manager not found for returned component. Ignored.  
> component=org.apache.maven.archiva.web.repository.ProxiedDavServer@126 
> 9273
> 100959 [main] INFO org.mortbay.log - jetty-6.1.5
> 100960 [main] INFO org.mortbay.log - Started  
> SocketConnector@0.0.0.0:44710
> Remote HTTP Server started on http://localhost:44710/central
> 101967 [main] INFO  
> org.apache.maven.archiva.proxy.RepositoryProxyConnectors:default -  
> Transfer not attempted on http://localhost:44710/centralorg/apache/ 
> archiva/test/1.0/test-1.0.jar : NO to update releases, policy is  
> ONCE, and local file exist.: using already present local file.
> 102076 [main] INFO org.codehaus.plexus.cache.Cache:url-failures- 
> cache - Disposing cache: [ name = url-failures-cache status =  
> STATUS_ALIVE eternal = false overflowToDisk = false  
> maxElementsInMemory = 1000 maxElementsOnDisk = 0  
> memoryStoreEvictionPolicy = LRU timeToLiveSeconds = 1800  
> timeToIdleSeconds = 2700 diskPersistent = false  
> diskExpiryThreadIntervalSeconds = 600 cacheEventListeners:   
> hitCount = 0 memoryStoreHitCount = 0 diskStoreHitCount = 0  
> missCountNotFound = 0 missCountExpired = 0 ]
> There was no such logger  
> 'org.codehaus.plexus.redback.xwork.filter.authentication.HttpAuthentic 
> ator:basic' 3808947.
> 102076 [main] WARN org.codehaus.plexus.PlexusContainer - Component  
> manager not found for returned component. Ignored.  
> component=org.apache.maven.archiva.web.repository.ProxiedDavServer@16a 
> dd0e
> 102236 [main] INFO org.mortbay.log - jetty-6.1.5
> 102237 [main] INFO org.mortbay.log - Started  
> SocketConnector@0.0.0.0:44713
> Remote HTTP Server started on http://localhost:44713/central
> 103266 [main] INFO org.codehaus.plexus.cache.Cache:url-failures- 
> cache - Disposing cache: [ name = url-failures-cache status =  
> STATUS_ALIVE eternal = false overflowToDisk = false  
> maxElementsInMemory = 1000 maxElementsOnDisk = 0  
> memoryStoreEvictionPolicy = LRU timeToLiveSeconds = 1800  
> timeToIdleSeconds = 2700 diskPersistent = false  
> diskExpiryThreadIntervalSeconds = 600 cacheEventListeners:   
> hitCount = 0 memoryStoreHitCount = 0 diskStoreHitCount = 0  
> missCountNotFound = 0 missCountExpired = 0 ]
> There was no such logger  
> 'org.codehaus.plexus.redback.xwork.filter.authentication.HttpAuthentic 
> ator:basic' 15295322.
> 103267 [main] WARN org.codehaus.plexus.PlexusContainer - Component  
> manager not found for returned component. Ignored.  
> component=org.apache.maven.archiva.web.repository.ProxiedDavServer@134 
> 6e64
> 103347 [main] INFO org.mortbay.log - jetty-6.1.5
> 103348 [main] INFO org.mortbay.log - Started  
> SocketConnector@0.0.0.0:44717
> Remote HTTP Server started on http://localhost:44717/central
> There was no such logger  
> 'org.apache.maven.archiva.configuration.ArchivaConfiguration:default'  
> 9448075.
> 103456 [main] INFO org.codehaus.plexus.cache.Cache:url-failures- 
> cache - Disposing cache: [ name = url-failures-cache status =  
> STATUS_ALIVE eternal = false overflowToDisk = false  
> maxElementsInMemory = 1000 maxElementsOnDisk = 0  
> memoryStoreEvictionPolicy = LRU timeToLiveSeconds = 1800  
> timeToIdleSeconds = 2700 diskPersistent = false  
> diskExpiryThreadIntervalSeconds = 600 cacheEventListeners:   
> hitCount = 0 memoryStoreHitCount = 0 diskStoreHitCount = 0  
> missCountNotFound = 0 missCountExpired = 0 ]
> Tests run: 15, Failures: 0, Errors: 1, Skipped: 0, Time elapsed:  
> 16.035 sec <<< FAILURE!
> Running  
> org.apache.maven.archiva.web.repository.RepositoryServletDeployTest
> 103624 [main] INFO org.codehaus.plexus.cache.Cache:url-failures- 
> cache - Disposing cache: [ name = url-failures-cache status =  
> STATUS_ALIVE eternal = false overflowToDisk = false  
> maxElementsInMemory = 1000 maxElementsOnDisk = 0  
> memoryStoreEvictionPolicy = LRU timeToLiveSeconds = 1800  
> timeToIdleSeconds = 2700 diskPersistent = false  
> diskExpiryThreadIntervalSeconds = 600 cacheEventListeners:   
> hitCount = 0 memoryStoreHitCount = 0 diskStoreHitCount = 0  
> missCountNotFound = 0 missCountExpired = 0 ]
> There was no such logger  
> 'org.codehaus.plexus.redback.xwork.filter.authentication.HttpAuthentic 
> ator:basic' 5516771.
> 103625 [main] WARN org.codehaus.plexus.PlexusContainer - Component  
> manager not found for returned component. Ignored.  
> component=org.apache.maven.archiva.web.repository.ProxiedDavServer@210 
> f7d
> Tests run: 1, Failures: 0, Errors: 0, Skipped: 0, Time elapsed:  
> 0.157 sec
>
> Results :
> Tests run: 145, Failures: 0, Errors: 1, Skipped: 0
>
> [INFO]  
> ---------------------------------------------------------------------- 
> --
> [ERROR] BUILD FAILURE
> [INFO]  
> ---------------------------------------------------------------------- 
> --
> [INFO] There are test failures.
> [INFO]  
> ---------------------------------------------------------------------- 
> --
> [INFO] For more information, run Maven with the -e switch
> [INFO]  
> ---------------------------------------------------------------------- 
> --
> [INFO] Total time: 2 minutes 11 seconds
> [INFO] Finished at: Thu Nov 01 20:24:18 GMT+00:00 2007
> [INFO] Final Memory: 26M/328M
> [INFO]  
> ---------------------------------------------------------------------- 
> --
>
> ********************************************************************** 
> ******
>
>

--
Brett Porter - brett@apache.org
Blog: http://www.devzuz.org/blogs/bporter/


Mime
View raw message