archiva-dev mailing list archives

Site index · List index
Message view « Date » · « Thread »
Top « Date » · « Thread »
From Brett Porter <br...@apache.org>
Subject Fwd: [continuum] BUILD FAILURE: Archiva Web :: Application
Date Sun, 23 Sep 2007 20:21:38 GMT
I'll deploy a snapshot.

Begin forwarded message:

> From: "Continuum@maven.zones.apache.org"  
> <continuum@maven.zones.apache.org>
> Date: 24 September 2007 6:19:23 AM
> To: notifications@maven.apache.org
> Subject: [continuum] BUILD FAILURE: Archiva Web :: Application
> Reply-To: dev@maven.apache.org
> Reply-To: "Continuum@maven.zones.apache.org"  
> <continuum@maven.zones.apache.org>
> List-Id: <notifications.maven.apache.org>
> Message-Id:  
> <167032.01190578763562.JavaMail.build@maven.zones.apache.org>
>
> Online report : http://maven.zones.apache.org/continuum/ 
> buildResult.action?buildId=24079&projectId=296
>
> Build statistics:
>  State: Failed
>  Previous State: Failed
>  Started at: Sun 23 Sep 2007 20:19:00 +0000
>  Finished at: Sun 23 Sep 2007 20:19:20 +0000
>  Total time: 20s
>  Build Trigger: Forced
>  Build Number: 87
>  Exit code: 1
>  Building machine hostname: maven.zones.apache.org
>  Operating system : SunOS(unknown)
>  Java Home version :          java version "1.5.0_12"
>          Java(TM) 2 Runtime Environment, Standard Edition (build  
> 1.5.0_12-b04)
>          Java HotSpot(TM) Server VM (build 1.5.0_12-b04, mixed mode)
>         Builder version :
>          Maven version: 2.0.7
>          Java version: 1.5.0_12
>          OS name: "sunos" version: "5.10" arch: "x86"
>     
> ********************************************************************** 
> ******
> SCM Changes:
> ********************************************************************** 
> ******
> No files changed
>
> ********************************************************************** 
> ******
> Dependencies Changes:
> ********************************************************************** 
> ******
> No dependencies changed
>
>
> ********************************************************************** 
> ******
> Build Defintion:
> ********************************************************************** 
> ******
> POM filename: pom.xml
> Goals: clean install   Arguments: --batch-mode --non-recursive
> Build Fresh: false
> Always Build: false
> Default Build Definition: true
> Schedule: DEFAULT_SCHEDULE
> Description:
>
> ********************************************************************** 
> ******
> Test Summary:
> ********************************************************************** 
> ******
> Tests: 0
> Failures: 0
> Total time: 0
>
> ********************************************************************** 
> ******
> Output:
> ********************************************************************** 
> ******
> [INFO] Scanning for projects...
> [INFO]  
> ---------------------------------------------------------------------- 
> ------
> [INFO] Building Archiva Web :: Application
> [INFO]    task-segment: [clean, install]
> [INFO]  
> ---------------------------------------------------------------------- 
> ------
> [INFO] [clean:clean]
> [INFO] Deleting directory /export/home/build/data/continuum/ 
> checkouts/296/target
> [INFO] Deleting directory /export/home/build/data/continuum/ 
> checkouts/296/target/classes
> [INFO] Deleting directory /export/home/build/data/continuum/ 
> checkouts/296/target/test-classes
> [INFO] Deleting directory /export/home/build/data/continuum/ 
> checkouts/296/target/site
> [INFO] Deleting file-set: /export/home/build/data/continuum/ 
> checkouts/296/src/main/webapp (included: [META-INF, images/redback,  
> template/redback, WEB-INF/classes, WEB-INF/lib, WEB-INF/database,  
> WEB-INF/logs, redback, css/redback, WEB-INF/jsp/redback, WEB-INF/ 
> template/redback, WEB-INF/logs, WEB-INF/temp, WEB-INF/ 
> jasperreports], excluded: [])
> [INFO] [plexus:descriptor {execution: generate}]
> [INFO] snapshot org.apache.maven.archiva:archiva-report-manager:1.0- 
> beta-3-SNAPSHOT: checking for updates from apache.snapshots
> [INFO] snapshot org.apache.maven.archiva:archiva-reporting:1.0- 
> beta-3-SNAPSHOT: checking for updates from apache.snapshots
> [INFO] snapshot org.apache.maven.archiva:archiva-database:1.0- 
> beta-3-SNAPSHOT: checking for updates from apache.snapshots
> [INFO] snapshot org.apache.maven.archiva:archiva-repository-layer: 
> 1.0-beta-3-SNAPSHOT: checking for updates from apache.snapshots
> [INFO] snapshot org.apache.maven.archiva:archiva-base:1.0-beta-3- 
> SNAPSHOT: checking for updates from apache.snapshots
> [INFO] snapshot org.apache.maven.archiva:archiva-configuration:1.0- 
> beta-3-SNAPSHOT: checking for updates from apache.snapshots
> [INFO] snapshot org.apache.maven.archiva:archiva-common:1.0-beta-3- 
> SNAPSHOT: checking for updates from apache.snapshots
> [INFO] snapshot org.apache.maven.archiva:archiva-xml-tools:1.0- 
> beta-3-SNAPSHOT: checking for updates from apache.snapshots
> [INFO] snapshot org.apache.maven.archiva:archiva-policies:1.0- 
> beta-3-SNAPSHOT: checking for updates from apache.snapshots
> [INFO] snapshot org.apache.maven.archiva:archiva-dependency-graph: 
> 1.0-beta-3-SNAPSHOT: checking for updates from apache.snapshots
> [INFO] snapshot org.apache.maven.archiva:archiva-model:1.0-beta-3- 
> SNAPSHOT: checking for updates from apache.snapshots
> [INFO] snapshot org.apache.maven.archiva:archiva-consumer-api:1.0- 
> beta-3-SNAPSHOT: checking for updates from apache.snapshots
> [INFO] snapshot org.apache.maven.archiva:archiva-consumers:1.0- 
> beta-3-SNAPSHOT: checking for updates from apache.snapshots
> [INFO] snapshot org.apache.maven.archiva:archiva-scheduled:1.0- 
> beta-3-SNAPSHOT: checking for updates from apache.snapshots
> [INFO] snapshot org.apache.maven.archiva:archiva-indexer:1.0-beta-3- 
> SNAPSHOT: checking for updates from apache.snapshots
> [INFO] snapshot org.apache.maven.archiva:archiva-proxy:1.0-beta-3- 
> SNAPSHOT: checking for updates from apache.snapshots
> [INFO] snapshot org.apache.maven.archiva:archiva-security:1.0- 
> beta-3-SNAPSHOT: checking for updates from apache.snapshots
> [INFO] snapshot org.apache.maven.archiva:archiva-core-consumers:1.0- 
> beta-3-SNAPSHOT: checking for updates from apache.snapshots
> [INFO] snapshot org.apache.maven.archiva:archiva-database-consumers: 
> 1.0-beta-3-SNAPSHOT: checking for updates from apache.snapshots
> [INFO] snapshot org.apache.maven.archiva:archiva-artifact-reports: 
> 1.0-beta-3-SNAPSHOT: checking for updates from apache.snapshots
> [INFO] snapshot org.apache.maven.archiva:archiva-lucene-consumers: 
> 1.0-beta-3-SNAPSHOT: checking for updates from apache.snapshots
> [INFO] snapshot org.apache.maven.archiva:archiva-signature- 
> consumers:1.0-beta-3-SNAPSHOT: checking for updates from  
> apache.snapshots
> [INFO] snapshot org.apache.maven.archiva:archiva-applet:1.0-beta-3- 
> SNAPSHOT: checking for updates from apache.snapshots
> [INFO] snapshot org.codehaus.plexus.webdav:plexus-webdav-simple:1.0- 
> alpha-4-SNAPSHOT: checking for updates from apache.snapshots
> Downloading: http://people.apache.org/repo/m2-snapshot-repository/ 
> org/codehaus/plexus/webdav/plexus-webdav-simple/1.0-alpha-4- 
> SNAPSHOT/plexus-webdav-simple-1.0-alpha-4-SNAPSHOT.pom
> Downloading: http://people.apache.org/repo/m2-snapshot-repository/ 
> org/codehaus/plexus/webdav/plexus-webdav-simple/1.0-alpha-4- 
> SNAPSHOT/plexus-webdav-simple-1.0-alpha-4-SNAPSHOT.jar
> [INFO]  
> ---------------------------------------------------------------------- 
> --
> [ERROR] BUILD ERROR
> [INFO]  
> ---------------------------------------------------------------------- 
> --
> [INFO] Failed to resolve artifact.
>
> Missing:
> ----------
> 1) org.codehaus.plexus.webdav:plexus-webdav-simple:jar:1.0-alpha-4- 
> SNAPSHOT
>
>  Try downloading the file manually from the project website.
>
>  Then, install it using the command:      mvn install:install-file - 
> DgroupId=org.codehaus.plexus.webdav -DartifactId=plexus-webdav- 
> simple \
>          -Dversion=1.0-alpha-4-SNAPSHOT -Dpackaging=jar -Dfile=/ 
> path/to/file
> Alternatively, if you host your own repository you can deploy the  
> file there:       mvn deploy:deploy-file - 
> DgroupId=org.codehaus.plexus.webdav -DartifactId=plexus-webdav- 
> simple \
>          -Dversion=1.0-alpha-4-SNAPSHOT -Dpackaging=jar -Dfile=/ 
> path/to/file \
>           -Durl=[url] -DrepositoryId=[id]
>
>  Path to dependency:  	1) org.apache.maven.archiva:archiva- 
> webapp:war:1.0-beta-3-SNAPSHOT
>  	2) org.codehaus.plexus.webdav:plexus-webdav-simple:jar:1.0- 
> alpha-4-SNAPSHOT
>
> ----------
> 1 required artifact is missing.
>
> for artifact:  org.apache.maven.archiva:archiva-webapp:war:1.0- 
> beta-3-SNAPSHOT
>
> from the specified remote repositories:
>  central (http://repo1.maven.org/maven2),
>  apache.snapshots (http://people.apache.org/repo/m2-snapshot- 
> repository)
>
>
> [INFO]  
> ---------------------------------------------------------------------- 
> --
> [INFO] For more information, run Maven with the -e switch
> [INFO]  
> ---------------------------------------------------------------------- 
> --
> [INFO] Total time: 18 seconds
> [INFO] Finished at: Sun Sep 23 20:19:20 GMT+00:00 2007
> [INFO] Final Memory: 19M/329M
> [INFO]  
> ---------------------------------------------------------------------- 
> --
>
> ********************************************************************** 
> ******
>

--
Brett Porter - brett@apache.org
Blog: http://www.devzuz.org/blogs/bporter/


Mime
  • Unnamed multipart/alternative (inline, None, 0 bytes)
View raw message