archiva-dev mailing list archives

Site index · List index
Message view « Date » · « Thread »
Top « Date » · « Thread »
From Raphaël Piéroni <raphaelpier...@gmail.com>
Subject Re: Daily builds
Date Sun, 05 Nov 2006 22:10:45 GMT

> svn checkout http://svn.apache.org/repos/asf/maven/archiva/trunk/ archiva
> svn checkout http://svn.apache.org/repos/asf/maven/continuum/trunk/
continuum
> cd archiva
> mvn -X -e install
with a fresh local repository: *unreadable*
http://rifers.org/paste/show/2140
without: http://rifers.org/paste/show/2141
> cd ../continuum
> mvn -X -e install
with a fresh local repository: *unreadable*
http://rifers.org/paste/show/2142
without: http://rifers.org/paste/show/2143
The test which fails:
-------------------------------------------------------------------------------
Test set: org.apache.maven.continuum.DefaultContinuumTest
-------------------------------------------------------------------------------
Tests run: 8, Failures: 0, Errors: 5, Skipped: 0, Time elapsed: 21.82
sec <<< FAILURE!
testAddMavenTwoProjectSet(org.apache.maven.continuum.DefaultContinuumTest) 
Time elapsed: 3.128 sec  <<< ERROR!
org.apache.maven.continuum.ContinuumException: error generating dynamic
role for project Continuum Notifiers
    at
org.apache.maven.continuum.core.action.AddAssignableRolesAction.execute(AddAssignableRolesAction.java:62)
    at
org.apache.maven.continuum.DefaultContinuum.executeAction(DefaultContinuum.java:2374)
    at
org.apache.maven.continuum.DefaultContinuum.executeAddProjectsFromMetadataActivity(DefaultContinuum.java:1091)
    at
org.apache.maven.continuum.DefaultContinuum.addMavenTwoProject(DefaultContinuum.java:871)
    at
org.apache.maven.continuum.DefaultContinuumTest.testAddMavenTwoProjectSet(DefaultContinuumTest.java:71)

testUpdateMavenTwoProject(org.apache.maven.continuum.DefaultContinuumTest) 
Time elapsed: 2.047 sec  <<< ERROR!
org.apache.maven.continuum.ContinuumException: error generating dynamic
role for project Continuum Test Project 1
    at
org.apache.maven.continuum.core.action.AddAssignableRolesAction.execute(AddAssignableRolesAction.java:62)
    at
org.apache.maven.continuum.DefaultContinuum.executeAction(DefaultContinuum.java:2374)
    at
org.apache.maven.continuum.DefaultContinuum.executeAddProjectsFromMetadataActivity(DefaultContinuum.java:1091)
    at
org.apache.maven.continuum.DefaultContinuum.addMavenTwoProject(DefaultContinuum.java:871)
    at
org.apache.maven.continuum.DefaultContinuumTest.testUpdateMavenTwoProject(DefaultContinuumTest.java:121)

testBuildDefinitions(org.apache.maven.continuum.DefaultContinuumTest) 
Time elapsed: 2.904 sec  <<< ERROR!
org.apache.maven.continuum.ContinuumException: error generating dynamic
role for project Continuum Test Project 1
    at
org.apache.maven.continuum.core.action.AddAssignableRolesAction.execute(AddAssignableRolesAction.java:62)
    at
org.apache.maven.continuum.DefaultContinuum.executeAction(DefaultContinuum.java:2374)
    at
org.apache.maven.continuum.DefaultContinuum.executeAddProjectsFromMetadataActivity(DefaultContinuum.java:1091)
    at
org.apache.maven.continuum.DefaultContinuum.addMavenTwoProject(DefaultContinuum.java:871)
    at
org.apache.maven.continuum.DefaultContinuumTest.testBuildDefinitions(DefaultContinuumTest.java:150)

testProjectGroups(org.apache.maven.continuum.DefaultContinuumTest)  Time
elapsed: 2.343 sec  <<< ERROR!
org.apache.maven.continuum.ContinuumException: error generating dynamic
role for project Continuum Test Project 1
    at
org.apache.maven.continuum.core.action.AddAssignableRolesAction.execute(AddAssignableRolesAction.java:62)
    at
org.apache.maven.continuum.DefaultContinuum.executeAction(DefaultContinuum.java:2374)
    at
org.apache.maven.continuum.DefaultContinuum.executeAddProjectsFromMetadataActivity(DefaultContinuum.java:1091)
    at
org.apache.maven.continuum.DefaultContinuum.addMavenTwoProject(DefaultContinuum.java:871)
    at
org.apache.maven.continuum.DefaultContinuumTest.testProjectGroups(DefaultContinuumTest.java:231)

testProjectAndGroupNotifiers(org.apache.maven.continuum.DefaultContinuumTest) 
Time elapsed: 1.831 sec  <<< ERROR!
org.apache.maven.continuum.ContinuumException: error generating dynamic
role for project Continuum Test Project 1
    at
org.apache.maven.continuum.core.action.AddAssignableRolesAction.execute(AddAssignableRolesAction.java:62)
    at
org.apache.maven.continuum.DefaultContinuum.executeAction(DefaultContinuum.java:2374)
    at
org.apache.maven.continuum.DefaultContinuum.executeAddProjectsFromMetadataActivity(DefaultContinuum.java:1091)
    at
org.apache.maven.continuum.DefaultContinuum.addMavenTwoProject(DefaultContinuum.java:871)
    at
org.apache.maven.continuum.DefaultContinuumTest.testProjectAndGroupNotifiers(DefaultContinuumTest.java:276)


Hope this helps

Raphaël

Emmanuel Venisse a écrit :
>
>
> Raphaël Piéroni a écrit :
>> Tried : maven-2.0.4, jdk1.6.0-b2, Mandriva-2007-x86-64
>>
>> Archiva :
>> During Archiva Runtime Generator : Error creating assembly: You must
>> set at
>> least one file.
>> but the war file was generated.
>>
>> Continuum :
>> Error when during test :
>> there were 5 errors (can't remember the project)
>> but i can find the lastest war over the net
>>
>> Therefore i have an issue, but also can have the war files to deploy on
>> tomcat.
>>
>> Thanks for the help given.
>>
>> Raphaël
>>
>> Ps, if needed i can retry with -X -e options on both projects and
>> forward
>> the traces
>
> yes, please.
>
> Emmanuel


Mime
View raw message