apr-dev mailing list archives

Site index · List index
Message view « Date » · « Thread »
Top « Date » · « Thread »
From Jeff Trawick <traw...@gmail.com>
Subject Re: Issue compiling with VS 2012 RC
Date Sat, 11 Aug 2012 16:46:07 GMT
On Fri, Aug 10, 2012 at 9:56 PM, Paul Matthews <thekestrel@gmail.com> wrote:
> Hi,
>    New to Apr and I'm trying to build with Visual Studio 2012 RC. I expected
> some project conversion issues, but rectifying them it taking longer than I
> expected so I thought I'd try and get some help (or at least provide some
> data for someone else). First import of .dsw failed for apr directory, but
> picked it up on the second pass. Keep getting 'Cpp.Win32.user.props warnings
> and deleting the file and restarting VS as some forums advise does
> nothing.I'm seeing a few missing files, but a  quick investigation seemed to
> indicate I should not need them (i.e. no mysql installed).If there are some
> quick tips for removing some of these errors it would be appreciated.

Here's what I've done successfully:

clean checkout of apr trunk
open apr/test/ dsw file with Visual Studio 2008, let it create new
solution files for everything, exit/save
open the new apr/test/ solution file with Visual Studio 2010, run
through its translator
build (successful)

I haven't installed Visual Studio 2012 RC yet.  Can you try a stepwise
upgrade and see if you get better results?  (I suspect that Visual C++
Express 2008 can play the role of Visual Studio 2008 in the steps
above, if you don't have Visual Studio 2008.)

>
> 1>------ Build started: Project: apr, Configuration: Release Win32 ------
> 2>------ Build started: Project: libapr, Configuration: Release Win32 ------
> 3>------ Build started: Project: libaprutil, Configuration: Release Win32
> ------
> 4>------ Build started: Project: preaprutil, Configuration: Release Win32
> ------
> 5>------ Build started: Project: apr_crypto_nss, Configuration: Release
> Win32 ------
> 6>------ Build started: Project: apr_crypto_openssl, Configuration: Release
> Win32 ------
> 7>------ Build started: Project: apr_dbd_freetds, Configuration: Release
> Win32 ------
> 8>------ Build started: Project: apr_dbd_mysql, Configuration: Release Win32
> ------
> 1>C:\Users\matthep\Documents\Code\apr\apr\apr.vcxproj(100,5): warning
> MSB4011:
> "C:\Users\matthep\AppData\Local\Microsoft\MSBuild\v4.0\Microsoft.Cpp.Win32.user.props"
> cannot be imported again. It was already imported at
> "C:\Users\matthep\Documents\Code\apr\apr\apr.vcxproj (86,5)". This is most
> likely a build authoring error. This subsequent import will be ignored.
> 2>C:\Users\matthep\Documents\Code\apr\apr\apr.vcxproj(100,5): warning
> MSB4011:
> "C:\Users\matthep\AppData\Local\Microsoft\MSBuild\v4.0\Microsoft.Cpp.Win32.user.props"
> cannot be imported again. It was already imported at
> "C:\Users\matthep\Documents\Code\apr\apr\apr.vcxproj (86,5)". This is most
> likely a build authoring error. This subsequent import will be ignored.
> 3>C:\Users\matthep\Documents\Code\apr\apr\apr.vcxproj(100,5): warning
> MSB4011:
> "C:\Users\matthep\AppData\Local\Microsoft\MSBuild\v4.0\Microsoft.Cpp.Win32.user.props"
> cannot be imported again. It was already imported at
> "C:\Users\matthep\Documents\Code\apr\apr\apr.vcxproj (86,5)". This is most
> likely a build authoring error. This subsequent import will be ignored.
> 3>C:\Users\matthep\Documents\Code\apr\apr-util\crypto\apr_crypto_nss.vcxproj(70,5):
> warning MSB4011:
> "C:\Users\matthep\AppData\Local\Microsoft\MSBuild\v4.0\Microsoft.Cpp.Win32.user.props"
> cannot be imported again. It was already imported at
> "C:\Users\matthep\Documents\Code\apr\apr-util\crypto\apr_crypto_nss.vcxproj
> (63,5)". This is most likely a build authoring error. This subsequent import
> will be ignored.
> 4>C:\Users\matthep\Documents\Code\apr\apr\apr.vcxproj(100,5): warning
> MSB4011:
> "C:\Users\matthep\AppData\Local\Microsoft\MSBuild\v4.0\Microsoft.Cpp.Win32.user.props"
> cannot be imported again. It was already imported at
> "C:\Users\matthep\Documents\Code\apr\apr\apr.vcxproj (86,5)". This is most
> likely a build authoring error. This subsequent import will be ignored.
> 4>C:\Users\matthep\Documents\Code\apr\apr-util\crypto\apr_crypto_nss.vcxproj(70,5):
> warning MSB4011:
> "C:\Users\matthep\AppData\Local\Microsoft\MSBuild\v4.0\Microsoft.Cpp.Win32.user.props"
> cannot be imported again. It was already imported at
> "C:\Users\matthep\Documents\Code\apr\apr-util\crypto\apr_crypto_nss.vcxproj
> (63,5)". This is most likely a build authoring error. This subsequent import
> will be ignored.
> 5>C:\Users\matthep\Documents\Code\apr\apr\apr.vcxproj(100,5): warning
> MSB4011:
> "C:\Users\matthep\AppData\Local\Microsoft\MSBuild\v4.0\Microsoft.Cpp.Win32.user.props"
> cannot be imported again. It was already imported at
> "C:\Users\matthep\Documents\Code\apr\apr\apr.vcxproj (86,5)". This is most
> likely a build authoring error. This subsequent import will be ignored.
> 5>C:\Users\matthep\Documents\Code\apr\apr-util\crypto\apr_crypto_nss.vcxproj(70,5):
> warning MSB4011:
> "C:\Users\matthep\AppData\Local\Microsoft\MSBuild\v4.0\Microsoft.Cpp.Win32.user.props"
> cannot be imported again. It was already imported at
> "C:\Users\matthep\Documents\Code\apr\apr-util\crypto\apr_crypto_nss.vcxproj
> (63,5)". This is most likely a build authoring error. This subsequent import
> will be ignored.
> 6>C:\Users\matthep\Documents\Code\apr\apr\apr.vcxproj(100,5): warning
> MSB4011:
> "C:\Users\matthep\AppData\Local\Microsoft\MSBuild\v4.0\Microsoft.Cpp.Win32.user.props"
> cannot be imported again. It was already imported at
> "C:\Users\matthep\Documents\Code\apr\apr\apr.vcxproj (86,5)". This is most
> likely a build authoring error. This subsequent import will be ignored.
> 6>C:\Users\matthep\Documents\Code\apr\apr-util\crypto\apr_crypto_nss.vcxproj(70,5):
> warning MSB4011:
> "C:\Users\matthep\AppData\Local\Microsoft\MSBuild\v4.0\Microsoft.Cpp.Win32.user.props"
> cannot be imported again. It was already imported at
> "C:\Users\matthep\Documents\Code\apr\apr-util\crypto\apr_crypto_nss.vcxproj
> (63,5)". This is most likely a build authoring error. This subsequent import
> will be ignored.
> 6>C:\Users\matthep\Documents\Code\apr\apr-util\crypto\apr_crypto_openssl.vcxproj(85,5):
> warning MSB4011:
> "C:\Users\matthep\AppData\Local\Microsoft\MSBuild\v4.0\Microsoft.Cpp.Win32.user.props"
> cannot be imported again. It was already imported at
> "C:\Users\matthep\Documents\Code\apr\apr-util\crypto\apr_crypto_openssl.vcxproj
> (78,5)". This is most likely a build authoring error. This subsequent import
> will be ignored.
> 6>C:\Users\matthep\Documents\Code\apr\apr-util\dbd\apr_dbd_mysql.vcxproj(81,5):
> warning MSB4011:
> "C:\Users\matthep\AppData\Local\Microsoft\MSBuild\v4.0\Microsoft.Cpp.Win32.user.props"
> cannot be imported again. It was already imported at
> "C:\Users\matthep\Documents\Code\apr\apr-util\dbd\apr_dbd_mysql.vcxproj
> (75,5)". This is most likely a build authoring error. This subsequent import
> will be ignored.
> 6>C:\Users\matthep\Documents\Code\apr\apr-util\libaprutil.vcxproj(81,5):
> warning MSB4011:
> "C:\Users\matthep\AppData\Local\Microsoft\MSBuild\v4.0\Microsoft.Cpp.Win32.user.props"
> cannot be imported again. It was already imported at
> "C:\Users\matthep\Documents\Code\apr\apr-util\libaprutil.vcxproj (78,5)".
> This is most likely a build authoring error. This subsequent import will be
> ignored.
> 8>C:\Users\matthep\Documents\Code\apr\apr\apr.vcxproj(100,5): warning
> MSB4011:
> "C:\Users\matthep\AppData\Local\Microsoft\MSBuild\v4.0\Microsoft.Cpp.Win32.user.props"
> cannot be imported again. It was already imported at
> "C:\Users\matthep\Documents\Code\apr\apr\apr.vcxproj (86,5)". This is most
> likely a build authoring error. This subsequent import will be ignored.
> 8>C:\Users\matthep\Documents\Code\apr\apr-util\crypto\apr_crypto_nss.vcxproj(70,5):
> warning MSB4011:
> "C:\Users\matthep\AppData\Local\Microsoft\MSBuild\v4.0\Microsoft.Cpp.Win32.user.props"
> cannot be imported again. It was already imported at
> "C:\Users\matthep\Documents\Code\apr\apr-util\crypto\apr_crypto_nss.vcxproj
> (63,5)". This is most likely a build authoring error. This subsequent import
> will be ignored.
> 8>C:\Users\matthep\Documents\Code\apr\apr-util\crypto\apr_crypto_openssl.vcxproj(85,5):
> warning MSB4011:
> "C:\Users\matthep\AppData\Local\Microsoft\MSBuild\v4.0\Microsoft.Cpp.Win32.user.props"
> cannot be imported again. It was already imported at
> "C:\Users\matthep\Documents\Code\apr\apr-util\crypto\apr_crypto_openssl.vcxproj
> (78,5)". This is most likely a build authoring error. This subsequent import
> will be ignored.
> 8>C:\Users\matthep\Documents\Code\apr\apr-util\dbd\apr_dbd_mysql.vcxproj(81,5):
> warning MSB4011:
> "C:\Users\matthep\AppData\Local\Microsoft\MSBuild\v4.0\Microsoft.Cpp.Win32.user.props"
> cannot be imported again. It was already imported at
> "C:\Users\matthep\Documents\Code\apr\apr-util\dbd\apr_dbd_mysql.vcxproj
> (75,5)". This is most likely a build authoring error. This subsequent import
> will be ignored.
> 8>C:\Users\matthep\Documents\Code\apr\apr-util\libaprutil.vcxproj(81,5):
> warning MSB4011:
> "C:\Users\matthep\AppData\Local\Microsoft\MSBuild\v4.0\Microsoft.Cpp.Win32.user.props"
> cannot be imported again. It was already imported at
> "C:\Users\matthep\Documents\Code\apr\apr-util\libaprutil.vcxproj (78,5)".
> This is most likely a build authoring error. This subsequent import will be
> ignored.
> 8>C:\Users\matthep\Documents\Code\apr\apr\libapr.vcxproj(111,5): warning
> MSB4011:
> "C:\Users\matthep\AppData\Local\Microsoft\MSBuild\v4.0\Microsoft.Cpp.Win32.user.props"
> cannot be imported again. It was already imported at
> "C:\Users\matthep\Documents\Code\apr\apr\libapr.vcxproj (101,5)". This is
> most likely a build authoring error. This subsequent import will be ignored.
> 7>C:\Users\matthep\Documents\Code\apr\apr\apr.vcxproj(100,5): warning
> MSB4011:
> "C:\Users\matthep\AppData\Local\Microsoft\MSBuild\v4.0\Microsoft.Cpp.Win32.user.props"
> cannot be imported again. It was already imported at
> "C:\Users\matthep\Documents\Code\apr\apr\apr.vcxproj (86,5)". This is most
> likely a build authoring error. This subsequent import will be ignored.
> 7>C:\Users\matthep\Documents\Code\apr\apr-util\crypto\apr_crypto_nss.vcxproj(70,5):
> warning MSB4011:
> "C:\Users\matthep\AppData\Local\Microsoft\MSBuild\v4.0\Microsoft.Cpp.Win32.user.props"
> cannot be imported again. It was already imported at
> "C:\Users\matthep\Documents\Code\apr\apr-util\crypto\apr_crypto_nss.vcxproj
> (63,5)". This is most likely a build authoring error. This subsequent import
> will be ignored.
> 7>C:\Users\matthep\Documents\Code\apr\apr-util\crypto\apr_crypto_openssl.vcxproj(85,5):
> warning MSB4011:
> "C:\Users\matthep\AppData\Local\Microsoft\MSBuild\v4.0\Microsoft.Cpp.Win32.user.props"
> cannot be imported again. It was already imported at
> "C:\Users\matthep\Documents\Code\apr\apr-util\crypto\apr_crypto_openssl.vcxproj
> (78,5)". This is most likely a build authoring error. This subsequent import
> will be ignored.
> 7>C:\Users\matthep\Documents\Code\apr\apr-util\dbd\apr_dbd_mysql.vcxproj(81,5):
> warning MSB4011:
> "C:\Users\matthep\AppData\Local\Microsoft\MSBuild\v4.0\Microsoft.Cpp.Win32.user.props"
> cannot be imported again. It was already imported at
> "C:\Users\matthep\Documents\Code\apr\apr-util\dbd\apr_dbd_mysql.vcxproj
> (75,5)". This is most likely a build authoring error. This subsequent import
> will be ignored.
> 7>C:\Users\matthep\Documents\Code\apr\apr-util\libaprutil.vcxproj(81,5):
> warning MSB4011:
> "C:\Users\matthep\AppData\Local\Microsoft\MSBuild\v4.0\Microsoft.Cpp.Win32.user.props"
> cannot be imported again. It was already imported at
> "C:\Users\matthep\Documents\Code\apr\apr-util\libaprutil.vcxproj (78,5)".
> This is most likely a build authoring error. This subsequent import will be
> ignored.
> 7>C:\Users\matthep\Documents\Code\apr\apr\libapr.vcxproj(111,5): warning
> MSB4011:
> "C:\Users\matthep\AppData\Local\Microsoft\MSBuild\v4.0\Microsoft.Cpp.Win32.user.props"
> cannot be imported again. It was already imported at
> "C:\Users\matthep\Documents\Code\apr\apr\libapr.vcxproj (101,5)". This is
> most likely a build authoring error. This subsequent import will be ignored.
> 7>C:\Users\matthep\Documents\Code\apr\apr-util\build\preaprutil.vcxproj(86,5):
> warning MSB4011:
> "C:\Users\matthep\AppData\Local\Microsoft\MSBuild\v4.0\Microsoft.Cpp.Win32.user.props"
> cannot be imported again. It was already imported at
> "C:\Users\matthep\Documents\Code\apr\apr-util\build\preaprutil.vcxproj
> (79,5)". This is most likely a build authoring error. This subsequent import
> will be ignored.
> 1>C:\Users\matthep\Documents\Code\apr\apr-util\crypto\apr_crypto_nss.vcxproj(70,5):
> warning MSB4011:
> "C:\Users\matthep\AppData\Local\Microsoft\MSBuild\v4.0\Microsoft.Cpp.Win32.user.props"
> cannot be imported again. It was already imported at
> "C:\Users\matthep\Documents\Code\apr\apr-util\crypto\apr_crypto_nss.vcxproj
> (63,5)". This is most likely a build authoring error. This subsequent import
> will be ignored.
> 1>C:\Program Files
> (x86)\MSBuild\Microsoft.Cpp\v4.0\V110\Microsoft.CppCommon.targets(177,5):
> warning MSB8018: No outputs specified for item "include\apr.hw". Its custom
> build command will be skipped.
> 1>C:\Users\matthep\Documents\Code\apr\apr-util\crypto\apr_crypto_openssl.vcxproj(85,5):
> warning MSB4011:
> "C:\Users\matthep\AppData\Local\Microsoft\MSBuild\v4.0\Microsoft.Cpp.Win32.user.props"
> cannot be imported again. It was already imported at
> "C:\Users\matthep\Documents\Code\apr\apr-util\crypto\apr_crypto_openssl.vcxproj
> (78,5)". This is most likely a build authoring error. This subsequent import
> will be ignored.
> 1>C:\Users\matthep\Documents\Code\apr\apr-util\dbd\apr_dbd_mysql.vcxproj(81,5):
> warning MSB4011:
> "C:\Users\matthep\AppData\Local\Microsoft\MSBuild\v4.0\Microsoft.Cpp.Win32.user.props"
> cannot be imported again. It was already imported at
> "C:\Users\matthep\Documents\Code\apr\apr-util\dbd\apr_dbd_mysql.vcxproj
> (75,5)". This is most likely a build authoring error. This subsequent import
> will be ignored.
> 1>C:\Users\matthep\Documents\Code\apr\apr-util\libaprutil.vcxproj(81,5):
> warning MSB4011:
> "C:\Users\matthep\AppData\Local\Microsoft\MSBuild\v4.0\Microsoft.Cpp.Win32.user.props"
> cannot be imported again. It was already imported at
> "C:\Users\matthep\Documents\Code\apr\apr-util\libaprutil.vcxproj (78,5)".
> This is most likely a build authoring error. This subsequent import will be
> ignored.
> 1>C:\Users\matthep\Documents\Code\apr\apr\libapr.vcxproj(111,5): warning
> MSB4011:
> "C:\Users\matthep\AppData\Local\Microsoft\MSBuild\v4.0\Microsoft.Cpp.Win32.user.props"
> cannot be imported again. It was already imported at
> "C:\Users\matthep\Documents\Code\apr\apr\libapr.vcxproj (101,5)". This is
> most likely a build authoring error. This subsequent import will be ignored.
> 1>C:\Users\matthep\Documents\Code\apr\apr-util\build\preaprutil.vcxproj(86,5):
> warning MSB4011:
> "C:\Users\matthep\AppData\Local\Microsoft\MSBuild\v4.0\Microsoft.Cpp.Win32.user.props"
> cannot be imported again. It was already imported at
> "C:\Users\matthep\Documents\Code\apr\apr-util\build\preaprutil.vcxproj
> (79,5)". This is most likely a build authoring error. This subsequent import
> will be ignored.
> 1>C:\Users\matthep\Documents\Code\apr\apr-util\dbd\apr_dbd_freetds.vcxproj(81,5):
> warning MSB4011:
> "C:\Users\matthep\AppData\Local\Microsoft\MSBuild\v4.0\Microsoft.Cpp.Win32.user.props"
> cannot be imported again. It was already imported at
> "C:\Users\matthep\Documents\Code\apr\apr-util\dbd\apr_dbd_freetds.vcxproj
> (75,5)". This is most likely a build authoring error. This subsequent import
> will be ignored.
> 1>  apr_atomic.c
> 2>C:\Users\matthep\Documents\Code\apr\apr-util\crypto\apr_crypto_nss.vcxproj(70,5):
> warning MSB4011:
> "C:\Users\matthep\AppData\Local\Microsoft\MSBuild\v4.0\Microsoft.Cpp.Win32.user.props"
> cannot be imported again. It was already imported at
> "C:\Users\matthep\Documents\Code\apr\apr-util\crypto\apr_crypto_nss.vcxproj
> (63,5)". This is most likely a build authoring error. This subsequent import
> will be ignored.
> 2>C:\Users\matthep\Documents\Code\apr\apr-util\crypto\apr_crypto_openssl.vcxproj(85,5):
> warning MSB4011:
> "C:\Users\matthep\AppData\Local\Microsoft\MSBuild\v4.0\Microsoft.Cpp.Win32.user.props"
> cannot be imported again. It was already imported at
> "C:\Users\matthep\Documents\Code\apr\apr-util\crypto\apr_crypto_openssl.vcxproj
> (78,5)". This is most likely a build authoring error. This subsequent import
> will be ignored.
> 2>C:\Users\matthep\Documents\Code\apr\apr-util\dbd\apr_dbd_mysql.vcxproj(81,5):
> warning MSB4011:
> "C:\Users\matthep\AppData\Local\Microsoft\MSBuild\v4.0\Microsoft.Cpp.Win32.user.props"
> cannot be imported again. It was already imported at
> "C:\Users\matthep\Documents\Code\apr\apr-util\dbd\apr_dbd_mysql.vcxproj
> (75,5)". This is most likely a build authoring error. This subsequent import
> will be ignored.
> 2>C:\Users\matthep\Documents\Code\apr\apr-util\libaprutil.vcxproj(81,5):
> warning MSB4011:
> "C:\Users\matthep\AppData\Local\Microsoft\MSBuild\v4.0\Microsoft.Cpp.Win32.user.props"
> cannot be imported again. It was already imported at
> "C:\Users\matthep\Documents\Code\apr\apr-util\libaprutil.vcxproj (78,5)".
> This is most likely a build authoring error. This subsequent import will be
> ignored.
> 2>C:\Users\matthep\Documents\Code\apr\apr\libapr.vcxproj(111,5): warning
> MSB4011:
> "C:\Users\matthep\AppData\Local\Microsoft\MSBuild\v4.0\Microsoft.Cpp.Win32.user.props"
> cannot be imported again. It was already imported at
> "C:\Users\matthep\Documents\Code\apr\apr\libapr.vcxproj (101,5)". This is
> most likely a build authoring error. This subsequent import will be ignored.
> 2>C:\Users\matthep\Documents\Code\apr\apr-util\build\preaprutil.vcxproj(86,5):
> warning MSB4011:
> "C:\Users\matthep\AppData\Local\Microsoft\MSBuild\v4.0\Microsoft.Cpp.Win32.user.props"
> cannot be imported again. It was already imported at
> "C:\Users\matthep\Documents\Code\apr\apr-util\build\preaprutil.vcxproj
> (79,5)". This is most likely a build authoring error. This subsequent import
> will be ignored.
> 2>C:\Program Files
> (x86)\MSBuild\Microsoft.Cpp\v4.0\V110\Microsoft.CppCommon.targets(177,5):
> warning MSB8018: No outputs specified for item "include\apr.hw". Its custom
> build command will be skipped.
> 2>C:\Users\matthep\Documents\Code\apr\apr-util\dbd\apr_dbd_freetds.vcxproj(81,5):
> warning MSB4011:
> "C:\Users\matthep\AppData\Local\Microsoft\MSBuild\v4.0\Microsoft.Cpp.Win32.user.props"
> cannot be imported again. It was already imported at
> "C:\Users\matthep\Documents\Code\apr\apr-util\dbd\apr_dbd_freetds.vcxproj
> (75,5)". This is most likely a build authoring error. This subsequent import
> will be ignored.
> 3>C:\Users\matthep\Documents\Code\apr\apr-util\crypto\apr_crypto_openssl.vcxproj(85,5):
> warning MSB4011:
> "C:\Users\matthep\AppData\Local\Microsoft\MSBuild\v4.0\Microsoft.Cpp.Win32.user.props"
> cannot be imported again. It was already imported at
> "C:\Users\matthep\Documents\Code\apr\apr-util\crypto\apr_crypto_openssl.vcxproj
> (78,5)". This is most likely a build authoring error. This subsequent import
> will be ignored.
> 3>C:\Users\matthep\Documents\Code\apr\apr-util\dbd\apr_dbd_mysql.vcxproj(81,5):
> warning MSB4011:
> "C:\Users\matthep\AppData\Local\Microsoft\MSBuild\v4.0\Microsoft.Cpp.Win32.user.props"
> cannot be imported again. It was already imported at
> "C:\Users\matthep\Documents\Code\apr\apr-util\dbd\apr_dbd_mysql.vcxproj
> (75,5)". This is most likely a build authoring error. This subsequent import
> will be ignored.
> 3>C:\Users\matthep\Documents\Code\apr\apr-util\libaprutil.vcxproj(81,5):
> warning MSB4011:
> "C:\Users\matthep\AppData\Local\Microsoft\MSBuild\v4.0\Microsoft.Cpp.Win32.user.props"
> cannot be imported again. It was already imported at
> "C:\Users\matthep\Documents\Code\apr\apr-util\libaprutil.vcxproj (78,5)".
> This is most likely a build authoring error. This subsequent import will be
> ignored.
> 3>C:\Program Files
> (x86)\MSBuild\Microsoft.Cpp\v4.0\V110\Microsoft.CppCommon.targets(177,5):
> warning MSB8018: No outputs specified for item "include\apr_ldap.hw". Its
> custom build command will be skipped.
> 3>C:\Program Files
> (x86)\MSBuild\Microsoft.Cpp\v4.0\V110\Microsoft.CppCommon.targets(177,5):
> warning MSB8018: No outputs specified for item "include\apu.hw". Its custom
> build command will be skipped.
> 3>C:\Program Files
> (x86)\MSBuild\Microsoft.Cpp\v4.0\V110\Microsoft.CppCommon.targets(177,5):
> warning MSB8018: No outputs specified for item
> "include\private\apu_config.hw". Its custom build command will be skipped.
> 3>C:\Program Files
> (x86)\MSBuild\Microsoft.Cpp\v4.0\V110\Microsoft.CppCommon.targets(177,5):
> warning MSB8018: No outputs specified for item
> "include\private\apu_select_dbm.hw". Its custom build command will be
> skipped.
> 3>C:\Program Files
> (x86)\MSBuild\Microsoft.Cpp\v4.0\V110\Microsoft.CppCommon.targets(177,5):
> warning MSB8018: No outputs specified for item "include\apu_want.hw". Its
> custom build command will be skipped.
> 3>C:\Users\matthep\Documents\Code\apr\apr\libapr.vcxproj(111,5): warning
> MSB4011:
> "C:\Users\matthep\AppData\Local\Microsoft\MSBuild\v4.0\Microsoft.Cpp.Win32.user.props"
> cannot be imported again. It was already imported at
> "C:\Users\matthep\Documents\Code\apr\apr\libapr.vcxproj (101,5)". This is
> most likely a build authoring error. This subsequent import will be ignored.
> 3>C:\Users\matthep\Documents\Code\apr\apr-util\build\preaprutil.vcxproj(86,5):
> warning MSB4011:
> "C:\Users\matthep\AppData\Local\Microsoft\MSBuild\v4.0\Microsoft.Cpp.Win32.user.props"
> cannot be imported again. It was already imported at
> "C:\Users\matthep\Documents\Code\apr\apr-util\build\preaprutil.vcxproj
> (79,5)". This is most likely a build authoring error. This subsequent import
> will be ignored.
> 3>C:\Users\matthep\Documents\Code\apr\apr-util\dbd\apr_dbd_freetds.vcxproj(81,5):
> warning MSB4011:
> "C:\Users\matthep\AppData\Local\Microsoft\MSBuild\v4.0\Microsoft.Cpp.Win32.user.props"
> cannot be imported again. It was already imported at
> "C:\Users\matthep\Documents\Code\apr\apr-util\dbd\apr_dbd_freetds.vcxproj
> (75,5)". This is most likely a build authoring error. This subsequent import
> will be ignored.
> 3>  apr_brigade.c
> 4>C:\Users\matthep\Documents\Code\apr\apr-util\crypto\apr_crypto_openssl.vcxproj(85,5):
> warning MSB4011:
> "C:\Users\matthep\AppData\Local\Microsoft\MSBuild\v4.0\Microsoft.Cpp.Win32.user.props"
> cannot be imported again. It was already imported at
> "C:\Users\matthep\Documents\Code\apr\apr-util\crypto\apr_crypto_openssl.vcxproj
> (78,5)". This is most likely a build authoring error. This subsequent import
> will be ignored.
> 4>C:\Users\matthep\Documents\Code\apr\apr-util\dbd\apr_dbd_mysql.vcxproj(81,5):
> warning MSB4011:
> "C:\Users\matthep\AppData\Local\Microsoft\MSBuild\v4.0\Microsoft.Cpp.Win32.user.props"
> cannot be imported again. It was already imported at
> "C:\Users\matthep\Documents\Code\apr\apr-util\dbd\apr_dbd_mysql.vcxproj
> (75,5)". This is most likely a build authoring error. This subsequent import
> will be ignored.
> 4>C:\Users\matthep\Documents\Code\apr\apr-util\libaprutil.vcxproj(81,5):
> warning MSB4011:
> "C:\Users\matthep\AppData\Local\Microsoft\MSBuild\v4.0\Microsoft.Cpp.Win32.user.props"
> cannot be imported again. It was already imported at
> "C:\Users\matthep\Documents\Code\apr\apr-util\libaprutil.vcxproj (78,5)".
> This is most likely a build authoring error. This subsequent import will be
> ignored.
> 4>C:\Users\matthep\Documents\Code\apr\apr\libapr.vcxproj(111,5): warning
> MSB4011:
> "C:\Users\matthep\AppData\Local\Microsoft\MSBuild\v4.0\Microsoft.Cpp.Win32.user.props"
> cannot be imported again. It was already imported at
> "C:\Users\matthep\Documents\Code\apr\apr\libapr.vcxproj (101,5)". This is
> most likely a build authoring error. This subsequent import will be ignored.
> 4>C:\Users\matthep\Documents\Code\apr\apr-util\build\preaprutil.vcxproj(86,5):
> warning MSB4011:
> "C:\Users\matthep\AppData\Local\Microsoft\MSBuild\v4.0\Microsoft.Cpp.Win32.user.props"
> cannot be imported again. It was already imported at
> "C:\Users\matthep\Documents\Code\apr\apr-util\build\preaprutil.vcxproj
> (79,5)". This is most likely a build authoring error. This subsequent import
> will be ignored.
> 5>C:\Users\matthep\Documents\Code\apr\apr-util\crypto\apr_crypto_openssl.vcxproj(85,5):
> warning MSB4011:
> "C:\Users\matthep\AppData\Local\Microsoft\MSBuild\v4.0\Microsoft.Cpp.Win32.user.props"
> cannot be imported again. It was already imported at
> "C:\Users\matthep\Documents\Code\apr\apr-util\crypto\apr_crypto_openssl.vcxproj
> (78,5)". This is most likely a build authoring error. This subsequent import
> will be ignored.
> 5>C:\Users\matthep\Documents\Code\apr\apr-util\dbd\apr_dbd_mysql.vcxproj(81,5):
> warning MSB4011:
> "C:\Users\matthep\AppData\Local\Microsoft\MSBuild\v4.0\Microsoft.Cpp.Win32.user.props"
> cannot be imported again. It was already imported at
> "C:\Users\matthep\Documents\Code\apr\apr-util\dbd\apr_dbd_mysql.vcxproj
> (75,5)". This is most likely a build authoring error. This subsequent import
> will be ignored.
> 5>C:\Users\matthep\Documents\Code\apr\apr-util\libaprutil.vcxproj(81,5):
> warning MSB4011:
> "C:\Users\matthep\AppData\Local\Microsoft\MSBuild\v4.0\Microsoft.Cpp.Win32.user.props"
> cannot be imported again. It was already imported at
> "C:\Users\matthep\Documents\Code\apr\apr-util\libaprutil.vcxproj (78,5)".
> This is most likely a build authoring error. This subsequent import will be
> ignored.
> 5>C:\Users\matthep\Documents\Code\apr\apr\libapr.vcxproj(111,5): warning
> MSB4011:
> "C:\Users\matthep\AppData\Local\Microsoft\MSBuild\v4.0\Microsoft.Cpp.Win32.user.props"
> cannot be imported again. It was already imported at
> "C:\Users\matthep\Documents\Code\apr\apr\libapr.vcxproj (101,5)". This is
> most likely a build authoring error. This subsequent import will be ignored.
> 5>  apr_crypto_nss.c
> 6>  apr_crypto_openssl.c
> 8>C:\Users\matthep\Documents\Code\apr\apr-util\build\preaprutil.vcxproj(86,5):
> warning MSB4011:
> "C:\Users\matthep\AppData\Local\Microsoft\MSBuild\v4.0\Microsoft.Cpp.Win32.user.props"
> cannot be imported again. It was already imported at
> "C:\Users\matthep\Documents\Code\apr\apr-util\build\preaprutil.vcxproj
> (79,5)". This is most likely a build authoring error. This subsequent import
> will be ignored.
> 8>C:\Users\matthep\Documents\Code\apr\apr-util\dbd\apr_dbd_freetds.vcxproj(81,5):
> warning MSB4011:
> "C:\Users\matthep\AppData\Local\Microsoft\MSBuild\v4.0\Microsoft.Cpp.Win32.user.props"
> cannot be imported again. It was already imported at
> "C:\Users\matthep\Documents\Code\apr\apr-util\dbd\apr_dbd_freetds.vcxproj
> (75,5)". This is most likely a build authoring error. This subsequent import
> will be ignored.
> 8>  apr_dbd_mysql.c
> 7>C:\Users\matthep\Documents\Code\apr\apr-util\dbd\apr_dbd_freetds.vcxproj(81,5):
> warning MSB4011:
> "C:\Users\matthep\AppData\Local\Microsoft\MSBuild\v4.0\Microsoft.Cpp.Win32.user.props"
> cannot be imported again. It was already imported at
> "C:\Users\matthep\Documents\Code\apr\apr-util\dbd\apr_dbd_freetds.vcxproj
> (75,5)". This is most likely a build authoring error. This subsequent import
> will be ignored.
> 7>  apr_dbd_freetds.c
> 2>  apr_atomic.c
> 2>  dso.c
> 7>apr_dbd_freetds.c(48): fatal error C1083: Cannot open include file:
> 'regex.h': No such file or directory
> 8>apr_dbd_mysql.c(43): fatal error C1083: Cannot open include file:
> 'mysql.h': No such file or directory
> 9>------ Build started: Project: apr_dbd_oracle, Configuration: Release
> Win32 ------
> 6>C:\Users\matthep\Documents\Code\apr\apr\libapr.vcxproj(111,5): warning
> MSB4011:
> "C:\Users\matthep\AppData\Local\Microsoft\MSBuild\v4.0\Microsoft.Cpp.Win32.user.props"
> cannot be imported again. It was already imported at
> "C:\Users\matthep\Documents\Code\apr\apr\libapr.vcxproj (101,5)". This is
> most likely a build authoring error. This subsequent import will be ignored.
> 6>C:\Users\matthep\Documents\Code\apr\apr-util\build\preaprutil.vcxproj(86,5):
> warning MSB4011:
> "C:\Users\matthep\AppData\Local\Microsoft\MSBuild\v4.0\Microsoft.Cpp.Win32.user.props"
> cannot be imported again. It was already imported at
> "C:\Users\matthep\Documents\Code\apr\apr-util\build\preaprutil.vcxproj
> (79,5)". This is most likely a build authoring error. This subsequent import
> will be ignored.
> 6>C:\Users\matthep\Documents\Code\apr\apr-util\dbd\apr_dbd_freetds.vcxproj(81,5):
> warning MSB4011:
> "C:\Users\matthep\AppData\Local\Microsoft\MSBuild\v4.0\Microsoft.Cpp.Win32.user.props"
> cannot be imported again. It was already imported at
> "C:\Users\matthep\Documents\Code\apr\apr-util\dbd\apr_dbd_freetds.vcxproj
> (75,5)". This is most likely a build authoring error. This subsequent import
> will be ignored.
> 6>LINK : fatal error LNK1181: cannot open input file 'libeay32.lib'
> 10>------ Build started: Project: apr_dbd_pgsql, Configuration: Release
> Win32 ------
> 2>C:\Users\matthep\Documents\Code\apr\apr-util\dbd\apr_dbd_oracle.vcxproj(85,5):
> warning MSB4011:
> "C:\Users\matthep\AppData\Local\Microsoft\MSBuild\v4.0\Microsoft.Cpp.Win32.user.props"
> cannot be imported again. It was already imported at
> "C:\Users\matthep\Documents\Code\apr\apr-util\dbd\apr_dbd_oracle.vcxproj
> (75,5)". This is most likely a build authoring error. This subsequent import
> will be ignored.
> 9>C:\Users\matthep\Documents\Code\apr\apr-util\dbd\apr_dbd_oracle.vcxproj(85,5):
> warning MSB4011:
> "C:\Users\matthep\AppData\Local\Microsoft\MSBuild\v4.0\Microsoft.Cpp.Win32.user.props"
> cannot be imported again. It was already imported at
> "C:\Users\matthep\Documents\Code\apr\apr-util\dbd\apr_dbd_oracle.vcxproj
> (75,5)". This is most likely a build authoring error. This subsequent import
> will be ignored.
> 5>C:\Users\matthep\Documents\Code\apr\apr-util\build\preaprutil.vcxproj(86,5):
> warning MSB4011:
> "C:\Users\matthep\AppData\Local\Microsoft\MSBuild\v4.0\Microsoft.Cpp.Win32.user.props"
> cannot be imported again. It was already imported at
> "C:\Users\matthep\Documents\Code\apr\apr-util\build\preaprutil.vcxproj
> (79,5)". This is most likely a build authoring error. This subsequent import
> will be ignored.
> 5>C:\Users\matthep\Documents\Code\apr\apr-util\dbd\apr_dbd_freetds.vcxproj(81,5):
> warning MSB4011:
> "C:\Users\matthep\AppData\Local\Microsoft\MSBuild\v4.0\Microsoft.Cpp.Win32.user.props"
> cannot be imported again. It was already imported at
> "C:\Users\matthep\Documents\Code\apr\apr-util\dbd\apr_dbd_freetds.vcxproj
> (75,5)". This is most likely a build authoring error. This subsequent import
> will be ignored.
> 5>FileTracker : error FTK1011: could not create the new file tracking log
> file:
> C:\Users\matthep\Documents\Code\apr\apr-util\crypto\Release\CL.read.1.tlog.
> The file exists.
> 5>
> 11>------ Build started: Project: apr_dbd_sqlite2, Configuration: Release
> Win32 ------
> 5>
> 5>
> 3>  apr_buckets.c
> 2>C:\Users\matthep\Documents\Code\apr\apr-util\dbd\apr_dbd_pgsql.vcxproj(85,5):
> warning MSB4011:
> "C:\Users\matthep\AppData\Local\Microsoft\MSBuild\v4.0\Microsoft.Cpp.Win32.user.props"
> cannot be imported again. It was already imported at
> "C:\Users\matthep\Documents\Code\apr\apr-util\dbd\apr_dbd_pgsql.vcxproj
> (75,5)". This is most likely a build authoring error. This subsequent import
> will be ignored.
> 9>C:\Users\matthep\Documents\Code\apr\apr-util\dbd\apr_dbd_pgsql.vcxproj(85,5):
> warning MSB4011:
> "C:\Users\matthep\AppData\Local\Microsoft\MSBuild\v4.0\Microsoft.Cpp.Win32.user.props"
> cannot be imported again. It was already imported at
> "C:\Users\matthep\Documents\Code\apr\apr-util\dbd\apr_dbd_pgsql.vcxproj
> (75,5)". This is most likely a build authoring error. This subsequent import
> will be ignored.
> 10>C:\Users\matthep\Documents\Code\apr\apr-util\dbd\apr_dbd_pgsql.vcxproj(85,5):
> warning MSB4011:
> "C:\Users\matthep\AppData\Local\Microsoft\MSBuild\v4.0\Microsoft.Cpp.Win32.user.props"
> cannot be imported again. It was already imported at
> "C:\Users\matthep\Documents\Code\apr\apr-util\dbd\apr_dbd_pgsql.vcxproj
> (75,5)". This is most likely a build authoring error. This subsequent import
> will be ignored.
> 11>C:\Users\matthep\Documents\Code\apr\apr-util\dbd\apr_dbd_pgsql.vcxproj(85,5):
> warning MSB4011:
> "C:\Users\matthep\AppData\Local\Microsoft\MSBuild\v4.0\Microsoft.Cpp.Win32.user.props"
> cannot be imported again. It was already imported at
> "C:\Users\matthep\Documents\Code\apr\apr-util\dbd\apr_dbd_pgsql.vcxproj
> (75,5)". This is most likely a build authoring error. This subsequent import
> will be ignored.
> 11>C:\Users\matthep\Documents\Code\apr\apr-util\dbd\apr_dbd_sqlite2.vcxproj(85,5):
> warning MSB4011:
> "C:\Users\matthep\AppData\Local\Microsoft\MSBuild\v4.0\Microsoft.Cpp.Win32.user.props"
> cannot be imported again. It was already imported at
> "C:\Users\matthep\Documents\Code\apr\apr-util\dbd\apr_dbd_sqlite2.vcxproj
> (82,5)". This is most likely a build authoring error. This subsequent import
> will be ignored.
> 9>  apr_dbd_oracle.c
> 2>C:\Users\matthep\Documents\Code\apr\apr-util\dbd\apr_dbd_sqlite2.vcxproj(85,5):
> warning MSB4011:
> "C:\Users\matthep\AppData\Local\Microsoft\MSBuild\v4.0\Microsoft.Cpp.Win32.user.props"
> cannot be imported again. It was already imported at
> "C:\Users\matthep\Documents\Code\apr\apr-util\dbd\apr_dbd_sqlite2.vcxproj
> (82,5)". This is most likely a build authoring error. This subsequent import
> will be ignored.
> 10>C:\Users\matthep\Documents\Code\apr\apr-util\dbd\apr_dbd_sqlite2.vcxproj(85,5):
> warning MSB4011:
> "C:\Users\matthep\AppData\Local\Microsoft\MSBuild\v4.0\Microsoft.Cpp.Win32.user.props"
> cannot be imported again. It was already imported at
> "C:\Users\matthep\Documents\Code\apr\apr-util\dbd\apr_dbd_sqlite2.vcxproj
> (82,5)". This is most likely a build authoring error. This subsequent import
> will be ignored.
> 9>C:\Users\matthep\Documents\Code\apr\apr-util\dbd\apr_dbd_sqlite2.vcxproj(85,5):
> warning MSB4011:
> "C:\Users\matthep\AppData\Local\Microsoft\MSBuild\v4.0\Microsoft.Cpp.Win32.user.props"
> cannot be imported again. It was already imported at
> "C:\Users\matthep\Documents\Code\apr\apr-util\dbd\apr_dbd_sqlite2.vcxproj
> (82,5)". This is most likely a build authoring error. This subsequent import
> will be ignored.
> 9>apr_dbd_oracle.c(60): fatal error C1083: Cannot open include file:
> 'oci.h': No such file or directory
> 10>  apr_dbd_pgsql.c
> 12>------ Build started: Project: apr_dbd_sqlite3, Configuration: Release
> Win32 ------
> 3>C:\Users\matthep\Documents\Code\apr\apr-util\dbd\apr_dbd_oracle.vcxproj(85,5):
> warning MSB4011:
> "C:\Users\matthep\AppData\Local\Microsoft\MSBuild\v4.0\Microsoft.Cpp.Win32.user.props"
> cannot be imported again. It was already imported at
> "C:\Users\matthep\Documents\Code\apr\apr-util\dbd\apr_dbd_oracle.vcxproj
> (75,5)". This is most likely a build authoring error. This subsequent import
> will be ignored.
> 3>C:\Users\matthep\Documents\Code\apr\apr-util\dbd\apr_dbd_pgsql.vcxproj(85,5):
> warning MSB4011:
> "C:\Users\matthep\AppData\Local\Microsoft\MSBuild\v4.0\Microsoft.Cpp.Win32.user.props"
> cannot be imported again. It was already imported at
> "C:\Users\matthep\Documents\Code\apr\apr-util\dbd\apr_dbd_pgsql.vcxproj
> (75,5)". This is most likely a build authoring error. This subsequent import
> will be ignored.
> 3>C:\Users\matthep\Documents\Code\apr\apr-util\dbd\apr_dbd_sqlite2.vcxproj(85,5):
> warning MSB4011:
> "C:\Users\matthep\AppData\Local\Microsoft\MSBuild\v4.0\Microsoft.Cpp.Win32.user.props"
> cannot be imported again. It was already imported at
> "C:\Users\matthep\Documents\Code\apr\apr-util\dbd\apr_dbd_sqlite2.vcxproj
> (82,5)". This is most likely a build authoring error. This subsequent import
> will be ignored.
> 11>  apr_dbd_sqlite2.c
> 10>apr_dbd_pgsql.c(27): fatal error C1083: Cannot open include file:
> 'libpq-fe.h': No such file or directory
> 3>  apr_buckets_alloc.c
> 13>------ Build started: Project: apr_dbm_db, Configuration: Release Win32
> ------
> 2>C:\Users\matthep\Documents\Code\apr\apr-util\dbd\apr_dbd_sqlite3.vcxproj(85,5):
> warning MSB4011:
> "C:\Users\matthep\AppData\Local\Microsoft\MSBuild\v4.0\Microsoft.Cpp.Win32.user.props"
> cannot be imported again. It was already imported at
> "C:\Users\matthep\Documents\Code\apr\apr-util\dbd\apr_dbd_sqlite3.vcxproj
> (82,5)". This is most likely a build authoring error. This subsequent import
> will be ignored.
> 10>C:\Users\matthep\Documents\Code\apr\apr-util\dbd\apr_dbd_sqlite3.vcxproj(85,5):
> warning MSB4011:
> "C:\Users\matthep\AppData\Local\Microsoft\MSBuild\v4.0\Microsoft.Cpp.Win32.user.props"
> cannot be imported again. It was already imported at
> "C:\Users\matthep\Documents\Code\apr\apr-util\dbd\apr_dbd_sqlite3.vcxproj
> (82,5)". This is most likely a build authoring error. This subsequent import
> will be ignored.
> 12>C:\Users\matthep\Documents\Code\apr\apr-util\dbd\apr_dbd_sqlite3.vcxproj(85,5):
> warning MSB4011:
> "C:\Users\matthep\AppData\Local\Microsoft\MSBuild\v4.0\Microsoft.Cpp.Win32.user.props"
> cannot be imported again. It was already imported at
> "C:\Users\matthep\Documents\Code\apr\apr-util\dbd\apr_dbd_sqlite3.vcxproj
> (82,5)". This is most likely a build authoring error. This subsequent import
> will be ignored.
> 2>  buffer.c
> 3>C:\Users\matthep\Documents\Code\apr\apr-util\dbd\apr_dbd_sqlite3.vcxproj(85,5):
> warning MSB4011:
> "C:\Users\matthep\AppData\Local\Microsoft\MSBuild\v4.0\Microsoft.Cpp.Win32.user.props"
> cannot be imported again. It was already imported at
> "C:\Users\matthep\Documents\Code\apr\apr-util\dbd\apr_dbd_sqlite3.vcxproj
> (82,5)". This is most likely a build authoring error. This subsequent import
> will be ignored.
> 2>C:\Users\matthep\Documents\Code\apr\apr-util\dbm\apr_dbm_db.vcxproj(78,5):
> warning MSB4011:
> "C:\Users\matthep\AppData\Local\Microsoft\MSBuild\v4.0\Microsoft.Cpp.Win32.user.props"
> cannot be imported again. It was already imported at
> "C:\Users\matthep\Documents\Code\apr\apr-util\dbm\apr_dbm_db.vcxproj
> (75,5)". This is most likely a build authoring error. This subsequent import
> will be ignored.
> 3>C:\Users\matthep\Documents\Code\apr\apr-util\dbm\apr_dbm_db.vcxproj(78,5):
> warning MSB4011:
> "C:\Users\matthep\AppData\Local\Microsoft\MSBuild\v4.0\Microsoft.Cpp.Win32.user.props"
> cannot be imported again. It was already imported at
> "C:\Users\matthep\Documents\Code\apr\apr-util\dbm\apr_dbm_db.vcxproj
> (75,5)". This is most likely a build authoring error. This subsequent import
> will be ignored.
> 10>C:\Users\matthep\Documents\Code\apr\apr-util\dbm\apr_dbm_db.vcxproj(78,5):
> warning MSB4011:
> "C:\Users\matthep\AppData\Local\Microsoft\MSBuild\v4.0\Microsoft.Cpp.Win32.user.props"
> cannot be imported again. It was already imported at
> "C:\Users\matthep\Documents\Code\apr\apr-util\dbm\apr_dbm_db.vcxproj
> (75,5)". This is most likely a build authoring error. This subsequent import
> will be ignored.
> 12>C:\Users\matthep\Documents\Code\apr\apr-util\dbm\apr_dbm_db.vcxproj(78,5):
> warning MSB4011:
> "C:\Users\matthep\AppData\Local\Microsoft\MSBuild\v4.0\Microsoft.Cpp.Win32.user.props"
> cannot be imported again. It was already imported at
> "C:\Users\matthep\Documents\Code\apr\apr-util\dbm\apr_dbm_db.vcxproj
> (75,5)". This is most likely a build authoring error. This subsequent import
> will be ignored.
> 13>C:\Users\matthep\Documents\Code\apr\apr-util\dbm\apr_dbm_db.vcxproj(78,5):
> warning MSB4011:
> "C:\Users\matthep\AppData\Local\Microsoft\MSBuild\v4.0\Microsoft.Cpp.Win32.user.props"
> cannot be imported again. It was already imported at
> "C:\Users\matthep\Documents\Code\apr\apr-util\dbm\apr_dbm_db.vcxproj
> (75,5)". This is most likely a build authoring error. This subsequent import
> will be ignored.
> 14>------ Build started: Project: apr_dbm_gdbm, Configuration: Release Win32
> ------
> 12>  apr_dbd_sqlite3.c
> 11>C:\Users\matthep\Documents\Code\apr\apr-util\dbd\apr_dbd_sqlite3.vcxproj(85,5):
> warning MSB4011:
> "C:\Users\matthep\AppData\Local\Microsoft\MSBuild\v4.0\Microsoft.Cpp.Win32.user.props"
> cannot be imported again. It was already imported at
> "C:\Users\matthep\Documents\Code\apr\apr-util\dbd\apr_dbd_sqlite3.vcxproj
> (82,5)". This is most likely a build authoring error. This subsequent import
> will be ignored.
> 11>apr_dbd_sqlite2.c(24): fatal error C1083: Cannot open include file:
> 'sqlite.h': No such file or directory
> 11>C:\Users\matthep\Documents\Code\apr\apr-util\dbm\apr_dbm_db.vcxproj(78,5):
> warning MSB4011:
> "C:\Users\matthep\AppData\Local\Microsoft\MSBuild\v4.0\Microsoft.Cpp.Win32.user.props"
> cannot be imported again. It was already imported at
> "C:\Users\matthep\Documents\Code\apr\apr-util\dbm\apr_dbm_db.vcxproj
> (75,5)". This is most likely a build authoring error. This subsequent import
> will be ignored.
> 12>apr_dbd_sqlite3.c(24): fatal error C1083: Cannot open include file:
> 'sqlite3.h': No such file or directory
> 13>  apr_dbm_berkeleydb.c
> 15>------ Build started: Project: apr_ldap, Configuration: Release Win32
> ------
> 1>  dso.c
> 1>C:\Users\matthep\Documents\Code\apr\apr-util\dbd\apr_dbd_oracle.vcxproj(85,5):
> warning MSB4011:
> "C:\Users\matthep\AppData\Local\Microsoft\MSBuild\v4.0\Microsoft.Cpp.Win32.user.props"
> cannot be imported again. It was already imported at
> "C:\Users\matthep\Documents\Code\apr\apr-util\dbd\apr_dbd_oracle.vcxproj
> (75,5)". This is most likely a build authoring error. This subsequent import
> will be ignored.
> 1>C:\Users\matthep\Documents\Code\apr\apr-util\dbd\apr_dbd_pgsql.vcxproj(85,5):
> warning MSB4011:
> "C:\Users\matthep\AppData\Local\Microsoft\MSBuild\v4.0\Microsoft.Cpp.Win32.user.props"
> cannot be imported again. It was already imported at
> "C:\Users\matthep\Documents\Code\apr\apr-util\dbd\apr_dbd_pgsql.vcxproj
> (75,5)". This is most likely a build authoring error. This subsequent import
> will be ignored.
> 1>C:\Users\matthep\Documents\Code\apr\apr-util\dbd\apr_dbd_sqlite2.vcxproj(85,5):
> warning MSB4011:
> "C:\Users\matthep\AppData\Local\Microsoft\MSBuild\v4.0\Microsoft.Cpp.Win32.user.props"
> cannot be imported again. It was already imported at
> "C:\Users\matthep\Documents\Code\apr\apr-util\dbd\apr_dbd_sqlite2.vcxproj
> (82,5)". This is most likely a build authoring error. This subsequent import
> will be ignored.
> 1>  buffer.c
> 2>C:\Users\matthep\Documents\Code\apr\apr-util\dbm\apr_dbm_gdbm.vcxproj(78,5):
> warning MSB4011:
> "C:\Users\matthep\AppData\Local\Microsoft\MSBuild\v4.0\Microsoft.Cpp.Win32.user.props"
> cannot be imported again. It was already imported at
> "C:\Users\matthep\Documents\Code\apr\apr-util\dbm\apr_dbm_gdbm.vcxproj
> (75,5)". This is most likely a build authoring error. This subsequent import
> will be ignored.
> 3>C:\Users\matthep\Documents\Code\apr\apr-util\dbm\apr_dbm_gdbm.vcxproj(78,5):
> warning MSB4011:
> "C:\Users\matthep\AppData\Local\Microsoft\MSBuild\v4.0\Microsoft.Cpp.Win32.user.props"
> cannot be imported again. It was already imported at
> "C:\Users\matthep\Documents\Code\apr\apr-util\dbm\apr_dbm_gdbm.vcxproj
> (75,5)". This is most likely a build authoring error. This subsequent import
> will be ignored.
> 12>C:\Users\matthep\Documents\Code\apr\apr-util\dbm\apr_dbm_gdbm.vcxproj(78,5):
> warning MSB4011:
> "C:\Users\matthep\AppData\Local\Microsoft\MSBuild\v4.0\Microsoft.Cpp.Win32.user.props"
> cannot be imported again. It was already imported at
> "C:\Users\matthep\Documents\Code\apr\apr-util\dbm\apr_dbm_gdbm.vcxproj
> (75,5)". This is most likely a build authoring error. This subsequent import
> will be ignored.
> 13>C:\Users\matthep\Documents\Code\apr\apr-util\dbm\apr_dbm_gdbm.vcxproj(78,5):
> warning MSB4011:
> "C:\Users\matthep\AppData\Local\Microsoft\MSBuild\v4.0\Microsoft.Cpp.Win32.user.props"
> cannot be imported again. It was already imported at
> "C:\Users\matthep\Documents\Code\apr\apr-util\dbm\apr_dbm_gdbm.vcxproj
> (75,5)". This is most likely a build authoring error. This subsequent import
> will be ignored.
> 14>C:\Users\matthep\Documents\Code\apr\apr-util\dbm\apr_dbm_gdbm.vcxproj(78,5):
> warning MSB4011:
> "C:\Users\matthep\AppData\Local\Microsoft\MSBuild\v4.0\Microsoft.Cpp.Win32.user.props"
> cannot be imported again. It was already imported at
> "C:\Users\matthep\Documents\Code\apr\apr-util\dbm\apr_dbm_gdbm.vcxproj
> (75,5)". This is most likely a build authoring error. This subsequent import
> will be ignored.
> 14>  apr_dbm_gdbm.c
> 2>C:\Users\matthep\Documents\Code\apr\apr-util\ldap\apr_ldap.vcxproj(85,5):
> warning MSB4011:
> "C:\Users\matthep\AppData\Local\Microsoft\MSBuild\v4.0\Microsoft.Cpp.Win32.user.props"
> cannot be imported again. It was already imported at
> "C:\Users\matthep\Documents\Code\apr\apr-util\ldap\apr_ldap.vcxproj (78,5)".
> This is most likely a build authoring error. This subsequent import will be
> ignored.
> 3>C:\Users\matthep\Documents\Code\apr\apr-util\ldap\apr_ldap.vcxproj(85,5):
> warning MSB4011:
> "C:\Users\matthep\AppData\Local\Microsoft\MSBuild\v4.0\Microsoft.Cpp.Win32.user.props"
> cannot be imported again. It was already imported at
> "C:\Users\matthep\Documents\Code\apr\apr-util\ldap\apr_ldap.vcxproj (78,5)".
> This is most likely a build authoring error. This subsequent import will be
> ignored.
> 13>C:\Users\matthep\Documents\Code\apr\apr-util\ldap\apr_ldap.vcxproj(85,5):
> warning MSB4011:
> "C:\Users\matthep\AppData\Local\Microsoft\MSBuild\v4.0\Microsoft.Cpp.Win32.user.props"
> cannot be imported again. It was already imported at
> "C:\Users\matthep\Documents\Code\apr\apr-util\ldap\apr_ldap.vcxproj (78,5)".
> This is most likely a build authoring error. This subsequent import will be
> ignored.
> 15>C:\Users\matthep\Documents\Code\apr\apr-util\ldap\apr_ldap.vcxproj(85,5):
> warning MSB4011:
> "C:\Users\matthep\AppData\Local\Microsoft\MSBuild\v4.0\Microsoft.Cpp.Win32.user.props"
> cannot be imported again. It was already imported at
> "C:\Users\matthep\Documents\Code\apr\apr-util\ldap\apr_ldap.vcxproj (78,5)".
> This is most likely a build authoring error. This subsequent import will be
> ignored.
> 3>  apr_buckets_eos.c
> 14>C:\Users\matthep\Documents\Code\apr\apr-util\ldap\apr_ldap.vcxproj(85,5):
> warning MSB4011:
> "C:\Users\matthep\AppData\Local\Microsoft\MSBuild\v4.0\Microsoft.Cpp.Win32.user.props"
> cannot be imported again. It was already imported at
> "C:\Users\matthep\Documents\Code\apr\apr-util\ldap\apr_ldap.vcxproj (78,5)".
> This is most likely a build authoring error. This subsequent import will be
> ignored.
> 16>------ Build started: Project: aprutil, Configuration: Release Win32
> ------
> 1>C:\Users\matthep\Documents\Code\apr\apr-util\dbd\apr_dbd_sqlite3.vcxproj(85,5):
> warning MSB4011:
> "C:\Users\matthep\AppData\Local\Microsoft\MSBuild\v4.0\Microsoft.Cpp.Win32.user.props"
> cannot be imported again. It was already imported at
> "C:\Users\matthep\Documents\Code\apr\apr-util\dbd\apr_dbd_sqlite3.vcxproj
> (82,5)". This is most likely a build authoring error. This subsequent import
> will be ignored.
> 1>C:\Users\matthep\Documents\Code\apr\apr-util\dbm\apr_dbm_db.vcxproj(78,5):
> warning MSB4011:
> "C:\Users\matthep\AppData\Local\Microsoft\MSBuild\v4.0\Microsoft.Cpp.Win32.user.props"
> cannot be imported again. It was already imported at
> "C:\Users\matthep\Documents\Code\apr\apr-util\dbm\apr_dbm_db.vcxproj
> (75,5)". This is most likely a build authoring error. This subsequent import
> will be ignored.
> 15>  apr_ldap_init.c
> 2>  copy.c
> 1>C:\Users\matthep\Documents\Code\apr\apr-util\dbm\apr_dbm_gdbm.vcxproj(78,5):
> warning MSB4011:
> "C:\Users\matthep\AppData\Local\Microsoft\MSBuild\v4.0\Microsoft.Cpp.Win32.user.props"
> cannot be imported again. It was already imported at
> "C:\Users\matthep\Documents\Code\apr\apr-util\dbm\apr_dbm_gdbm.vcxproj
> (75,5)". This is most likely a build authoring error. This subsequent import
> will be ignored.
> 1>  copy.c
> 1>C:\Users\matthep\Documents\Code\apr\apr-util\ldap\apr_ldap.vcxproj(85,5):
> warning MSB4011:
> "C:\Users\matthep\AppData\Local\Microsoft\MSBuild\v4.0\Microsoft.Cpp.Win32.user.props"
> cannot be imported again. It was already imported at
> "C:\Users\matthep\Documents\Code\apr\apr-util\ldap\apr_ldap.vcxproj (78,5)".
> This is most likely a build authoring error. This subsequent import will be
> ignored.
> 1>C:\Users\matthep\Documents\Code\apr\apr-util\aprutil.vcxproj(81,5):
> warning MSB4011:
> "C:\Users\matthep\AppData\Local\Microsoft\MSBuild\v4.0\Microsoft.Cpp.Win32.user.props"
> cannot be imported again. It was already imported at
> "C:\Users\matthep\Documents\Code\apr\apr-util\aprutil.vcxproj (75,5)". This
> is most likely a build authoring error. This subsequent import will be
> ignored.
> 3>C:\Users\matthep\Documents\Code\apr\apr-util\aprutil.vcxproj(81,5):
> warning MSB4011:
> "C:\Users\matthep\AppData\Local\Microsoft\MSBuild\v4.0\Microsoft.Cpp.Win32.user.props"
> cannot be imported again. It was already imported at
> "C:\Users\matthep\Documents\Code\apr\apr-util\aprutil.vcxproj (75,5)". This
> is most likely a build authoring error. This subsequent import will be
> ignored.
> 13>C:\Users\matthep\Documents\Code\apr\apr-util\aprutil.vcxproj(81,5):
> warning MSB4011:
> "C:\Users\matthep\AppData\Local\Microsoft\MSBuild\v4.0\Microsoft.Cpp.Win32.user.props"
> cannot be imported again. It was already imported at
> "C:\Users\matthep\Documents\Code\apr\apr-util\aprutil.vcxproj (75,5)". This
> is most likely a build authoring error. This subsequent import will be
> ignored.
> 13>C:\Users\matthep\Documents\Code\apr\apr-util\include\apu_want.h(46):
> fatal error C1083: Cannot open include file: 'db.h': No such file or
> directory
> 14>C:\Users\matthep\Documents\Code\apr\apr-util\aprutil.vcxproj(81,5):
> warning MSB4011:
> "C:\Users\matthep\AppData\Local\Microsoft\MSBuild\v4.0\Microsoft.Cpp.Win32.user.props"
> cannot be imported again. It was already imported at
> "C:\Users\matthep\Documents\Code\apr\apr-util\aprutil.vcxproj (75,5)". This
> is most likely a build authoring error. This subsequent import will be
> ignored.
> 16>C:\Users\matthep\Documents\Code\apr\apr-util\aprutil.vcxproj(81,5):
> warning MSB4011:
> "C:\Users\matthep\AppData\Local\Microsoft\MSBuild\v4.0\Microsoft.Cpp.Win32.user.props"
> cannot be imported again. It was already imported at
> "C:\Users\matthep\Documents\Code\apr\apr-util\aprutil.vcxproj (75,5)". This
> is most likely a build authoring error. This subsequent import will be
> ignored.
> 16>C:\Program Files
> (x86)\MSBuild\Microsoft.Cpp\v4.0\V110\Microsoft.CppCommon.targets(177,5):
> warning MSB8018: No outputs specified for item "include\apr_ldap.hw". Its
> custom build command will be skipped.
> 16>C:\Program Files
> (x86)\MSBuild\Microsoft.Cpp\v4.0\V110\Microsoft.CppCommon.targets(177,5):
> warning MSB8018: No outputs specified for item "include\apu.hw". Its custom
> build command will be skipped.
> 16>C:\Program Files
> (x86)\MSBuild\Microsoft.Cpp\v4.0\V110\Microsoft.CppCommon.targets(177,5):
> warning MSB8018: No outputs specified for item
> "include\private\apu_config.hw". Its custom build command will be skipped.
> 16>C:\Program Files
> (x86)\MSBuild\Microsoft.Cpp\v4.0\V110\Microsoft.CppCommon.targets(177,5):
> warning MSB8018: No outputs specified for item
> "include\private\apu_select_dbm.hw". Its custom build command will be
> skipped.
> 16>C:\Program Files
> (x86)\MSBuild\Microsoft.Cpp\v4.0\V110\Microsoft.CppCommon.targets(177,5):
> warning MSB8018: No outputs specified for item "include\apu_want.hw". Its
> custom build command will be skipped.
> 14>apr_dbm_gdbm.c(28): fatal error C1083: Cannot open include file:
> 'gdbm.h': No such file or directory
> 17>------ Build started: Project: xml, Configuration: Release Win32 ------
> 2>C:\Users\matthep\Documents\Code\apr\apr-util\aprutil.vcxproj(81,5):
> warning MSB4011:
> "C:\Users\matthep\AppData\Local\Microsoft\MSBuild\v4.0\Microsoft.Cpp.Win32.user.props"
> cannot be imported again. It was already imported at
> "C:\Users\matthep\Documents\Code\apr\apr-util\aprutil.vcxproj (75,5)". This
> is most likely a build authoring error. This subsequent import will be
> ignored.
> 1>  dir.c
> 15>C:\Users\matthep\Documents\Code\apr\apr-util\aprutil.vcxproj(81,5):
> warning MSB4011:
> "C:\Users\matthep\AppData\Local\Microsoft\MSBuild\v4.0\Microsoft.Cpp.Win32.user.props"
> cannot be imported again. It was already imported at
> "C:\Users\matthep\Documents\Code\apr\apr-util\aprutil.vcxproj (75,5)". This
> is most likely a build authoring error. This subsequent import will be
> ignored.
> 1>C:\Users\matthep\Documents\Code\apr\apr-util\xml\expat\lib\xml.vcxproj(85,5):
> warning MSB4011:
> "C:\Users\matthep\AppData\Local\Microsoft\MSBuild\v4.0\Microsoft.Cpp.Win32.user.props"
> cannot be imported again. It was already imported at
> "C:\Users\matthep\Documents\Code\apr\apr-util\xml\expat\lib\xml.vcxproj
> (79,5)". This is most likely a build authoring error. This subsequent import
> will be ignored.
> 2>C:\Users\matthep\Documents\Code\apr\apr-util\xml\expat\lib\xml.vcxproj(85,5):
> warning MSB4011:
> "C:\Users\matthep\AppData\Local\Microsoft\MSBuild\v4.0\Microsoft.Cpp.Win32.user.props"
> cannot be imported again. It was already imported at
> "C:\Users\matthep\Documents\Code\apr\apr-util\xml\expat\lib\xml.vcxproj
> (79,5)". This is most likely a build authoring error. This subsequent import
> will be ignored.
> 3>C:\Users\matthep\Documents\Code\apr\apr-util\xml\expat\lib\xml.vcxproj(85,5):
> warning MSB4011:
> "C:\Users\matthep\AppData\Local\Microsoft\MSBuild\v4.0\Microsoft.Cpp.Win32.user.props"
> cannot be imported again. It was already imported at
> "C:\Users\matthep\Documents\Code\apr\apr-util\xml\expat\lib\xml.vcxproj
> (79,5)". This is most likely a build authoring error. This subsequent import
> will be ignored.
> 3>  apr_buckets_file.c
> 14>C:\Users\matthep\Documents\Code\apr\apr-util\xml\expat\lib\xml.vcxproj(85,5):
> warning MSB4011:
> "C:\Users\matthep\AppData\Local\Microsoft\MSBuild\v4.0\Microsoft.Cpp.Win32.user.props"
> cannot be imported again. It was already imported at
> "C:\Users\matthep\Documents\Code\apr\apr-util\xml\expat\lib\xml.vcxproj
> (79,5)". This is most likely a build authoring error. This subsequent import
> will be ignored.
> 15>C:\Users\matthep\Documents\Code\apr\apr-util\xml\expat\lib\xml.vcxproj(85,5):
> warning MSB4011:
> "C:\Users\matthep\AppData\Local\Microsoft\MSBuild\v4.0\Microsoft.Cpp.Win32.user.props"
> cannot be imported again. It was already imported at
> "C:\Users\matthep\Documents\Code\apr\apr-util\xml\expat\lib\xml.vcxproj
> (79,5)". This is most likely a build authoring error. This subsequent import
> will be ignored.
> 16>C:\Users\matthep\Documents\Code\apr\apr-util\xml\expat\lib\xml.vcxproj(85,5):
> warning MSB4011:
> "C:\Users\matthep\AppData\Local\Microsoft\MSBuild\v4.0\Microsoft.Cpp.Win32.user.props"
> cannot be imported again. It was already imported at
> "C:\Users\matthep\Documents\Code\apr\apr-util\xml\expat\lib\xml.vcxproj
> (79,5)". This is most likely a build authoring error. This subsequent import
> will be ignored.
> 16>  apr_brigade.c
> 17>C:\Users\matthep\Documents\Code\apr\apr-util\xml\expat\lib\xml.vcxproj(85,5):
> warning MSB4011:
> "C:\Users\matthep\AppData\Local\Microsoft\MSBuild\v4.0\Microsoft.Cpp.Win32.user.props"
> cannot be imported again. It was already imported at
> "C:\Users\matthep\Documents\Code\apr\apr-util\xml\expat\lib\xml.vcxproj
> (79,5)". This is most likely a build authoring error. This subsequent import
> will be ignored.
> 17>  xmlparse.c
> 15>  apr_ldap_option.c
> 2>  dir.c
> 1>  fileacc.c
> 3>  apr_buckets_flush.c
> 16>  apr_buckets.c
> 17>  xmlrole.c
> 15>  apr_ldap_rebind.c
> 2>  fileacc.c
> 3>  apr_buckets_heap.c
> 16>  apr_buckets_alloc.c
> 1>  filedup.c
> 17>  xmltok.c
> 15>  Generating Code...
> 2>  filedup.c
> 3>  apr_buckets_mmap.c
> 16>  apr_buckets_eos.c
> 17>  Generating Code...
> 15>     Creating library Release\apr_ldap-1.lib and object
> Release\apr_ldap-1.exp
> 1>  filepath.c
> 2>  filepath.c
> 3>  apr_buckets_pipe.c
> 15>apr_ldap_init.obj : error LNK2019: unresolved external symbol
> __imp__apr_palloc@8 referenced in function _apr__ldap_ssl_init
> 16>  apr_buckets_file.c
> 15>apr_ldap_option.obj : error LNK2001: unresolved external symbol
> __imp__apr_palloc@8
> 15>apr_ldap_rebind.obj : error LNK2001: unresolved external symbol
> __imp__apr_palloc@8
> 15>apr_ldap_option.obj : error LNK2019: unresolved external symbol
> __imp__apr_pstrdup@8 referenced in function _apr__ldap_get_option
> 15>apr_ldap_rebind.obj : error LNK2001: unresolved external symbol
> __imp__apr_pstrdup@8
> 15>apr_ldap_rebind.obj : error LNK2019: unresolved external symbol
> __imp__apr_thread_mutex_create@12 referenced in function
> _apr__ldap_rebind_init
> 15>apr_ldap_rebind.obj : error LNK2019: unresolved external symbol
> __imp__apr_thread_mutex_lock@4 referenced in function _apr__ldap_rebind_add
> 15>apr_ldap_rebind.obj : error LNK2019: unresolved external symbol
> __imp__apr_thread_mutex_unlock@4 referenced in function
> _apr__ldap_rebind_add
> 15>apr_ldap_rebind.obj : error LNK2019: unresolved external symbol
> __imp__apr_pool_cleanup_register@16 referenced in function
> _apr__ldap_rebind_init
> 15>apr_ldap_rebind.obj : error LNK2019: unresolved external symbol
> __imp__apr_pool_cleanup_kill@12 referenced in function
> _apr__ldap_rebind_remove
> 15>apr_ldap_rebind.obj : error LNK2019: unresolved external symbol
> __imp__apr_pool_cleanup_null referenced in function _apr__ldap_rebind_init
> 15>Release\apr_ldap-1.dll : fatal error LNK1120: 8 unresolved externals
> 1>  filepath_util.c
> 3>  apr_buckets_pool.c
> 16>  apr_buckets_flush.c
> 2>  filepath_util.c
> 1>  filestat.c
> 17>  xml.vcxproj ->
> C:\Users\matthep\Documents\Code\apr\apr-util\xml\expat\lib\LibR\xml.lib
> 3>  apr_buckets_refcount.c
> 16>  apr_buckets_heap.c
> 2>  filestat.c
> 1>  filesys.c
> 3>  apr_buckets_simple.c
> 16>  apr_buckets_mmap.c
> 2>  filesys.c
> 1>  flock.c
> 3>  apr_buckets_socket.c
> 16>  apr_buckets_pipe.c
> 2>  flock.c
> 1>  fullrw.c
> 3>  apr_crypto.c
> 16>  apr_buckets_pool.c
> 2>  fullrw.c
> 1>  mktemp.c
> 3>  apr_md4.c
> 16>  apr_buckets_refcount.c
> 2>  mktemp.c
> 3>  apr_md5.c
> 1>  open.c
> 16>  apr_buckets_simple.c
> 3>  apr_sha1.c
> 2>  open.c
> 16>  apr_buckets_socket.c
> 1>  pipe.c
> 3>  getuuid.c
> 16>  apr_crypto.c
> 2>  pipe.c
> 1>  readwrite.c
> 3>  uuid.c
> 16>  apr_md4.c
> 2>  readwrite.c
> 1>  seek.c
> 3>  apr_dbd.c
> 16>  apr_md5.c
> 2>  seek.c
> 3>  Generating Code...
> 1>  tempdir.c
> 16>  apr_sha1.c
> 2>  tempdir.c
> 1>  proc_mutex.c
> 16>  getuuid.c
> 3>  Compiling...
> 3>  apr_dbm.c
> 2>  proc_mutex.c
> 1>  Generating Code...
> 16>  uuid.c
> 3>  apr_dbm_sdbm.c
> 2>  Generating Code...
> 16>  apr_dbd.c
> 3>  apr_base64.c
> 1>  Compiling...
> 1>  thread_cond.c
> 16>  Generating Code...
> 3>  apr_hooks.c
> 2>  Compiling...
> 2>  thread_cond.c
> 1>  thread_mutex.c
> 3>  apr_ldap_stub.c
> 2>  thread_mutex.c
> 16>  Compiling...
> 16>  apr_dbd_freetds.c
> 16>  apr_dbd_mysql.c
> 16>  apr_dbd_odbc.c
> 1>  thread_rwlock.c
> 3>  apr_ldap_url.c
> 2>  thread_rwlock.c
> 1>  apr_pools.c
> 16>  apr_dbd_oracle.c
> 16>  apr_dbd_pgsql.c
> 16>  apr_dbd_sqlite2.c
> 16>  apr_dbd_sqlite3.c
> 16>  apr_dbm.c
> 3>  apr_memcache.c
> 2>  apr_pools.c
> 1>  charset.c
> 16>  apr_dbm_berkeleydb.c
> 3>  apr_date.c
> 2>  charset.c
> 1>  env.c
> 16>  apr_dbm_gdbm.c
> 3>  apu_dso.c
> 2>  env.c
> 1>  errorcodes.c
> 16>  apr_dbm_sdbm.c
> 3>  apr_queue.c
> 2>  errorcodes.c
> 1>  getopt.c
> 16>  apr_base64.c
> 3>  apr_reslist.c
> 16>  apr_hooks.c
> 2>  getopt.c
> 1>  internal.c
> 3>  apr_rmm.c
> 16>  apr_ldap_init.c
> 2>  internal.c
> 1>  misc.c
> 3>  apr_thread_pool.c
> 16>  apr_ldap_option.c
> 2>  misc.c
> 1>  otherchild.c
> 3>  apu_version.c
> 16>  apr_ldap_rebind.c
> 2>  otherchild.c
> 1>  rand.c
> 3>  sdbm.c
> 16>  apr_ldap_stub.c
> 2>  rand.c
> 3>  sdbm_hash.c
> 1>  start.c
> 16>  apr_ldap_url.c
> 3>  sdbm_lock.c
> 2>  start.c
> 1>  utf8.c
> 16>  apr_memcache.c
> 3>  sdbm_pair.c
> 1>  version.c
> 2>  utf8.c
> 16>  apr_date.c
> 2>  version.c
> 3>  apr_strmatch.c
> 1>  common.c
> 16>  Generating Code...
> 2>  common.c
> 3>  apr_uri.c
> 1>  mmap.c
> 16>  Compiling...
> 16>  apu_dso.c
> 3>  Generating Code...
> 2>  mmap.c
> 1>  inet_ntop.c
> 16>  apr_queue.c
> 2>  inet_ntop.c
> 1>  inet_pton.c
> 3>  Compiling...
> 3>  xlate.c
> 16>  apr_reslist.c
> 2>  inet_pton.c
> 1>  multicast.c
> 16>  apr_rmm.c
> 3>  apr_xml.c
> 2>  multicast.c
> 1>  Generating Code...
> 16>  apr_thread_pool.c
> 3>  Generating Code...
> 2>  Generating Code...
> 1>  Compiling...
> 1>  sendrecv.c
> 16>  apu_version.c
> 2>  Compiling...
> 2>  sendrecv.c
> 16>  sdbm.c
> 1>  sockaddr.c
> 16>  sdbm_hash.c
> 3>     Creating library Release\libaprutil-1.lib and object
> Release\libaprutil-1.exp
> 2>  sockaddr.c
> 1>  sockets.c
> 3>apr_brigade.obj : error LNK2019: unresolved external symbol
> __imp__apr_vformatter@16 referenced in function _apr_brigade_vprintf@20
> 3>apr_xml.obj : error LNK2001: unresolved external symbol
> __imp__apr_palloc@8
> 3>apr_rmm.obj : error LNK2001: unresolved external symbol
> __imp__apr_palloc@8
> 3>apr_thread_pool.obj : error LNK2001: unresolved external symbol
> __imp__apr_palloc@8
> 3>apr_strmatch.obj : error LNK2001: unresolved external symbol
> __imp__apr_palloc@8
> 3>xlate.obj : error LNK2001: unresolved external symbol __imp__apr_palloc@8
> 3>apr_ldap_url.obj : error LNK2001: unresolved external symbol
> __imp__apr_palloc@8
> 3>apr_memcache.obj : error LNK2001: unresolved external symbol
> __imp__apr_palloc@8
> 3>apr_queue.obj : error LNK2001: unresolved external symbol
> __imp__apr_palloc@8
> 3>apr_reslist.obj : error LNK2001: unresolved external symbol
> __imp__apr_palloc@8
> 3>apr_brigade.obj : error LNK2019: unresolved external symbol
> __imp__apr_palloc@8 referenced in function _apr_brigade_create@8
> 3>apr_dbd.obj : error LNK2001: unresolved external symbol
> __imp__apr_palloc@8
> 3>apr_dbm_sdbm.obj : error LNK2001: unresolved external symbol
> __imp__apr_palloc@8
> 3>apr_hooks.obj : error LNK2001: unresolved external symbol
> __imp__apr_palloc@8
> 3>apr_xml.obj : error LNK2001: unresolved external symbol
> __imp__apr_pool_cleanup_register@16
> 3>apr_reslist.obj : error LNK2001: unresolved external symbol
> __imp__apr_pool_cleanup_register@16
> 3>apr_thread_pool.obj : error LNK2001: unresolved external symbol
> __imp__apr_pool_cleanup_register@16
> 3>sdbm.obj : error LNK2001: unresolved external symbol
> __imp__apr_pool_cleanup_register@16
> 3>xlate.obj : error LNK2001: unresolved external symbol
> __imp__apr_pool_cleanup_register@16
> 3>apr_dbd.obj : error LNK2001: unresolved external symbol
> __imp__apr_pool_cleanup_register@16
> 3>apr_dbm.obj : error LNK2001: unresolved external symbol
> __imp__apr_pool_cleanup_register@16
> 3>apu_dso.obj : error LNK2001: unresolved external symbol
> __imp__apr_pool_cleanup_register@16
> 3>apr_queue.obj : error LNK2001: unresolved external symbol
> __imp__apr_pool_cleanup_register@16
> 3>apr_brigade.obj : error LNK2019: unresolved external symbol
> __imp__apr_pool_cleanup_register@16 referenced in function
> _apr_brigade_create@8
> 3>apr_buckets_alloc.obj : error LNK2001: unresolved external symbol
> __imp__apr_pool_cleanup_register@16
> 3>apr_buckets_mmap.obj : error LNK2001: unresolved external symbol
> __imp__apr_pool_cleanup_register@16
> 3>apr_buckets_pool.obj : error LNK2001: unresolved external symbol
> __imp__apr_pool_cleanup_register@16
> 3>apr_dbd.obj : error LNK2001: unresolved external symbol
> __imp__apr_pool_cleanup_kill@12
> 3>apr_reslist.obj : error LNK2001: unresolved external symbol
> __imp__apr_pool_cleanup_kill@12
> 3>apr_brigade.obj : error LNK2019: unresolved external symbol
> __imp__apr_pool_cleanup_kill@12 referenced in function
> _apr_brigade_destroy@4
> 3>apr_buckets_alloc.obj : error LNK2001: unresolved external symbol
> __imp__apr_pool_cleanup_kill@12
> 3>apr_buckets_mmap.obj : error LNK2001: unresolved external symbol
> __imp__apr_pool_cleanup_kill@12
> 3>apr_buckets_pool.obj : error LNK2001: unresolved external symbol
> __imp__apr_pool_cleanup_kill@12
> 3>apr_xml.obj : error LNK2019: unresolved external symbol
> __imp__apr_pool_cleanup_null referenced in function _start_handler
> 3>apr_reslist.obj : error LNK2001: unresolved external symbol
> __imp__apr_pool_cleanup_null
> 3>apr_thread_pool.obj : error LNK2001: unresolved external symbol
> __imp__apr_pool_cleanup_null
> 3>sdbm.obj : error LNK2001: unresolved external symbol
> __imp__apr_pool_cleanup_null
> 3>xlate.obj : error LNK2001: unresolved external symbol
> __imp__apr_pool_cleanup_null
> 3>apr_dbd.obj : error LNK2001: unresolved external symbol
> __imp__apr_pool_cleanup_null
> 3>apr_dbm.obj : error LNK2001: unresolved external symbol
> __imp__apr_pool_cleanup_null
> 3>apu_dso.obj : error LNK2001: unresolved external symbol
> __imp__apr_pool_cleanup_null
> 3>apr_queue.obj : error LNK2001: unresolved external symbol
> __imp__apr_pool_cleanup_null
> 3>apr_brigade.obj : error LNK2001: unresolved external symbol
> __imp__apr_pool_cleanup_null
> 3>apr_buckets_alloc.obj : error LNK2001: unresolved external symbol
> __imp__apr_pool_cleanup_null
> 3>apr_buckets_mmap.obj : error LNK2001: unresolved external symbol
> __imp__apr_pool_cleanup_null
> 3>apr_buckets_pool.obj : error LNK2001: unresolved external symbol
> __imp__apr_pool_cleanup_null
> 3>apr_buckets_alloc.obj : error LNK2019: unresolved external symbol
> __imp__apr_allocator_alloc@8 referenced in function _apr_bucket_alloc
> 3>apr_buckets_alloc.obj : error LNK2019: unresolved external symbol
> __imp__apr_allocator_free@8 referenced in function _alloc_cleanup
> 3>apr_buckets_alloc.obj : error LNK2019: unresolved external symbol
> __imp__apr_pool_allocator_get@4 referenced in function
> _apr_bucket_alloc_create
> 3>apr_buckets_file.obj : error LNK2019: unresolved external symbol
> __imp__apr_pool_is_ancestor@8 referenced in function _file_bucket_setaside
> 3>apr_buckets_mmap.obj : error LNK2001: unresolved external symbol
> __imp__apr_pool_is_ancestor@8
> 3>apr_buckets_file.obj : error LNK2019: unresolved external symbol
> __imp__apr_file_read@12 referenced in function _file_bucket_read
> 3>apr_buckets_pipe.obj : error LNK2001: unresolved external symbol
> __imp__apr_file_read@12
> 3>apr_xml.obj : error LNK2001: unresolved external symbol
> __imp__apr_file_read@12
> 3>apr_buckets_file.obj : error LNK2019: unresolved external symbol
> __imp__apr_file_setaside@12 referenced in function _file_bucket_setaside
> 3>apr_buckets_file.obj : error LNK2019: unresolved external symbol
> __imp__apr_file_seek@12 referenced in function _file_bucket_read
> 3>sdbm.obj : error LNK2001: unresolved external symbol
> __imp__apr_file_seek@12
> 3>apr_buckets_file.obj : error LNK2019: unresolved external symbol
> __imp__apr_file_pool_get@4 referenced in function _file_bucket_setaside
> 3>apr_buckets_file.obj : error LNK2019: unresolved external symbol
> __imp__apr_mmap_create@28 referenced in function _file_make_mmap
> 3>apr_buckets_mmap.obj : error LNK2019: unresolved external symbol
> __imp__apr_mmap_dup@12 referenced in function _mmap_bucket_setaside
> 3>apr_buckets_mmap.obj : error LNK2019: unresolved external symbol
> __imp__apr_mmap_delete@4 referenced in function _mmap_bucket_destroy
> 3>apr_buckets_mmap.obj : error LNK2019: unresolved external symbol
> __imp__apr_mmap_offset@16 referenced in function _mmap_bucket_read
> 3>apr_buckets_pipe.obj : error LNK2019: unresolved external symbol
> __imp__apr_file_close@4 referenced in function _pipe_bucket_read
> 3>sdbm.obj : error LNK2001: unresolved external symbol
> __imp__apr_file_close@4
> 3>apr_buckets_pipe.obj : error LNK2019: unresolved external symbol
> __imp__apr_file_pipe_timeout_get@8 referenced in function _pipe_bucket_read
> 3>apr_buckets_pipe.obj : error LNK2019: unresolved external symbol
> __imp__apr_file_pipe_timeout_set@12 referenced in function _pipe_bucket_read
> 3>apr_buckets_socket.obj : error LNK2019: unresolved external symbol
> __imp__apr_socket_recv@12 referenced in function _socket_bucket_read
> 3>apr_buckets_socket.obj : error LNK2019: unresolved external symbol
> __imp__apr_socket_timeout_set@12 referenced in function _socket_bucket_read
> 3>apr_memcache.obj : error LNK2001: unresolved external symbol
> __imp__apr_socket_timeout_set@12
> 3>apr_buckets_socket.obj : error LNK2019: unresolved external symbol
> __imp__apr_socket_timeout_get@8 referenced in function _socket_bucket_read
> 3>apr_xml.obj : error LNK2001: unresolved external symbol
> __imp__apr_cpystrn@12
> 3>apr_md5.obj : error LNK2019: unresolved external symbol
> __imp__apr_cpystrn@12 referenced in function _apr_md5_encode@16
> 3>apr_sha1.obj : error LNK2001: unresolved external symbol
> __imp__apr_cpystrn@12
> 3>apr_dbm.obj : error LNK2001: unresolved external symbol
> __imp__apr_cpystrn@12
> 3>apu_dso.obj : error LNK2001: unresolved external symbol
> __imp__apr_cpystrn@12
> 3>getuuid.obj : error LNK2019: unresolved external symbol
> __imp__apr_generate_random_bytes@8 referenced in function
> _get_pseudo_node_identifier
> 3>getuuid.obj : error LNK2019: unresolved external symbol
> __imp__apr_time_now@0 referenced in function _get_current_time
> 3>apr_memcache.obj : error LNK2001: unresolved external symbol
> __imp__apr_time_now@0
> 3>apr_reslist.obj : error LNK2001: unresolved external symbol
> __imp__apr_time_now@0
> 3>apr_thread_pool.obj : error LNK2001: unresolved external symbol
> __imp__apr_time_now@0
> 3>getuuid.obj : error LNK2019: unresolved external symbol
> __imp__apr_os_uuid_get@4 referenced in function _apr_uuid_get@4
> 3>apr_reslist.obj : error LNK2001: unresolved external symbol
> __imp__apr_thread_mutex_create@12
> 3>apr_thread_pool.obj : error LNK2001: unresolved external symbol
> __imp__apr_thread_mutex_create@12
> 3>apr_dbd.obj : error LNK2019: unresolved external symbol
> __imp__apr_thread_mutex_create@12 referenced in function _apr_dbd_init@4
> 3>apr_memcache.obj : error LNK2001: unresolved external symbol
> __imp__apr_thread_mutex_create@12
> 3>apu_dso.obj : error LNK2001: unresolved external symbol
> __imp__apr_thread_mutex_create@12
> 3>apr_queue.obj : error LNK2001: unresolved external symbol
> __imp__apr_thread_mutex_create@12
> 3>apr_reslist.obj : error LNK2001: unresolved external symbol
> __imp__apr_thread_mutex_lock@4
> 3>apr_rmm.obj : error LNK2001: unresolved external symbol
> __imp__apr_thread_mutex_lock@4
> 3>apr_thread_pool.obj : error LNK2001: unresolved external symbol
> __imp__apr_thread_mutex_lock@4
> 3>apr_dbd.obj : error LNK2019: unresolved external symbol
> __imp__apr_thread_mutex_lock@4 referenced in function _apr_dbd_mutex_lock@0
> 3>apr_memcache.obj : error LNK2001: unresolved external symbol
> __imp__apr_thread_mutex_lock@4
> 3>apu_dso.obj : error LNK2001: unresolved external symbol
> __imp__apr_thread_mutex_lock@4
> 3>apr_queue.obj : error LNK2001: unresolved external symbol
> __imp__apr_thread_mutex_lock@4
> 3>apr_reslist.obj : error LNK2001: unresolved external symbol
> __imp__apr_thread_mutex_unlock@4
> 3>apr_rmm.obj : error LNK2001: unresolved external symbol
> __imp__apr_thread_mutex_unlock@4
> 3>apr_thread_pool.obj : error LNK2001: unresolved external symbol
> __imp__apr_thread_mutex_unlock@4
> 3>apr_dbd.obj : error LNK2019: unresolved external symbol
> __imp__apr_thread_mutex_unlock@4 referenced in function
> _apr_dbd_mutex_unlock@0
> 3>apr_memcache.obj : error LNK2001: unresolved external symbol
> __imp__apr_thread_mutex_unlock@4
> 3>apu_dso.obj : error LNK2001: unresolved external symbol
> __imp__apr_thread_mutex_unlock@4
> 3>apr_queue.obj : error LNK2001: unresolved external symbol
> __imp__apr_thread_mutex_unlock@4
> 3>apr_dbd.obj : error LNK2019: unresolved external symbol
> __imp__apr_pool_parent_get@4 referenced in function _apr_dbd_init@4
> 3>apr_dbm.obj : error LNK2001: unresolved external symbol
> __imp__apr_pool_parent_get@4
> 3>apu_dso.obj : error LNK2001: unresolved external symbol
> __imp__apr_pool_parent_get@4
> 3>apu_dso.obj : error LNK2001: unresolved external symbol
> __imp__apr_pstrdup@8
> 3>apr_uri.obj : error LNK2001: unresolved external symbol
> __imp__apr_pstrdup@8
> 3>xlate.obj : error LNK2001: unresolved external symbol __imp__apr_pstrdup@8
> 3>apr_xml.obj : error LNK2001: unresolved external symbol
> __imp__apr_pstrdup@8
> 3>apr_dbd.obj : error LNK2019: unresolved external symbol
> __imp__apr_pstrdup@8 referenced in function _apr_dbd_get_driver@12
> 3>apr_dbm.obj : error LNK2001: unresolved external symbol
> __imp__apr_pstrdup@8
> 3>apr_ldap_url.obj : error LNK2001: unresolved external symbol
> __imp__apr_pstrdup@8
> 3>apr_memcache.obj : error LNK2001: unresolved external symbol
> __imp__apr_pstrdup@8
> 3>apr_dbd.obj : error LNK2019: unresolved external symbol
> __imp__apr_snprintf referenced in function _apr_dbd_get_driver@12
> 3>apr_dbm.obj : error LNK2001: unresolved external symbol
> __imp__apr_snprintf
> 3>apr_memcache.obj : error LNK2001: unresolved external symbol
> __imp__apr_snprintf
> 3>apr_xml.obj : error LNK2001: unresolved external symbol
> __imp__apr_snprintf
> 3>apu_dso.obj : error LNK2001: unresolved external symbol
> __imp__apr_hash_make@4
> 3>apr_dbd.obj : error LNK2019: unresolved external symbol
> __imp__apr_hash_make@4 referenced in function _apr_dbd_init@4
> 3>apr_dbm.obj : error LNK2001: unresolved external symbol
> __imp__apr_hash_make@4
> 3>apr_hooks.obj : error LNK2001: unresolved external symbol
> __imp__apr_hash_make@4
> 3>apr_memcache.obj : error LNK2001: unresolved external symbol
> __imp__apr_hash_make@4
> 3>apu_dso.obj : error LNK2001: unresolved external symbol
> __imp__apr_hash_set@16
> 3>apr_dbd.obj : error LNK2019: unresolved external symbol
> __imp__apr_hash_set@16 referenced in function _apr_dbd_get_driver@12
> 3>apr_dbm.obj : error LNK2001: unresolved external symbol
> __imp__apr_hash_set@16
> 3>apr_hooks.obj : error LNK2001: unresolved external symbol
> __imp__apr_hash_set@16
> 3>apr_memcache.obj : error LNK2001: unresolved external symbol
> __imp__apr_hash_set@16
> 3>apu_dso.obj : error LNK2001: unresolved external symbol
> __imp__apr_hash_get@12
> 3>apr_dbd.obj : error LNK2019: unresolved external symbol
> __imp__apr_hash_get@12 referenced in function _apr_dbd_get_driver@12
> 3>apr_dbm.obj : error LNK2001: unresolved external symbol
> __imp__apr_hash_get@12
> 3>apr_hooks.obj : error LNK2001: unresolved external symbol
> __imp__apr_hash_get@12
> 3>apr_memcache.obj : error LNK2001: unresolved external symbol
> __imp__apr_hash_get@12
> 3>apr_dbd.obj : error LNK2019: unresolved external symbol
> __imp__apr_hash_pool_get@4 referenced in function _apr_dbd_get_driver@12
> 3>apr_dbm.obj : error LNK2001: unresolved external symbol
> __imp__apr_hash_pool_get@4
> 3>apu_dso.obj : error LNK2001: unresolved external symbol
> __imp__apr_hash_pool_get@4
> 3>apr_dbd.obj : error LNK2019: unresolved external symbol
> __imp__apr_atomic_read32@4 referenced in function _apr_dbd_init@4
> 3>apr_dbm.obj : error LNK2001: unresolved external symbol
> __imp__apr_atomic_read32@4
> 3>apu_dso.obj : error LNK2001: unresolved external symbol
> __imp__apr_atomic_read32@4
> 3>apr_dbd.obj : error LNK2019: unresolved external symbol
> __imp__apr_atomic_set32@8 referenced in function _apr_dbd_init@4
> 3>apr_dbm.obj : error LNK2001: unresolved external symbol
> __imp__apr_atomic_set32@8
> 3>apu_dso.obj : error LNK2001: unresolved external symbol
> __imp__apr_atomic_set32@8
> 3>apr_dbd.obj : error LNK2019: unresolved external symbol
> __imp__apr_atomic_inc32@4 referenced in function _apr_dbd_init@4
> 3>apr_dbm.obj : error LNK2001: unresolved external symbol
> __imp__apr_atomic_inc32@4
> 3>apu_dso.obj : error LNK2001: unresolved external symbol
> __imp__apr_atomic_inc32@4
> 3>apr_dbd.obj : error LNK2019: unresolved external symbol
> __imp__apr_atomic_dec32@4 referenced in function _apr_dbd_init@4
> 3>apr_dbm.obj : error LNK2001: unresolved external symbol
> __imp__apr_atomic_dec32@4
> 3>apu_dso.obj : error LNK2001: unresolved external symbol
> __imp__apr_atomic_dec32@4
> 3>apr_dbm_sdbm.obj : error LNK2019: unresolved external symbol
> __imp__apr_pstrcat referenced in function _vt_sdbm_usednames
> 3>sdbm.obj : error LNK2001: unresolved external symbol __imp__apr_pstrcat
> 3>apr_uri.obj : error LNK2001: unresolved external symbol __imp__apr_pstrcat
> 3>apr_dbm_sdbm.obj : error LNK2019: unresolved external symbol
> __imp__apr_psprintf referenced in function _vt_sdbm_fetch
> 3>apr_xml.obj : error LNK2001: unresolved external symbol
> __imp__apr_psprintf
> 3>apr_hooks.obj : error LNK2019: unresolved external symbol
> __imp__apr_pool_create_ex@16 referenced in function _apr_hook_sort_all@0
> 3>apr_memcache.obj : error LNK2001: unresolved external symbol
> __imp__apr_pool_create_ex@16
> 3>apr_thread_pool.obj : error LNK2001: unresolved external symbol
> __imp__apr_pool_create_ex@16
> 3>apr_hooks.obj : error LNK2019: unresolved external symbol
> __imp__apr_array_make@12 referenced in function _apr_hook_sort_all@0
> 3>apu_dso.obj : error LNK2001: unresolved external symbol
> __imp__apr_array_make@12
> 3>apr_xml.obj : error LNK2001: unresolved external symbol
> __imp__apr_array_make@12
> 3>apr_hooks.obj : error LNK2019: unresolved external symbol
> __imp__apr_array_push@4 referenced in function _apr_hook_sort_all@0
> 3>apr_xml.obj : error LNK2001: unresolved external symbol
> __imp__apr_array_push@4
> 3>apr_ldap_url.obj : error LNK2019: unresolved external symbol
> __imp__apr_strtok@12 referenced in function _apr_ldap_str2charray
> 3>apr_memcache.obj : error LNK2001: unresolved external symbol
> __imp__apr_strtok@12
> 3>apr_memcache.obj : error LNK2019: unresolved external symbol
> __imp__apr_pool_clear@4 referenced in function _apr_memcache_delete@12
> 3>apr_memcache.obj : error LNK2019: unresolved external symbol
> __imp__apr_pool_destroy@4 referenced in function _mc_conn_construct
> 3>apr_memcache.obj : error LNK2019: unresolved external symbol
> __imp__apr_pstrmemdup@12 referenced in function _apr_memcache_version@12
> 3>apr_uri.obj : error LNK2001: unresolved external symbol
> __imp__apr_pstrmemdup@12
> 3>apr_memcache.obj : error LNK2019: unresolved external symbol
> __imp__apr_atoi64@4 referenced in function _stat_read_uint64
> 3>apr_memcache.obj : error LNK2019: unresolved external symbol
> __imp__apr_socket_create@20 referenced in function _mc_conn_construct
> 3>apr_memcache.obj : error LNK2019: unresolved external symbol
> __imp__apr_socket_close@4 referenced in function _mc_conn_destruct
> 3>apr_memcache.obj : error LNK2019: unresolved external symbol
> __imp__apr_socket_connect@8 referenced in function _conn_connect
> 3>apr_memcache.obj : error LNK2019: unresolved external symbol
> __imp__apr_sockaddr_info_get@24 referenced in function _conn_connect
> 3>apr_memcache.obj : error LNK2019: unresolved external symbol
> __imp__apr_socket_sendv@16 referenced in function _apr_memcache_delete@12
> 3>apr_memcache.obj : error LNK2019: unresolved external symbol
> __imp__apr_hash_first@8 referenced in function _apr_memcache_multgetp@16
> 3>apr_memcache.obj : error LNK2019: unresolved external symbol
> __imp__apr_hash_next@4 referenced in function _apr_memcache_multgetp@16
> 3>apr_memcache.obj : error LNK2019: unresolved external symbol
> __imp__apr_hash_this@16 referenced in function _apr_memcache_multgetp@16
> 3>apr_memcache.obj : error LNK2019: unresolved external symbol
> __imp__apr_hash_count@4 referenced in function _apr_memcache_multgetp@16
> 3>apr_memcache.obj : error LNK2019: unresolved external symbol
> __imp__apr_pollset_create@16 referenced in function
> _apr_memcache_multgetp@16
> 3>apr_memcache.obj : error LNK2019: unresolved external symbol
> __imp__apr_pollset_destroy@4 referenced in function
> _apr_memcache_multgetp@16
> 3>apr_memcache.obj : error LNK2019: unresolved external symbol
> __imp__apr_pollset_add@8 referenced in function _apr_memcache_multgetp@16
> 3>apr_memcache.obj : error LNK2019: unresolved external symbol
> __imp__apr_pollset_remove@8 referenced in function _apr_memcache_multgetp@16
> 3>apr_memcache.obj : error LNK2019: unresolved external symbol
> __imp__apr_pollset_poll@20 referenced in function _apr_memcache_multgetp@16
> 3>apr_date.obj : error LNK2019: unresolved external symbol
> __imp__apr_time_exp_get@8 referenced in function _apr_date_parse_http@4
> 3>apr_date.obj : error LNK2019: unresolved external symbol
> __imp__apr_time_exp_gmt_get@8 referenced in function _apr_date_parse_rfc@4
> 3>apu_dso.obj : error LNK2019: unresolved external symbol
> __imp__apr_dso_load@12 referenced in function _apu_dso_load
> 3>apu_dso.obj : error LNK2019: unresolved external symbol
> __imp__apr_dso_unload@4 referenced in function _apu_dso_load
> 3>apu_dso.obj : error LNK2019: unresolved external symbol
> __imp__apr_dso_sym@12 referenced in function _apu_dso_load
> 3>apu_dso.obj : error LNK2019: unresolved external symbol
> __imp__apr_filepath_list_split@12 referenced in function _apu_dso_load
> 3>apu_dso.obj : error LNK2019: unresolved external symbol
> __imp__apr_env_get@12 referenced in function _apu_dso_load
> 3>apr_queue.obj : error LNK2019: unresolved external symbol
> __imp__apr_thread_mutex_destroy@4 referenced in function _queue_destroy
> 3>apr_reslist.obj : error LNK2001: unresolved external symbol
> __imp__apr_thread_mutex_destroy@4
> 3>apr_thread_pool.obj : error LNK2001: unresolved external symbol
> __imp__apr_thread_mutex_destroy@4
> 3>apr_queue.obj : error LNK2019: unresolved external symbol
> __imp__apr_thread_cond_create@8 referenced in function _apr_queue_create@12
> 3>apr_reslist.obj : error LNK2001: unresolved external symbol
> __imp__apr_thread_cond_create@8
> 3>apr_thread_pool.obj : error LNK2001: unresolved external symbol
> __imp__apr_thread_cond_create@8
> 3>apr_queue.obj : error LNK2019: unresolved external symbol
> __imp__apr_thread_cond_wait@8 referenced in function _apr_queue_pop@8
> 3>apr_reslist.obj : error LNK2001: unresolved external symbol
> __imp__apr_thread_cond_wait@8
> 3>apr_thread_pool.obj : error LNK2001: unresolved external symbol
> __imp__apr_thread_cond_wait@8
> 3>apr_queue.obj : error LNK2019: unresolved external symbol
> __imp__apr_thread_cond_signal@4 referenced in function _apr_queue_pop@8
> 3>apr_reslist.obj : error LNK2001: unresolved external symbol
> __imp__apr_thread_cond_signal@4
> 3>apr_thread_pool.obj : error LNK2001: unresolved external symbol
> __imp__apr_thread_cond_signal@4
> 3>apr_queue.obj : error LNK2019: unresolved external symbol
> __imp__apr_thread_cond_broadcast@4 referenced in function
> _apr_queue_interrupt_all@4
> 3>apr_thread_pool.obj : error LNK2001: unresolved external symbol
> __imp__apr_thread_cond_broadcast@4
> 3>apr_queue.obj : error LNK2019: unresolved external symbol
> __imp__apr_thread_cond_destroy@4 referenced in function _queue_destroy
> 3>apr_reslist.obj : error LNK2001: unresolved external symbol
> __imp__apr_thread_cond_destroy@4
> 3>apr_thread_pool.obj : error LNK2001: unresolved external symbol
> __imp__apr_thread_cond_destroy@4
> 3>apr_reslist.obj : error LNK2019: unresolved external symbol
> __imp__apr_pool_pre_cleanup_register@12 referenced in function
> _apr_reslist_cleanup_order_set@8
> 3>apr_xml.obj : error LNK2001: unresolved external symbol
> __imp__apr_pool_cleanup_run@12
> 3>apr_reslist.obj : error LNK2019: unresolved external symbol
> __imp__apr_pool_cleanup_run@12 referenced in function _apr_reslist_destroy@4
> 3>apr_thread_pool.obj : error LNK2001: unresolved external symbol
> __imp__apr_pool_cleanup_run@12
> 3>sdbm.obj : error LNK2001: unresolved external symbol
> __imp__apr_pool_cleanup_run@12
> 3>xlate.obj : error LNK2001: unresolved external symbol
> __imp__apr_pool_cleanup_run@12
> 3>apr_reslist.obj : error LNK2019: unresolved external symbol
> __imp__apr_thread_cond_timedwait@16 referenced in function
> _apr_reslist_acquire@8
> 3>apr_thread_pool.obj : error LNK2001: unresolved external symbol
> __imp__apr_thread_cond_timedwait@16
> 3>apr_rmm.obj : error LNK2019: unresolved external symbol
> __imp__apr_proc_mutex_lock@4 referenced in function _apr_rmm_calloc@8
> 3>apr_rmm.obj : error LNK2019: unresolved external symbol
> __imp__apr_proc_mutex_unlock@4 referenced in function _apr_rmm_calloc@8
> 3>apr_rmm.obj : error LNK2019: unresolved external symbol
> __imp__apr_thread_rwlock_rdlock@4 referenced in function _apr_rmm_calloc@8
> 3>apr_rmm.obj : error LNK2019: unresolved external symbol
> __imp__apr_thread_rwlock_wrlock@4 referenced in function _apr_rmm_calloc@8
> 3>apr_rmm.obj : error LNK2019: unresolved external symbol
> __imp__apr_thread_rwlock_unlock@4 referenced in function _apr_rmm_calloc@8
> 3>apr_thread_pool.obj : error LNK2019: unresolved external symbol
> __imp__apr_sleep@8 referenced in function _thread_pool_cleanup
> 3>apr_thread_pool.obj : error LNK2019: unresolved external symbol
> __imp__apr_thread_create@20 referenced in function _add_task
> 3>apr_thread_pool.obj : error LNK2019: unresolved external symbol
> __imp__apr_thread_exit@8 referenced in function _thread_pool_func@8
> 3>apr_thread_pool.obj : error LNK2019: unresolved external symbol
> __imp__apr_thread_join@8 referenced in function _trim_idle_threads
> 3>apr_thread_pool.obj : error LNK2019: unresolved external symbol
> __imp__apr_thread_detach@4 referenced in function _thread_pool_func@8
> 3>apr_thread_pool.obj : error LNK2019: unresolved external symbol
> __imp__apr_thread_data_get@12 referenced in function
> _apr_thread_pool_task_owner_get@8
> 3>apr_thread_pool.obj : error LNK2019: unresolved external symbol
> __imp__apr_thread_data_set@16 referenced in function _thread_pool_func@8
> 3>sdbm.obj : error LNK2019: unresolved external symbol
> __imp__apr_file_open@20 referenced in function _prep
> 3>sdbm.obj : error LNK2019: unresolved external symbol
> __imp__apr_file_read_full@16 referenced in function _apr_sdbm_firstkey@8
> 3>sdbm.obj : error LNK2019: unresolved external symbol
> __imp__apr_file_write_full@16 referenced in function _makroom
> 3>sdbm.obj : error LNK2019: unresolved external symbol
> __imp__apr_file_unlock@4 referenced in function _database_cleanup
> 3>sdbm_lock.obj : error LNK2001: unresolved external symbol
> __imp__apr_file_unlock@4
> 3>sdbm_lock.obj : error LNK2019: unresolved external symbol
> __imp__apr_file_lock@8 referenced in function _apr_sdbm_lock@8
> 3>sdbm_lock.obj : error LNK2019: unresolved external symbol
> __imp__apr_file_info_get@12 referenced in function _apr_sdbm_lock@8
> 3>apr_uri.obj : error LNK2019: unresolved external symbol
> __imp__apr_pstrndup@12 referenced in function _apr_uri_parse_hostinfo@12
> 3>apr_xml.obj : error LNK2001: unresolved external symbol
> __imp__apr_pstrndup@12
> 3>xlate.obj : error LNK2019: unresolved external symbol
> __imp__apr_os_default_encoding@4 referenced in function _apr_xlate_open@16
> 3>xlate.obj : error LNK2019: unresolved external symbol
> __imp__apr_os_locale_encoding@4 referenced in function _apr_xlate_open@16
> 3>xlate.obj : error LNK2019: unresolved external symbol
> __imp__apr_iconv_open@16 referenced in function _apr_xlate_open@16
> 3>xlate.obj : error LNK2019: unresolved external symbol __imp__apr_iconv@24
> referenced in function _apr_xlate_conv_buffer@20
> 3>xlate.obj : error LNK2019: unresolved external symbol
> __imp__apr_iconv_close@8 referenced in function _apr_xlate_cleanup
> 3>apr_xml.obj : error LNK2019: unresolved external symbol
> __imp__apr_pool_abort_get@4 referenced in function _apr_xml_parser_create@4
> 3>apr_xml.obj : error LNK2019: unresolved external symbol _XML_ParserCreate
> referenced in function _apr_xml_parser_create@4
> 3>apr_xml.obj : error LNK2019: unresolved external symbol
> _XML_SetElementHandler referenced in function _apr_xml_parser_create@4
> 3>apr_xml.obj : error LNK2019: unresolved external symbol
> _XML_SetCharacterDataHandler referenced in function _apr_xml_parser_create@4
> 3>apr_xml.obj : error LNK2019: unresolved external symbol
> _XML_SetDefaultHandler referenced in function _apr_xml_parser_create@4
> 3>apr_xml.obj : error LNK2019: unresolved external symbol _XML_SetUserData
> referenced in function _apr_xml_parser_create@4
> 3>apr_xml.obj : error LNK2019: unresolved external symbol _XML_Parse
> referenced in function _apr_xml_parse_file@20
> 3>apr_xml.obj : error LNK2019: unresolved external symbol _XML_GetErrorCode
> referenced in function _apr_xml_parse_file@20
> 3>apr_xml.obj : error LNK2019: unresolved external symbol _XML_ParserFree
> referenced in function _cleanup_parser
> 3>apr_xml.obj : error LNK2019: unresolved external symbol _XML_ErrorString
> referenced in function _apr_xml_parser_geterror@12
> 3>Release\libaprutil-1.dll : fatal error LNK1120: 115 unresolved externals
> 16>  sdbm_lock.c
> 2>  sockets.c
> 1>  socket_util.c
> 1>  sockopt.c
> 2>  socket_util.c
> 2>  sockopt.c
> 16>  sdbm_pair.c
> 16>  apr_strmatch.c
> 18>------ Build started: Project: apr_dbd_odbc, Configuration: Release Win32
> ------
> 1>C:\Users\matthep\Documents\Code\apr\apr-util\dbd\apr_dbd_odbc.vcxproj(78,5):
> warning MSB4011:
> "C:\Users\matthep\AppData\Local\Microsoft\MSBuild\v4.0\Microsoft.Cpp.Win32.user.props"
> cannot be imported again. It was already imported at
> "C:\Users\matthep\Documents\Code\apr\apr-util\dbd\apr_dbd_odbc.vcxproj
> (75,5)". This is most likely a build authoring error. This subsequent import
> will be ignored.
> 2>C:\Users\matthep\Documents\Code\apr\apr-util\dbd\apr_dbd_odbc.vcxproj(78,5):
> warning MSB4011:
> "C:\Users\matthep\AppData\Local\Microsoft\MSBuild\v4.0\Microsoft.Cpp.Win32.user.props"
> cannot be imported again. It was already imported at
> "C:\Users\matthep\Documents\Code\apr\apr-util\dbd\apr_dbd_odbc.vcxproj
> (75,5)". This is most likely a build authoring error. This subsequent import
> will be ignored.
> 16>C:\Users\matthep\Documents\Code\apr\apr-util\dbd\apr_dbd_odbc.vcxproj(78,5):
> warning MSB4011:
> "C:\Users\matthep\AppData\Local\Microsoft\MSBuild\v4.0\Microsoft.Cpp.Win32.user.props"
> cannot be imported again. It was already imported at
> "C:\Users\matthep\Documents\Code\apr\apr-util\dbd\apr_dbd_odbc.vcxproj
> (75,5)". This is most likely a build authoring error. This subsequent import
> will be ignored.
> 18>C:\Users\matthep\Documents\Code\apr\apr-util\dbd\apr_dbd_odbc.vcxproj(78,5):
> warning MSB4011:
> "C:\Users\matthep\AppData\Local\Microsoft\MSBuild\v4.0\Microsoft.Cpp.Win32.user.props"
> cannot be imported again. It was already imported at
> "C:\Users\matthep\Documents\Code\apr\apr-util\dbd\apr_dbd_odbc.vcxproj
> (75,5)". This is most likely a build authoring error. This subsequent import
> will be ignored.
> 1>  apr_getpass.c
> 16>  apr_uri.c
> 18>  apr_dbd_odbc.c
> 2>  apr_getpass.c
> 16>  xlate.c
> 1>  poll.c
> 18>     Creating library Release\apr_dbd_odbc-1.lib and object
> Release\apr_dbd_odbc-1.exp
> 16>  apr_xml.c
> 2>  poll.c
> 18>apr_dbd_odbc.obj : error LNK2019: unresolved external symbol
> __imp__apr_palloc@8 referenced in function _odbc_open
> 18>apr_dbd_odbc.obj : error LNK2019: unresolved external symbol
> __imp__apr_pool_is_ancestor@8 referenced in function
> _odbc_lob_bucket_setaside
> 18>apr_dbd_odbc.obj : error LNK2019: unresolved external symbol
> __imp__apr_pool_cleanup_register@16 referenced in function _odbc_init
> 18>apr_dbd_odbc.obj : error LNK2019: unresolved external symbol
> __imp__apr_pool_cleanup_null referenced in function _odbc_init
> 18>apr_dbd_odbc.obj : error LNK2019: unresolved external symbol
> __imp__apr_strnatcmp@8 referenced in function _odbc_set_dbname
> 18>apr_dbd_odbc.obj : error LNK2019: unresolved external symbol
> __imp__apr_strnatcasecmp@8 referenced in function _odbc_parse_params
> 18>apr_dbd_odbc.obj : error LNK2019: unresolved external symbol
> __imp__apr_pstrdup@8 referenced in function _odbc_open
> 18>apr_dbd_odbc.obj : error LNK2019: unresolved external symbol
> __imp__apr_pmemdup@12 referenced in function _odbc_prepare
> 18>apr_dbd_odbc.obj : error LNK2019: unresolved external symbol
> __imp__apr_cpystrn@12 referenced in function _odbc_query
> 18>apr_dbd_odbc.obj : error LNK2019: unresolved external symbol
> __imp__apr_strtok@12 referenced in function _odbc_parse_params
> 18>apr_dbd_odbc.obj : error LNK2019: unresolved external symbol
> __imp__apr_atoi64@4 referenced in function _odbc_bind_param
> 18>apr_dbd_odbc.obj : error LNK2019: unresolved external symbol
> __imp__apr_time_now@0 referenced in function _check_error
> 18>apr_dbd_odbc.obj : error LNK2019: unresolved external symbol
> __imp__apr_ctime@12 referenced in function _check_error
> 18>apr_dbd_odbc.obj : error LNK2019: unresolved external symbol
> __imp__apr_file_open_stderr@8 referenced in function _odbc_init
> 18>apr_dbd_odbc.obj : error LNK2019: unresolved external symbol
> __imp__apr_file_printf referenced in function _odbc_init
> 18>apr_dbd_odbc.obj : error LNK2019: unresolved external symbol
> __imp__apr_env_get@12 referenced in function _check_error
> 18>Release\apr_dbd_odbc-1.dll : fatal error LNK1120: 16 unresolved externals
> 1>  pollcb.c
> 16>  Generating Code...
> 2>  pollcb.c
> 1>  pollset.c
> 2>  pollset.c
> 1>  select.c
> 2>  select.c
> 1>  apr_random.c
> 1>  sha2.c
> 2>  apr_random.c
> 16>  aprutil.vcxproj ->
> C:\Users\matthep\Documents\Code\apr\apr-util\LibR\aprutil-1.lib
> 1>  sha2_glue.c
> 2>  sha2.c
> 1>  shm.c
> 2>  sha2_glue.c
> 2>  shm.c
> 1>  apr_cpystrn.c
> 1>  apr_fnmatch.c
> 2>  apr_cpystrn.c
> 1>  apr_snprintf.c
> 2>  apr_fnmatch.c
> 1>  apr_strings.c
> 2>  apr_snprintf.c
> 1>  apr_strnatcmp.c
> 2>  apr_strings.c
> 1>  apr_strtok.c
> 2>  apr_strnatcmp.c
> 1>  Generating Code...
> 2>  apr_strtok.c
> 2>  Generating Code...
> 1>  Compiling...
> 1>  apr_hash.c
> 1>  apr_tables.c
> 2>  Compiling...
> 2>  apr_hash.c
> 1>  proc.c
> 2>  apr_tables.c
> 1>  signals.c
> 2>  proc.c
> 1>  thread.c
> 2>  signals.c
> 1>  threadpriv.c
> 2>  thread.c
> 1>  time.c
> 2>  threadpriv.c
> 1>  timestr.c
> 2>  time.c
> 1>  groupinfo.c
> 2>  timestr.c
> 1>  userinfo.c
> 2>  groupinfo.c
> 1>  Generating Code...
> 2>  userinfo.c
> 2>  Generating Code...
> 1>  apr.vcxproj -> C:\Users\matthep\Documents\Code\apr\apr\LibR\apr-1.lib
> 19>------ Build started: Project: preaprapp, Configuration: Release Win32
> ------
> 20>------ Build started: Project: preapriconv, Configuration: Release Win32
> ------
> 2>C:\Users\matthep\Documents\Code\apr\apr\build\preaprapp.vcxproj(112,5):
> warning MSB4011:
> "C:\Users\matthep\AppData\Local\Microsoft\MSBuild\v4.0\Microsoft.Cpp.Win32.user.props"
> cannot be imported again. It was already imported at
> "C:\Users\matthep\Documents\Code\apr\apr\build\preaprapp.vcxproj (102,5)".
> This is most likely a build authoring error. This subsequent import will be
> ignored.
> 19>C:\Users\matthep\Documents\Code\apr\apr\build\preaprapp.vcxproj(112,5):
> warning MSB4011:
> "C:\Users\matthep\AppData\Local\Microsoft\MSBuild\v4.0\Microsoft.Cpp.Win32.user.props"
> cannot be imported again. It was already imported at
> "C:\Users\matthep\Documents\Code\apr\apr\build\preaprapp.vcxproj (102,5)".
> This is most likely a build authoring error. This subsequent import will be
> ignored.
> 19>C:\Users\matthep\Documents\Code\apr\apr-iconv\build\preapriconv.vcxproj(82,5):
> warning MSB4011:
> "C:\Users\matthep\AppData\Local\Microsoft\MSBuild\v4.0\Microsoft.Cpp.Win32.user.props"
> cannot be imported again. It was already imported at
> "C:\Users\matthep\Documents\Code\apr\apr-iconv\build\preapriconv.vcxproj
> (76,5)". This is most likely a build authoring error. This subsequent import
> will be ignored.
> 20>C:\Users\matthep\Documents\Code\apr\apr\build\preaprapp.vcxproj(112,5):
> warning MSB4011:
> "C:\Users\matthep\AppData\Local\Microsoft\MSBuild\v4.0\Microsoft.Cpp.Win32.user.props"
> cannot be imported again. It was already imported at
> "C:\Users\matthep\Documents\Code\apr\apr\build\preaprapp.vcxproj (102,5)".
> This is most likely a build authoring error. This subsequent import will be
> ignored.
> 20>C:\Users\matthep\Documents\Code\apr\apr-iconv\build\preapriconv.vcxproj(82,5):
> warning MSB4011:
> "C:\Users\matthep\AppData\Local\Microsoft\MSBuild\v4.0\Microsoft.Cpp.Win32.user.props"
> cannot be imported again. It was already imported at
> "C:\Users\matthep\Documents\Code\apr\apr-iconv\build\preapriconv.vcxproj
> (76,5)". This is most likely a build authoring error. This subsequent import
> will be ignored.
> 2>C:\Users\matthep\Documents\Code\apr\apr-iconv\build\preapriconv.vcxproj(82,5):
> warning MSB4011:
> "C:\Users\matthep\AppData\Local\Microsoft\MSBuild\v4.0\Microsoft.Cpp.Win32.user.props"
> cannot be imported again. It was already imported at
> "C:\Users\matthep\Documents\Code\apr\apr-iconv\build\preapriconv.vcxproj
> (76,5)". This is most likely a build authoring error. This subsequent import
> will be ignored.
> 21>------ Build started: Project: aprapp, Configuration: Release Win32
> ------
> 22>------ Build started: Project: apriconv, Configuration: Release Win32
> ------
> 2>C:\Users\matthep\Documents\Code\apr\apr\build\aprapp.vcxproj(115,5):
> warning MSB4011:
> "C:\Users\matthep\AppData\Local\Microsoft\MSBuild\v4.0\Microsoft.Cpp.Win32.user.props"
> cannot be imported again. It was already imported at
> "C:\Users\matthep\Documents\Code\apr\apr\build\aprapp.vcxproj (108,5)". This
> is most likely a build authoring error. This subsequent import will be
> ignored.
> 21>C:\Users\matthep\Documents\Code\apr\apr\build\aprapp.vcxproj(115,5):
> warning MSB4011:
> "C:\Users\matthep\AppData\Local\Microsoft\MSBuild\v4.0\Microsoft.Cpp.Win32.user.props"
> cannot be imported again. It was already imported at
> "C:\Users\matthep\Documents\Code\apr\apr\build\aprapp.vcxproj (108,5)". This
> is most likely a build authoring error. This subsequent import will be
> ignored.
> 21>C:\Users\matthep\Documents\Code\apr\apr-iconv\apriconv.vcxproj(78,5):
> warning MSB4011:
> "C:\Users\matthep\AppData\Local\Microsoft\MSBuild\v4.0\Microsoft.Cpp.Win32.user.props"
> cannot be imported again. It was already imported at
> "C:\Users\matthep\Documents\Code\apr\apr-iconv\apriconv.vcxproj (75,5)".
> This is most likely a build authoring error. This subsequent import will be
> ignored.
> 22>C:\Users\matthep\Documents\Code\apr\apr\build\aprapp.vcxproj(115,5):
> warning MSB4011:
> "C:\Users\matthep\AppData\Local\Microsoft\MSBuild\v4.0\Microsoft.Cpp.Win32.user.props"
> cannot be imported again. It was already imported at
> "C:\Users\matthep\Documents\Code\apr\apr\build\aprapp.vcxproj (108,5)". This
> is most likely a build authoring error. This subsequent import will be
> ignored.
> 22>C:\Users\matthep\Documents\Code\apr\apr-iconv\apriconv.vcxproj(78,5):
> warning MSB4011:
> "C:\Users\matthep\AppData\Local\Microsoft\MSBuild\v4.0\Microsoft.Cpp.Win32.user.props"
> cannot be imported again. It was already imported at
> "C:\Users\matthep\Documents\Code\apr\apr-iconv\apriconv.vcxproj (75,5)".
> This is most likely a build authoring error. This subsequent import will be
> ignored.
> 2>C:\Users\matthep\Documents\Code\apr\apr-iconv\apriconv.vcxproj(78,5):
> warning MSB4011:
> "C:\Users\matthep\AppData\Local\Microsoft\MSBuild\v4.0\Microsoft.Cpp.Win32.user.props"
> cannot be imported again. It was already imported at
> "C:\Users\matthep\Documents\Code\apr\apr-iconv\apriconv.vcxproj (75,5)".
> This is most likely a build authoring error. This subsequent import will be
> ignored.
> 2>     Creating library Release\libapr-1.lib and object Release\libapr-1.exp
> 21>  apr_app.c
> 22>  iconv.c
> 2>  libapr.vcxproj ->
> C:\Users\matthep\Documents\Code\apr\apr\Release\libapr-1.dll
> 22>  iconv_ces.c
> 21>  aprapp.vcxproj ->
> C:\Users\matthep\Documents\Code\apr\apr\build\..\LibR\aprapp-1.lib
> 23>------ Build started: Project: libapriconv, Configuration: Release Win32
> ------
> 22>  iconv_ces_euc.c
> 22>  iconv_ces_iso2022.c
> 24>------ Build started: Project: prelibaprapp, Configuration: Release Win32
> ------
> 22>C:\Users\matthep\Documents\Code\apr\apr-iconv\libapriconv.vcxproj(85,5):
> warning MSB4011:
> "C:\Users\matthep\AppData\Local\Microsoft\MSBuild\v4.0\Microsoft.Cpp.Win32.user.props"
> cannot be imported again. It was already imported at
> "C:\Users\matthep\Documents\Code\apr\apr-iconv\libapriconv.vcxproj (75,5)".
> This is most likely a build authoring error. This subsequent import will be
> ignored.
> 23>C:\Users\matthep\Documents\Code\apr\apr-iconv\libapriconv.vcxproj(85,5):
> warning MSB4011:
> "C:\Users\matthep\AppData\Local\Microsoft\MSBuild\v4.0\Microsoft.Cpp.Win32.user.props"
> cannot be imported again. It was already imported at
> "C:\Users\matthep\Documents\Code\apr\apr-iconv\libapriconv.vcxproj (75,5)".
> This is most likely a build authoring error. This subsequent import will be
> ignored.
> 23>C:\Users\matthep\Documents\Code\apr\apr\build\prelibaprapp.vcxproj(116,5):
> warning MSB4011:
> "C:\Users\matthep\AppData\Local\Microsoft\MSBuild\v4.0\Microsoft.Cpp.Win32.user.props"
> cannot be imported again. It was already imported at
> "C:\Users\matthep\Documents\Code\apr\apr\build\prelibaprapp.vcxproj
> (102,5)". This is most likely a build authoring error. This subsequent
> import will be ignored.
> 24>C:\Users\matthep\Documents\Code\apr\apr-iconv\libapriconv.vcxproj(85,5):
> warning MSB4011:
> "C:\Users\matthep\AppData\Local\Microsoft\MSBuild\v4.0\Microsoft.Cpp.Win32.user.props"
> cannot be imported again. It was already imported at
> "C:\Users\matthep\Documents\Code\apr\apr-iconv\libapriconv.vcxproj (75,5)".
> This is most likely a build authoring error. This subsequent import will be
> ignored.
> 24>C:\Users\matthep\Documents\Code\apr\apr\build\prelibaprapp.vcxproj(116,5):
> warning MSB4011:
> "C:\Users\matthep\AppData\Local\Microsoft\MSBuild\v4.0\Microsoft.Cpp.Win32.user.props"
> cannot be imported again. It was already imported at
> "C:\Users\matthep\Documents\Code\apr\apr\build\prelibaprapp.vcxproj
> (102,5)". This is most likely a build authoring error. This subsequent
> import will be ignored.
> 22>C:\Users\matthep\Documents\Code\apr\apr\build\prelibaprapp.vcxproj(116,5):
> warning MSB4011:
> "C:\Users\matthep\AppData\Local\Microsoft\MSBuild\v4.0\Microsoft.Cpp.Win32.user.props"
> cannot be imported again. It was already imported at
> "C:\Users\matthep\Documents\Code\apr\apr\build\prelibaprapp.vcxproj
> (102,5)". This is most likely a build authoring error. This subsequent
> import will be ignored.
> 22>  iconv_int.c
> 23>  iconv.c
> 22>  iconv_module.c
> 22>  iconv_uc.c
> 22>  Generating Code...
> 25>------ Build started: Project: libaprapp, Configuration: Release Win32
> ------
> 22>C:\Users\matthep\Documents\Code\apr\apr\build\libaprapp.vcxproj(108,5):
> warning MSB4011:
> "C:\Users\matthep\AppData\Local\Microsoft\MSBuild\v4.0\Microsoft.Cpp.Win32.user.props"
> cannot be imported again. It was already imported at
> "C:\Users\matthep\Documents\Code\apr\apr\build\libaprapp.vcxproj (101,5)".
> This is most likely a build authoring error. This subsequent import will be
> ignored.
> 23>C:\Users\matthep\Documents\Code\apr\apr\build\libaprapp.vcxproj(108,5):
> warning MSB4011:
> "C:\Users\matthep\AppData\Local\Microsoft\MSBuild\v4.0\Microsoft.Cpp.Win32.user.props"
> cannot be imported again. It was already imported at
> "C:\Users\matthep\Documents\Code\apr\apr\build\libaprapp.vcxproj (101,5)".
> This is most likely a build authoring error. This subsequent import will be
> ignored.
> 25>C:\Users\matthep\Documents\Code\apr\apr\build\libaprapp.vcxproj(108,5):
> warning MSB4011:
> "C:\Users\matthep\AppData\Local\Microsoft\MSBuild\v4.0\Microsoft.Cpp.Win32.user.props"
> cannot be imported again. It was already imported at
> "C:\Users\matthep\Documents\Code\apr\apr\build\libaprapp.vcxproj (101,5)".
> This is most likely a build authoring error. This subsequent import will be
> ignored.
> 25>  apr_app.c
> 22>  apriconv.vcxproj ->
> C:\Users\matthep\Documents\Code\apr\apr-iconv\LibR\apriconv-1.lib
> 23>  iconv_ces.c
> 23>  iconv_ces_euc.c
> 25>  internal.c
> 23>  iconv_ces_iso2022.c
> 23>  iconv_int.c
> 23>  iconv_module.c
> 23>  iconv_uc.c
> 23>  Generating Code...
> 25>  Generating Code...
> 23>     Creating library Release\libapriconv-1.lib and object
> Release\libapriconv-1.exp
> 25>  libaprapp.vcxproj ->
> C:\Users\matthep\Documents\Code\apr\apr\build\..\Release\libaprapp-1.lib
> 23>  libapriconv.vcxproj ->
> C:\Users\matthep\Documents\Code\apr\apr-iconv\Release\libapriconv-1.dll
> 26>------ Build started: Project: libapriconv_ccs_modules, Configuration:
> Release Win32 ------
> 27>------ Build started: Project: libapriconv_ces_modules, Configuration:
> Release Win32 ------
> 26>C:\Users\matthep\Documents\Code\apr\apr-iconv\ccs\libapriconv_ccs_modules.vcxproj(146,5):
> warning MSB4011:
> "C:\Users\matthep\AppData\Local\Microsoft\MSBuild\v4.0\Microsoft.Cpp.Win32.user.props"
> cannot be imported again. It was already imported at
> "C:\Users\matthep\Documents\Code\apr\apr-iconv\ccs\libapriconv_ccs_modules.vcxproj
> (143,5)". This is most likely a build authoring error. This subsequent
> import will be ignored.
> 27>C:\Users\matthep\Documents\Code\apr\apr-iconv\ccs\libapriconv_ccs_modules.vcxproj(146,5):
> warning MSB4011:
> "C:\Users\matthep\AppData\Local\Microsoft\MSBuild\v4.0\Microsoft.Cpp.Win32.user.props"
> cannot be imported again. It was already imported at
> "C:\Users\matthep\Documents\Code\apr\apr-iconv\ccs\libapriconv_ccs_modules.vcxproj
> (143,5)". This is most likely a build authoring error. This subsequent
> import will be ignored.
> 27>C:\Users\matthep\Documents\Code\apr\apr-iconv\ces\libapriconv_ces_modules.vcxproj(146,5):
> warning MSB4011:
> "C:\Users\matthep\AppData\Local\Microsoft\MSBuild\v4.0\Microsoft.Cpp.Win32.user.props"
> cannot be imported again. It was already imported at
> "C:\Users\matthep\Documents\Code\apr\apr-iconv\ces\libapriconv_ces_modules.vcxproj
> (143,5)". This is most likely a build authoring error. This subsequent
> import will be ignored.
> 26>C:\Users\matthep\Documents\Code\apr\apr-iconv\ces\libapriconv_ces_modules.vcxproj(146,5):
> warning MSB4011:
> "C:\Users\matthep\AppData\Local\Microsoft\MSBuild\v4.0\Microsoft.Cpp.Win32.user.props"
> cannot be imported again. It was already imported at
> "C:\Users\matthep\Documents\Code\apr\apr-iconv\ces\libapriconv_ces_modules.vcxproj
> (143,5)". This is most likely a build authoring error. This subsequent
> import will be ignored.
> 27>  _tbl_simple.c
> 26>  adobe-stdenc.c
> 27>     Creating library ..\Release\iconv\_tbl_simple.lib and object
> ..\Release\iconv\_tbl_simple.exp
> 26>     Creating library ..\Release\iconv\adobe-stdenc.lib and object
> ..\Release\iconv\adobe-stdenc.exp
> 27>_tbl_simple.obj : error LNK2011: precompiled object not linked in; image
> may not run
> 27>..\Release\iconv\_tbl_simple.so : fatal error LNK1120: 1 unresolved
> externals
> 27>NMAKE : fatal error U1077: '"C:\Program Files (x86)\Microsoft Visual
> Studio 11.0\VC\bin\link.EXE"' : return code '0x460'
> 27>  Stop.
> 26>adobe-stdenc.obj : error LNK2011: precompiled object not linked in; image
> may not run
> 26>..\Release\iconv\adobe-stdenc.so : fatal error LNK1120: 1 unresolved
> externals
> 26>NMAKE : fatal error U1077: '"C:\Program Files (x86)\Microsoft Visual
> Studio 11.0\VC\bin\link.EXE"' : return code '0x460'
> 26>  Stop.
> 26>C:\Program Files
> (x86)\MSBuild\Microsoft.Cpp\v4.0\V110\Microsoft.MakeFile.Targets(38,5):
> error MSB3073: The command "NMAKE /nologo /f Makefile.win BUILD_MODE="Win32
> Release" BIND_MODE=shared" exited with code 2.
> 27>C:\Program Files
> (x86)\MSBuild\Microsoft.Cpp\v4.0\V110\Microsoft.MakeFile.Targets(38,5):
> error MSB3073: The command "NMAKE /nologo /f Makefile.win BUILD_MODE="Win32
> Release" BIND_MODE=shared" exited with code 2.
> ========== Build: 12 succeeded, 15 failed, 0 up-to-date, 0 skipped
> ==========
>
> Please let me know if there is any more specific information required.
>
> Regards, Paul
>



-- 
Born in Roswell... married an alien...
http://emptyhammock.com/

Mime
View raw message