apr-dev mailing list archives

Site index · List index
Message view « Date » · « Thread »
Top « Date » · « Thread »
From Paul Matthews <thekest...@gmail.com>
Subject Fwd: Issue compiling with VS 2012 RC
Date Sat, 11 Aug 2012 22:43:53 GMT
Fixed =)
   Installed expat lib to meet the requirement from apr_xml_expat.c. Needed
to fix the include C++/Linker includes in apr and libapr. testlib's
Makefile has a hard dependency on the location of the expatMT.lib
(LOCAL_LIB= ..\$(OUTDIR)\apr-2.lib
..\..\expat\win32\bin\Release\libexpatMT.lib) which also needed correction.
Final output is listed below if interested. Thanks a lot for the help Jeff.

1>------ Build started: Project: apr, Configuration: Release Win32 ------
2>------ Build started: Project: libapr, Configuration: Release Win32 ------
1>C:\Users\matthep\Documents\Code\apr\apr\apr.vcxproj(85,5): warning
MSB4011:
"C:\Users\matthep\AppData\Local\Microsoft\MSBuild\v4.0\Microsoft.Cpp.Win32.user.props"
cannot be imported again. It was already imported at
"C:\Users\matthep\Documents\Code\apr\apr\apr.vcxproj (75,5)". This is most
likely a build authoring error. This subsequent import will be ignored.
2>C:\Users\matthep\Documents\Code\apr\apr\apr.vcxproj(85,5): warning
MSB4011:
"C:\Users\matthep\AppData\Local\Microsoft\MSBuild\v4.0\Microsoft.Cpp.Win32.user.props"
cannot be imported again. It was already imported at
"C:\Users\matthep\Documents\Code\apr\apr\apr.vcxproj (75,5)". This is most
likely a build authoring error. This subsequent import will be ignored.
1>C:\Program Files
(x86)\MSBuild\Microsoft.Cpp\v4.0\V110\Microsoft.CppCommon.targets(177,5):
warning MSB8018: No outputs specified for item "include\apr.hw". Its custom
build command will be skipped.
1>C:\Program Files
(x86)\MSBuild\Microsoft.Cpp\v4.0\V110\Microsoft.CppCommon.targets(177,5):
warning MSB8018: No outputs specified for item
"include\private\apu_select_dbm.hw". Its custom build command will be
skipped.
1>C:\Program Files
(x86)\MSBuild\Microsoft.Cpp\v4.0\V110\Microsoft.CppCommon.targets(177,5):
warning MSB8018: No outputs specified for item "include\apu_want.hw". Its
custom build command will be skipped.
1>C:\Users\matthep\Documents\Code\apr\apr\libapr.vcxproj(81,5): warning
MSB4011:
"C:\Users\matthep\AppData\Local\Microsoft\MSBuild\v4.0\Microsoft.Cpp.Win32.user.props"
cannot be imported again. It was already imported at
"C:\Users\matthep\Documents\Code\apr\apr\libapr.vcxproj (75,5)". This is
most likely a build authoring error. This subsequent import will be
ignored.
2>C:\Users\matthep\Documents\Code\apr\apr\libapr.vcxproj(81,5): warning
MSB4011:
"C:\Users\matthep\AppData\Local\Microsoft\MSBuild\v4.0\Microsoft.Cpp.Win32.user.props"
cannot be imported again. It was already imported at
"C:\Users\matthep\Documents\Code\apr\apr\libapr.vcxproj (75,5)". This is
most likely a build authoring error. This subsequent import will be
ignored.
2>C:\Program Files
(x86)\MSBuild\Microsoft.Cpp\v4.0\V110\Microsoft.CppCommon.targets(177,5):
warning MSB8018: No outputs specified for item "include\apr.hw". Its custom
build command will be skipped.
2>C:\Program Files
(x86)\MSBuild\Microsoft.Cpp\v4.0\V110\Microsoft.CppCommon.targets(177,5):
warning MSB8018: No outputs specified for item
"include\private\apu_select_dbm.hw". Its custom build command will be
skipped.
2>C:\Program Files
(x86)\MSBuild\Microsoft.Cpp\v4.0\V110\Microsoft.CppCommon.targets(177,5):
warning MSB8018: No outputs specified for item "include\apu_want.hw". Its
custom build command will be skipped.
1>  apr_atomic.c
2>  apr_atomic.c
1>  apr_brigade.c
2>  apr_brigade.c
1>  apr_buckets.c
2>  apr_buckets.c
1>  apr_buckets_alloc.c
2>  apr_buckets_alloc.c
1>  apr_buckets_eos.c
2>  apr_buckets_eos.c
1>  apr_buckets_file.c
2>  apr_buckets_file.c
1>  apr_buckets_flush.c
2>  apr_buckets_flush.c
1>  apr_buckets_heap.c
2>  apr_buckets_heap.c
1>  apr_buckets_mmap.c
2>  apr_buckets_mmap.c
1>  apr_buckets_pipe.c
2>  apr_buckets_pipe.c
1>  apr_buckets_pool.c
2>  apr_buckets_pool.c
1>  apr_buckets_refcount.c
2>  apr_buckets_refcount.c
1>  apr_buckets_simple.c
2>  apr_buckets_simple.c
1>  apr_buckets_socket.c
2>  apr_buckets_socket.c
1>  apr_crypto.c
2>  apr_crypto.c
1>  apr_md4.c
2>  apr_md4.c
1>  apr_md5.c
2>  apr_md5.c
1>  apr_passwd.c
2>  apr_passwd.c
1>  apr_sha1.c
2>  apr_sha1.c
1>  crypt_blowfish.c
2>  crypt_blowfish.c
1>crypto\crypt_blowfish.c(894): warning C4244: '=' : conversion from
'unsigned long' to 'char', possible loss of data
2>crypto\crypt_blowfish.c(894): warning C4244: '=' : conversion from
'unsigned long' to 'char', possible loss of data
1>  Generating Code...
2>  Generating Code...
1>  Compiling...
1>  getuuid.c
2>  Compiling...
2>  getuuid.c
2>  uuid.c
1>  uuid.c
2>  apr_dbd.c
1>  apr_dbd.c
1>  apr_dbd_freetds.c
2>  apr_dbd_freetds.c
2>  apr_dbd_mysql.c
1>  apr_dbd_mysql.c
2>  apr_dbd_odbc.c
1>  apr_dbd_odbc.c
2>  apr_dbd_oracle.c
1>  apr_dbd_oracle.c
1>  apr_dbd_pgsql.c
2>  apr_dbd_pgsql.c
2>  apr_dbd_sqlite2.c
1>  apr_dbd_sqlite2.c
2>  apr_dbd_sqlite3.c
1>  apr_dbd_sqlite3.c
2>  apr_dbm.c
1>  apr_dbm.c
2>  apr_dbm_berkeleydb.c
1>  apr_dbm_berkeleydb.c
2>  apr_dbm_gdbm.c
1>  apr_dbm_gdbm.c
2>  apr_dbm_sdbm.c
1>  apr_dbm_sdbm.c
2>  dso.c
1>  dso.c
2>  apr_base64.c
1>  apr_base64.c
2>  buffer.c
1>  buffer.c
2>  copy.c
1>  copy.c
2>  dir.c
1>  dir.c
2>  fileacc.c
1>  fileacc.c
2>  Generating Code...
1>  Generating Code...
2>  Compiling...
2>  filedup.c
1>  Compiling...
1>  filedup.c
2>  filepath.c
1>  filepath.c
2>  filepath_util.c
1>  filepath_util.c
2>  filestat.c
1>  filestat.c
2>  filesys.c
1>  filesys.c
2>  flock.c
1>  flock.c
2>  fullrw.c
1>  fullrw.c
2>  mktemp.c
1>  mktemp.c
2>  open.c
1>  open.c
2>  pipe.c
1>  pipe.c
2>  readwrite.c
1>  readwrite.c
2>  seek.c
1>  seek.c
2>  tempdir.c
1>  tempdir.c
2>  apr_hooks.c
1>  apr_hooks.c
2>  proc_mutex.c
1>  proc_mutex.c
2>  thread_cond.c
1>  thread_cond.c
2>  thread_mutex.c
1>  thread_mutex.c
2>  thread_rwlock.c
1>  thread_rwlock.c
2>  apr_memcache.c
1>  apr_memcache.c
2>  apr_pools.c
1>  apr_pools.c
2>  Generating Code...
1>  Generating Code...
2>  Compiling...
2>  charset.c
1>  Compiling...
1>  charset.c
2>  env.c
1>  env.c
2>  errorcodes.c
1>  errorcodes.c
2>  getopt.c
1>  getopt.c
2>  internal.c
1>  internal.c
2>  misc.c
1>  misc.c
2>  otherchild.c
1>  otherchild.c
2>  rand.c
1>  rand.c
2>  start.c
1>  start.c
2>  utf8.c
1>  utf8.c
2>  version.c
1>  version.c
2>  common.c
1>  common.c
2>  mmap.c
1>  mmap.c
2>  inet_ntop.c
1>  inet_ntop.c
2>  inet_pton.c
1>  inet_pton.c
2>  multicast.c
1>  multicast.c
2>  sendrecv.c
1>  sendrecv.c
2>  sockaddr.c
1>  sockaddr.c
2>  sockets.c
1>  sockets.c
2>  socket_util.c
1>  socket_util.c
2>  Generating Code...
1>  Generating Code...
2>  Compiling...
2>  sockopt.c
1>  Compiling...
1>  sockopt.c
2>  apr_getpass.c
1>  apr_getpass.c
2>  pollcb.c
1>  pollcb.c
2>  pollset.c
1>  pollset.c
2>  poll.c
1>  poll.c
2>  select.c
1>  select.c
2>  wakeup.c
1>  wakeup.c
2>  apr_random.c
1>  apr_random.c
2>  sha2.c
1>  sha2.c
2>  sha2_glue.c
1>  sha2_glue.c
2>  sdbm.c
1>  sdbm.c
2>  sdbm_hash.c
1>  sdbm_hash.c
2>  sdbm_lock.c
1>  sdbm_lock.c
2>  sdbm_pair.c
1>  sdbm_pair.c
2>  shm.c
1>  shm.c
2>  apr_cpystrn.c
1>  apr_cpystrn.c
2>  apr_fnmatch.c
1>  apr_fnmatch.c
2>  apr_snprintf.c
1>  apr_snprintf.c
2>  apr_strings.c
1>  apr_strings.c
2>  apr_strnatcmp.c
1>  apr_strnatcmp.c
2>  Generating Code...
1>  Generating Code...
2>  Compiling...
2>  apr_strtok.c
1>  Compiling...
1>  apr_strtok.c
2>  apr_strmatch.c
1>  apr_strmatch.c
2>  apr_hash.c
1>  apr_hash.c
2>  apr_tables.c
1>  apr_tables.c
2>  proc.c
1>  proc.c
2>  signals.c
1>  signals.c
2>  thread.c
1>  thread.c
2>  threadpriv.c
1>  threadpriv.c
2>  time.c
1>  time.c
2>  timestr.c
1>  timestr.c
2>  apr_uri.c
1>  apr_uri.c
2>  groupinfo.c
1>  groupinfo.c
2>  userinfo.c
1>  userinfo.c
2>  apr_date.c
1>  apr_date.c
2>  apu_dso.c
1>  apu_dso.c
2>  apr_queue.c
1>  apr_queue.c
2>  apr_reslist.c
1>  apr_reslist.c
2>  apr_rmm.c
1>  apr_rmm.c
2>  apr_thread_pool.c
1>  apr_thread_pool.c
2>  xlate.c
1>  xlate.c
2>  Generating Code...
1>  Generating Code...
2>  Compiling...
2>  apr_xml.c
1>  Compiling...
1>  apr_xml.c
2>  apr_xml_expat.c
1>  apr_xml_expat.c
2>  Generating Code...
1>  Generating Code...
2>     Creating library Release\libapr-2.lib and object Release\libapr-2.exp
1>  apr.vcxproj -> C:\Users\matthep\Documents\Code\apr\apr\LibR\apr-2.lib
2>  libapr.vcxproj ->
C:\Users\matthep\Documents\Code\apr\apr\Release\libapr-2.dll
3>------ Build started: Project: preaprapp, Configuration: Release Win32
------
2>C:\Users\matthep\Documents\Code\apr\apr\build\preaprapp.vcxproj(82,5):
warning MSB4011:
"C:\Users\matthep\AppData\Local\Microsoft\MSBuild\v4.0\Microsoft.Cpp.Win32.user.props"
cannot be imported again. It was already imported at
"C:\Users\matthep\Documents\Code\apr\apr\build\preaprapp.vcxproj (76,5)".
This is most likely a build authoring error. This subsequent import will be
ignored.
3>C:\Users\matthep\Documents\Code\apr\apr\build\preaprapp.vcxproj(82,5):
warning MSB4011:
"C:\Users\matthep\AppData\Local\Microsoft\MSBuild\v4.0\Microsoft.Cpp.Win32.user.props"
cannot be imported again. It was already imported at
"C:\Users\matthep\Documents\Code\apr\apr\build\preaprapp.vcxproj (76,5)".
This is most likely a build authoring error. This subsequent import will be
ignored.
4>------ Build started: Project: prelibaprapp, Configuration: Release Win32
------
4>C:\Users\matthep\Documents\Code\apr\apr\build\prelibaprapp.vcxproj(82,5):
warning MSB4011:
"C:\Users\matthep\AppData\Local\Microsoft\MSBuild\v4.0\Microsoft.Cpp.Win32.user.props"
cannot be imported again. It was already imported at
"C:\Users\matthep\Documents\Code\apr\apr\build\prelibaprapp.vcxproj
(76,5)". This is most likely a build authoring error. This subsequent
import will be ignored.
5>------ Build started: Project: aprapp, Configuration: Release Win32 ------
5>C:\Users\matthep\Documents\Code\apr\apr\build\aprapp.vcxproj(81,5):
warning MSB4011:
"C:\Users\matthep\AppData\Local\Microsoft\MSBuild\v4.0\Microsoft.Cpp.Win32.user.props"
cannot be imported again. It was already imported at
"C:\Users\matthep\Documents\Code\apr\apr\build\aprapp.vcxproj (78,5)". This
is most likely a build authoring error. This subsequent import will be
ignored.
5>  apr_app.c
6>------ Build started: Project: libaprapp, Configuration: Release Win32
------
5>C:\Users\matthep\Documents\Code\apr\apr\build\libaprapp.vcxproj(78,5):
warning MSB4011:
"C:\Users\matthep\AppData\Local\Microsoft\MSBuild\v4.0\Microsoft.Cpp.Win32.user.props"
cannot be imported again. It was already imported at
"C:\Users\matthep\Documents\Code\apr\apr\build\libaprapp.vcxproj (75,5)".
This is most likely a build authoring error. This subsequent import will be
ignored.
6>C:\Users\matthep\Documents\Code\apr\apr\build\libaprapp.vcxproj(78,5):
warning MSB4011:
"C:\Users\matthep\AppData\Local\Microsoft\MSBuild\v4.0\Microsoft.Cpp.Win32.user.props"
cannot be imported again. It was already imported at
"C:\Users\matthep\Documents\Code\apr\apr\build\libaprapp.vcxproj (75,5)".
This is most likely a build authoring error. This subsequent import will be
ignored.
6>  apr_app.c
5>  aprapp.vcxproj ->
C:\Users\matthep\Documents\Code\apr\apr\build\..\LibR\aprapp-2.lib
6>  internal.c
6>  Generating Code...
6>  libaprapp.vcxproj ->
C:\Users\matthep\Documents\Code\apr\apr\build\..\Release\libaprapp-2.lib
7>------ Build started: Project: testlib, Configuration: Release Win32
------
7>C:\Users\matthep\Documents\Code\apr\apr\test\testlib.vcxproj(120,5):
warning MSB4011:
"C:\Users\matthep\AppData\Local\Microsoft\MSBuild\v4.0\Microsoft.Cpp.Win32.user.props"
cannot be imported again. It was already imported at
"C:\Users\matthep\Documents\Code\apr\apr\test\testlib.vcxproj (105,5)".
This is most likely a build authoring error. This subsequent import will be
ignored.
8>------ Build started: Project: testdll, Configuration: Release Win32
------
7>C:\Users\matthep\Documents\Code\apr\apr\test\testdll.vcxproj(112,5):
warning MSB4011:
"C:\Users\matthep\AppData\Local\Microsoft\MSBuild\v4.0\Microsoft.Cpp.Win32.user.props"
cannot be imported again. It was already imported at
"C:\Users\matthep\Documents\Code\apr\apr\test\testdll.vcxproj (106,5)".
This is most likely a build authoring error. This subsequent import will be
ignored.
8>C:\Users\matthep\Documents\Code\apr\apr\test\testdll.vcxproj(112,5):
warning MSB4011:
"C:\Users\matthep\AppData\Local\Microsoft\MSBuild\v4.0\Microsoft.Cpp.Win32.user.props"
cannot be imported again. It was already imported at
"C:\Users\matthep\Documents\Code\apr\apr\test\testdll.vcxproj (106,5)".
This is most likely a build authoring error. This subsequent import will be
ignored.
7>
7>  Microsoft (R) Program Maintenance Utility Version 11.00.50522.1
7>  Copyright (C) Microsoft Corporation.  All rights reserved.
7>
7>  Building tests into LibR for static
7>   cl.exe /nologo /c /W3 /Gm /EHsc /Zi /Od /I "../include"  /D
APR_DECLARE_STATIC /MD /D "BINPATH=LibR"  /D _DEBUG /D WIN32 /Fo"LibR/" /FD
-c mod_test.c  -FdLibR\ /I "../include"
7>  mod_test.c
8>
8>  Microsoft (R) Program Maintenance Utility Version 11.00.50522.1
8>  Copyright (C) Microsoft Corporation.  All rights reserved.
8>
8>  Building tests into Release for dynamic
8>   link.exe /nologo /dll /debug /subsystem:windows /incremental:no
/out:"Release\mod_test.dll" Release/mod_test.obj ..\Release\libapr-2.lib
 /export:print_hello /export:count_reps kernel32.lib advapi32.lib
ws2_32.lib wsock32.lib  ole32.lib shell32.lib rpcrt4.lib
8>     Creating library Release\mod_test.lib and object Release\mod_test.exp
8>   link.exe /nologo /debug /subsystem:console /incremental:no
/nodefaultlib:libcmt /out:"Release\occhild.exe" Release\occhild.obj
..\Release\libapr-2.lib kernel32.lib advapi32.lib ws2_32.lib wsock32.lib
 ole32.lib shell32.lib rpcrt4.lib
7>   link.exe /nologo /dll /debug /subsystem:windows /incremental:no
/out:"LibR\mod_test.dll" LibR/mod_test.obj ..\LibR\apr-2.lib
..\expat\win32\bin\Release\libexpatMT.lib  /export:print_hello
/export:count_reps kernel32.lib advapi32.lib ws2_32.lib wsock32.lib
 ole32.lib shell32.lib rpcrt4.lib
7>     Creating library LibR\mod_test.lib and object LibR\mod_test.exp
8>   link.exe /nologo /debug /subsystem:console /incremental:no
/nodefaultlib:libcmt /out:"Release\readchild.exe" Release\readchild.obj
..\Release\libapr-2.lib kernel32.lib advapi32.lib ws2_32.lib wsock32.lib
 ole32.lib shell32.lib rpcrt4.lib
8>   link.exe /nologo /debug /subsystem:console /incremental:no
/nodefaultlib:libcmt /out:"Release\proc_child.exe" Release\proc_child.obj
..\Release\libapr-2.lib kernel32.lib advapi32.lib ws2_32.lib wsock32.lib
 ole32.lib shell32.lib rpcrt4.lib
7>   cl.exe /nologo /c /W3 /Gm /EHsc /Zi /Od /I "../include"  /D
APR_DECLARE_STATIC /MD /D "BINPATH=LibR"  /D _DEBUG /D WIN32 /Fo"LibR/" /FD
-c occhild.c  -FdLibR\ /I "../include"
7>  occhild.c
8>   link.exe /nologo /debug /subsystem:console /incremental:no
/nodefaultlib:libcmt /out:"Release\tryread.exe" Release\tryread.obj
..\Release\libapr-2.lib kernel32.lib advapi32.lib ws2_32.lib wsock32.lib
 ole32.lib shell32.lib rpcrt4.lib
8>   link.exe /nologo /debug /subsystem:console /incremental:no
/nodefaultlib:libcmt /out:"Release\sockchild.exe" Release\sockchild.obj
..\Release\libapr-2.lib kernel32.lib advapi32.lib ws2_32.lib wsock32.lib
 ole32.lib shell32.lib rpcrt4.lib
7>   link.exe /nologo /debug /subsystem:console /incremental:no
/nodefaultlib:libcmt /out:"LibR\occhild.exe" LibR\occhild.obj
..\LibR\apr-2.lib ..\expat\win32\bin\Release\libexpatMT.lib kernel32.lib
advapi32.lib ws2_32.lib wsock32.lib  ole32.lib shell32.lib rpcrt4.lib
8>   link.exe /nologo /debug /subsystem:console /incremental:no
/nodefaultlib:libcmt /out:"Release\testshmproducer.exe"
Release\testshmproducer.obj ..\Release\libapr-2.lib kernel32.lib
advapi32.lib ws2_32.lib wsock32.lib  ole32.lib shell32.lib rpcrt4.lib
7>   cl.exe /nologo /c /W3 /Gm /EHsc /Zi /Od /I "../include"  /D
APR_DECLARE_STATIC /MD /D "BINPATH=LibR"  /D _DEBUG /D WIN32 /Fo"LibR/" /FD
-c readchild.c  -FdLibR\ /I "../include"
7>  readchild.c
8>   link.exe /nologo /debug /subsystem:console /incremental:no
/nodefaultlib:libcmt /out:"Release\testshmconsumer.exe"
Release\testshmconsumer.obj ..\Release\libapr-2.lib kernel32.lib
advapi32.lib ws2_32.lib wsock32.lib  ole32.lib shell32.lib rpcrt4.lib
7>   link.exe /nologo /debug /subsystem:console /incremental:no
/nodefaultlib:libcmt /out:"LibR\readchild.exe" LibR\readchild.obj
..\LibR\apr-2.lib ..\expat\win32\bin\Release\libexpatMT.lib kernel32.lib
advapi32.lib ws2_32.lib wsock32.lib  ole32.lib shell32.lib rpcrt4.lib
8>   link.exe /nologo /debug /subsystem:console /incremental:no
/nodefaultlib:libcmt /out:"Release\globalmutexchild.exe"
Release\globalmutexchild.obj ..\Release\libapr-2.lib kernel32.lib
advapi32.lib ws2_32.lib wsock32.lib  ole32.lib shell32.lib rpcrt4.lib
8>   link.exe /nologo /debug /subsystem:console /incremental:no
/nodefaultlib:libcmt /entry:wmainCRTStartup /out:"Release\testapp.exe"
Release/testapp.obj ..\Release\libapr-2.lib ..\Release\libaprapp-2.lib
kernel32.lib advapi32.lib ws2_32.lib wsock32.lib  ole32.lib shell32.lib
rpcrt4.lib
7>   cl.exe /nologo /c /W3 /Gm /EHsc /Zi /Od /I "../include"  /D
APR_DECLARE_STATIC /MD /D "BINPATH=LibR"  /D _DEBUG /D WIN32 /Fo"LibR/" /FD
-c proc_child.c  -FdLibR\ /I "../include"
7>  proc_child.c
8>   link.exe /nologo /debug /subsystem:console /incremental:no
/nodefaultlib:libcmt /out:"Release\testall.exe" Release\testargs.obj
Release\testatomic.obj Release\testbase64.obj Release\testbuckets.obj
Release\testcond.obj Release\testcrypto.obj Release\testdate.obj
Release\testdbd.obj Release\testdbm.obj Release\testdir.obj
Release\testdso.obj Release\testdup.obj Release\testenv.obj
Release\testfile.obj Release\testfilecopy.obj Release\testfileinfo.obj
Release\testflock.obj Release\testfmt.obj Release\testfnmatch.obj
Release\testglobalmutex.obj Release\testhash.obj Release\testhooks.obj
Release\testipsub.obj Release\testlfs.obj Release\testlfsabi.obj
Release\testlfsabi32.obj Release\testlfsabi64.obj Release\testlock.obj
Release\testmd4.obj Release\testmd5.obj Release\testmemcache.obj
Release\testmmap.obj Release\testnames.obj Release\testoc.obj
Release\testpass.obj Release\testpath.obj Release\testpipe.obj
Release\testpoll.obj Release\testpools.obj Release\testproc.obj
Release\testprocmutex.obj Release\testqueue.obj Release\testrand.obj
Release\testreslist.obj Release\testrmm.obj Release\testshm.obj
Release\testsleep.obj Release\testsock.obj Release\testsockets.obj
Release\testsockopt.obj Release\teststr.obj Release\teststrmatch.obj
Release\teststrnatcmp.obj Release\testtable.obj Release\testtemp.obj
Release\testthread.obj Release\testtime.obj Release\testud.obj
Release\testuri.obj Release\testuser.obj Release\testutil.obj
Release\testuuid.obj Release\testvsn.obj Release\testxlate.obj
Release\testxml.obj Release\abts.obj ..\Release\libapr-2.lib kernel32.lib
advapi32.lib ws2_32.lib wsock32.lib  ole32.lib shell32.lib rpcrt4.lib
7>   link.exe /nologo /debug /subsystem:console /incremental:no
/nodefaultlib:libcmt /out:"LibR\proc_child.exe" LibR\proc_child.obj
..\LibR\apr-2.lib ..\expat\win32\bin\Release\libexpatMT.lib kernel32.lib
advapi32.lib ws2_32.lib wsock32.lib  ole32.lib shell32.lib rpcrt4.lib
8>   link.exe /nologo /debug /subsystem:console /incremental:no
/nodefaultlib:libcmt /out:"Release\testlockperf.exe"
Release\testlockperf.obj ..\Release\libapr-2.lib kernel32.lib advapi32.lib
ws2_32.lib wsock32.lib  ole32.lib shell32.lib rpcrt4.lib
7>   cl.exe /nologo /c /W3 /Gm /EHsc /Zi /Od /I "../include"  /D
APR_DECLARE_STATIC /MD /D "BINPATH=LibR"  /D _DEBUG /D WIN32 /Fo"LibR/" /FD
-c tryread.c  -FdLibR\ /I "../include"
7>  tryread.c
8>   link.exe /nologo /debug /subsystem:console /incremental:no
/nodefaultlib:libcmt /out:"Release\testmutexscope.exe"
Release\testmutexscope.obj ..\Release\libapr-2.lib kernel32.lib
advapi32.lib ws2_32.lib wsock32.lib  ole32.lib shell32.lib rpcrt4.lib
7>   link.exe /nologo /debug /subsystem:console /incremental:no
/nodefaultlib:libcmt /out:"LibR\tryread.exe" LibR\tryread.obj
..\LibR\apr-2.lib ..\expat\win32\bin\Release\libexpatMT.lib kernel32.lib
advapi32.lib ws2_32.lib wsock32.lib  ole32.lib shell32.lib rpcrt4.lib
8>   link.exe /nologo /debug /subsystem:console /incremental:no
/nodefaultlib:libcmt /out:"Release\echod.exe" Release\echod.obj
..\Release\libapr-2.lib kernel32.lib advapi32.lib ws2_32.lib wsock32.lib
 ole32.lib shell32.lib rpcrt4.lib
7>   cl.exe /nologo /c /W3 /Gm /EHsc /Zi /Od /I "../include"  /D
APR_DECLARE_STATIC /MD /D "BINPATH=LibR"  /D _DEBUG /D WIN32 /Fo"LibR/" /FD
-c sockchild.c  -FdLibR\ /I "../include"
7>  sockchild.c
8>   link.exe /nologo /debug /subsystem:console /incremental:no
/nodefaultlib:libcmt /out:"Release\sendfile.exe" Release\sendfile.obj
..\Release\libapr-2.lib kernel32.lib advapi32.lib ws2_32.lib wsock32.lib
 ole32.lib shell32.lib rpcrt4.lib
8>   link.exe /nologo /debug /subsystem:console /incremental:no
/nodefaultlib:libcmt /out:"Release\sockperf.exe" Release\sockperf.obj
..\Release\libapr-2.lib kernel32.lib advapi32.lib ws2_32.lib wsock32.lib
 ole32.lib shell32.lib rpcrt4.lib
7>   link.exe /nologo /debug /subsystem:console /incremental:no
/nodefaultlib:libcmt /out:"LibR\sockchild.exe" LibR\sockchild.obj
..\LibR\apr-2.lib ..\expat\win32\bin\Release\libexpatMT.lib kernel32.lib
advapi32.lib ws2_32.lib wsock32.lib  ole32.lib shell32.lib rpcrt4.lib
7>   cl.exe /nologo /c /W3 /Gm /EHsc /Zi /Od /I "../include"  /D
APR_DECLARE_STATIC /MD /D "BINPATH=LibR"  /D _DEBUG /D WIN32 /Fo"LibR/" /FD
-c testshmproducer.c  -FdLibR\ /I "../include"
8>  Testing Release\testapp.exe
7>  testshmproducer.c
8>  Release\testapp.exe failed
8>  Testing Release\testall.exe
8>  Release\testall.exe failed
8>  Testing Release\testlockperf.exe
8>  Release\testlockperf.exe failed
8>  Testing Release\testmutexscope.exe
8>  Release\testmutexscope.exe failed
7>   link.exe /nologo /debug /subsystem:console /incremental:no
/nodefaultlib:libcmt /out:"LibR\testshmproducer.exe"
LibR\testshmproducer.obj ..\LibR\apr-2.lib
..\expat\win32\bin\Release\libexpatMT.lib kernel32.lib advapi32.lib
ws2_32.lib wsock32.lib  ole32.lib shell32.lib rpcrt4.lib
7>   cl.exe /nologo /c /W3 /Gm /EHsc /Zi /Od /I "../include"  /D
APR_DECLARE_STATIC /MD /D "BINPATH=LibR"  /D _DEBUG /D WIN32 /Fo"LibR/" /FD
-c testshmconsumer.c  -FdLibR\ /I "../include"
7>  testshmconsumer.c
7>   link.exe /nologo /debug /subsystem:console /incremental:no
/nodefaultlib:libcmt /out:"LibR\testshmconsumer.exe"
LibR\testshmconsumer.obj ..\LibR\apr-2.lib
..\expat\win32\bin\Release\libexpatMT.lib kernel32.lib advapi32.lib
ws2_32.lib wsock32.lib  ole32.lib shell32.lib rpcrt4.lib
7>   cl.exe /nologo /c /W3 /Gm /EHsc /Zi /Od /I "../include"  /D
APR_DECLARE_STATIC /MD /D "BINPATH=LibR"  /D _DEBUG /D WIN32 /Fo"LibR/" /FD
-c globalmutexchild.c  -FdLibR\ /I "../include"
7>  globalmutexchild.c
7>   link.exe /nologo /debug /subsystem:console /incremental:no
/nodefaultlib:libcmt /out:"LibR\globalmutexchild.exe"
LibR\globalmutexchild.obj ..\LibR\apr-2.lib
..\expat\win32\bin\Release\libexpatMT.lib kernel32.lib advapi32.lib
ws2_32.lib wsock32.lib  ole32.lib shell32.lib rpcrt4.lib
7>   cl.exe /nologo /c /W3 /Gm /EHsc /Zi /Od /I "../include"  /D
APR_DECLARE_STATIC /MD /D "BINPATH=LibR"  /D _DEBUG /D WIN32 /Fo"LibR/" /FD
-c testapp.c  -FdLibR\ /I "../include"
7>  testapp.c
7>   link.exe /nologo /debug /subsystem:console /incremental:no
/nodefaultlib:libcmt /entry:wmainCRTStartup /out:"LibR\testapp.exe"
LibR/testapp.obj ..\LibR\apr-2.lib
..\expat\win32\bin\Release\libexpatMT.lib ..\LibR\aprapp-2.lib kernel32.lib
advapi32.lib ws2_32.lib wsock32.lib  ole32.lib shell32.lib rpcrt4.lib
7>   cl.exe /nologo /c /W3 /Gm /EHsc /Zi /Od /I "../include"  /D
APR_DECLARE_STATIC /MD /D "BINPATH=LibR"  /D _DEBUG /D WIN32 /Fo"LibR/" /FD
-c testargs.c testatomic.c testbase64.c testbuckets.c testcond.c
testcrypto.c testdate.c testdbd.c testdbm.c testdir.c testdso.c testdup.c
testenv.c testfile.c testfilecopy.c testfileinfo.c testflock.c testfmt.c
testfnmatch.c testglobalmutex.c testhash.c testhooks.c testipsub.c
testlfs.c testlfsabi.c testlfsabi32.c testlfsabi64.c testlock.c testmd4.c
testmd5.c testmemcache.c testmmap.c testnames.c testoc.c testpass.c
testpath.c testpipe.c testpoll.c testpools.c testproc.c testprocmutex.c
testqueue.c testrand.c testreslist.c testrmm.c testshm.c testsleep.c
testsock.c testsockets.c testsockopt.c teststr.c teststrmatch.c
teststrnatcmp.c testtable.c testtemp.c testthread.c testtime.c testud.c
testuri.c testuser.c testutil.c testuuid.c testvsn.c testxlate.c testxml.c
abts.c  -FdLibR\ /I "../include"
7>  abts.c
7>  testxml.c
7>  testxlate.c
7>  testvsn.c
7>  testuuid.c
7>  testutil.c
7>  testuser.c
7>  testuri.c
7>  testud.c
7>  testtime.c
7>  testthread.c
7>  testtemp.c
7>  testtable.c
7>  teststrnatcmp.c
7>  teststrmatch.c
7>  teststr.c
7>  testsockopt.c
7>  testsockets.c
7>  testsock.c
7>  testsleep.c
7>  Generating Code...
7>  Compiling...
7>  testshm.c
7>  testrmm.c
7>  testreslist.c
7>  testrand.c
7>  testqueue.c
7>  testprocmutex.c
7>  testproc.c
7>  testpools.c
7>  testpoll.c
7>  testpipe.c
7>  testpath.c
7>  testpass.c
7>  testoc.c
7>  testnames.c
7>  testmmap.c
7>  testmemcache.c
7>testmemcache.c(116): warning C4013: 'getpid' undefined; assuming extern
returning int
7>  testmd5.c
7>  testmd4.c
7>  testlock.c
7>  testlfsabi64.c
7>  Generating Code...
7>  Compiling...
7>  testlfsabi32.c
7>  testlfsabi.c
7>  testlfs.c
7>  testipsub.c
7>  testhooks.c
7>  testhash.c
7>  testglobalmutex.c
7>  testfnmatch.c
7>  testfmt.c
7>  testflock.c
7>  testfileinfo.c
7>  testfilecopy.c
7>  testfile.c
7>  testenv.c
7>  testdup.c
7>  testdso.c
7>  testdir.c
7>  testdbm.c
7>  testdbd.c
7>  testdate.c
7>  Generating Code...
7>  Compiling...
7>  testcrypto.c
7>  testcond.c
7>  testbuckets.c
7>  testbase64.c
7>  testatomic.c
7>  testargs.c
7>  Generating Code...
7>   link.exe /nologo /debug /subsystem:console /incremental:no
/nodefaultlib:libcmt /out:"LibR\testall.exe" LibR\testargs.obj
LibR\testatomic.obj LibR\testbase64.obj LibR\testbuckets.obj
LibR\testcond.obj LibR\testcrypto.obj LibR\testdate.obj LibR\testdbd.obj
LibR\testdbm.obj LibR\testdir.obj LibR\testdso.obj LibR\testdup.obj
LibR\testenv.obj LibR\testfile.obj LibR\testfilecopy.obj
LibR\testfileinfo.obj LibR\testflock.obj LibR\testfmt.obj
LibR\testfnmatch.obj LibR\testglobalmutex.obj LibR\testhash.obj
LibR\testhooks.obj LibR\testipsub.obj LibR\testlfs.obj LibR\testlfsabi.obj
LibR\testlfsabi32.obj LibR\testlfsabi64.obj LibR\testlock.obj
LibR\testmd4.obj LibR\testmd5.obj LibR\testmemcache.obj LibR\testmmap.obj
LibR\testnames.obj LibR\testoc.obj LibR\testpass.obj LibR\testpath.obj
LibR\testpipe.obj LibR\testpoll.obj LibR\testpools.obj LibR\testproc.obj
LibR\testprocmutex.obj LibR\testqueue.obj LibR\testrand.obj
LibR\testreslist.obj LibR\testrmm.obj LibR\testshm.obj LibR\testsleep.obj
LibR\testsock.obj LibR\testsockets.obj LibR\testsockopt.obj
LibR\teststr.obj LibR\teststrmatch.obj LibR\teststrnatcmp.obj
LibR\testtable.obj LibR\testtemp.obj LibR\testthread.obj LibR\testtime.obj
LibR\testud.obj LibR\testuri.obj LibR\testuser.obj LibR\testutil.obj
LibR\testuuid.obj LibR\testvsn.obj LibR\testxlate.obj LibR\testxml.obj
LibR\abts.obj ..\LibR\apr-2.lib ..\expat\win32\bin\Release\libexpatMT.lib
kernel32.lib advapi32.lib ws2_32.lib wsock32.lib  ole32.lib shell32.lib
rpcrt4.lib
7>     Creating library LibR\testall.lib and object LibR\testall.exp
7>libexpatMT.lib(xmlparse.obj) : warning LNK4099: PDB 'vc100.pdb' was not
found with 'libexpatMT.lib(xmlparse.obj)' or at
'C:\Users\matthep\Documents\Code\apr\apr\test\LibR\vc100.pdb'; linking
object as if no debug info
7>libexpatMT.lib(xmlrole.obj) : warning LNK4099: PDB 'vc100.pdb' was not
found with 'libexpatMT.lib(xmlrole.obj)' or at
'C:\Users\matthep\Documents\Code\apr\apr\test\LibR\vc100.pdb'; linking
object as if no debug info
7>libexpatMT.lib(xmltok.obj) : warning LNK4099: PDB 'vc100.pdb' was not
found with 'libexpatMT.lib(xmltok.obj)' or at
'C:\Users\matthep\Documents\Code\apr\apr\test\LibR\vc100.pdb'; linking
object as if no debug info
7>   cl.exe /nologo /c /W3 /Gm /EHsc /Zi /Od /I "../include"  /D
APR_DECLARE_STATIC /MD /D "BINPATH=LibR"  /D _DEBUG /D WIN32 /Fo"LibR/" /FD
-c testlockperf.c  -FdLibR\ /I "../include"
7>  testlockperf.c
7>   link.exe /nologo /debug /subsystem:console /incremental:no
/nodefaultlib:libcmt /out:"LibR\testlockperf.exe" LibR\testlockperf.obj
..\LibR\apr-2.lib ..\expat\win32\bin\Release\libexpatMT.lib kernel32.lib
advapi32.lib ws2_32.lib wsock32.lib  ole32.lib shell32.lib rpcrt4.lib
7>   cl.exe /nologo /c /W3 /Gm /EHsc /Zi /Od /I "../include"  /D
APR_DECLARE_STATIC /MD /D "BINPATH=LibR"  /D _DEBUG /D WIN32 /Fo"LibR/" /FD
-c testmutexscope.c  -FdLibR\ /I "../include"
7>  testmutexscope.c
7>   link.exe /nologo /debug /subsystem:console /incremental:no
/nodefaultlib:libcmt /out:"LibR\testmutexscope.exe" LibR\testmutexscope.obj
..\LibR\apr-2.lib ..\expat\win32\bin\Release\libexpatMT.lib kernel32.lib
advapi32.lib ws2_32.lib wsock32.lib  ole32.lib shell32.lib rpcrt4.lib
7>   cl.exe /nologo /c /W3 /Gm /EHsc /Zi /Od /I "../include"  /D
APR_DECLARE_STATIC /MD /D "BINPATH=LibR"  /D _DEBUG /D WIN32 /Fo"LibR/" /FD
-c echod.c  -FdLibR\ /I "../include"
7>  echod.c
7>   link.exe /nologo /debug /subsystem:console /incremental:no
/nodefaultlib:libcmt /out:"LibR\echod.exe" LibR\echod.obj ..\LibR\apr-2.lib
..\expat\win32\bin\Release\libexpatMT.lib kernel32.lib advapi32.lib
ws2_32.lib wsock32.lib  ole32.lib shell32.lib rpcrt4.lib
7>   cl.exe /nologo /c /W3 /Gm /EHsc /Zi /Od /I "../include"  /D
APR_DECLARE_STATIC /MD /D "BINPATH=LibR"  /D _DEBUG /D WIN32 /Fo"LibR/" /FD
-c sendfile.c  -FdLibR\ /I "../include"
7>  sendfile.c
7>   link.exe /nologo /debug /subsystem:console /incremental:no
/nodefaultlib:libcmt /out:"LibR\sendfile.exe" LibR\sendfile.obj
..\LibR\apr-2.lib ..\expat\win32\bin\Release\libexpatMT.lib kernel32.lib
advapi32.lib ws2_32.lib wsock32.lib  ole32.lib shell32.lib rpcrt4.lib
7>   cl.exe /nologo /c /W3 /Gm /EHsc /Zi /Od /I "../include"  /D
APR_DECLARE_STATIC /MD /D "BINPATH=LibR"  /D _DEBUG /D WIN32 /Fo"LibR/" /FD
-c sockperf.c  -FdLibR\ /I "../include"
7>  sockperf.c
7>   link.exe /nologo /debug /subsystem:console /incremental:no
/nodefaultlib:libcmt /out:"LibR\sockperf.exe" LibR\sockperf.obj
..\LibR\apr-2.lib ..\expat\win32\bin\Release\libexpatMT.lib kernel32.lib
advapi32.lib ws2_32.lib wsock32.lib  ole32.lib shell32.lib rpcrt4.lib
7>  Testing LibR\testapp.exe
7>  Testing LibR\testall.exe
7>  testatomic          :  SUCCESS
7>  testdir             :  SUCCESS
7>  testdso             :  SUCCESS
7>  testdup             :  SUCCESS
7>  testenv             :  SUCCESS
7>  Line 863: File size mismatch, expected 4
7>  testfile            :  FAILED 1 of 36
7>  testfilecopy        :  SUCCESS
7>  testfileinfo        :  SUCCESS
7>  testflock           :  SUCCESS
7>  testfmt             :  SUCCESS
7>  testfnmatch         :  SUCCESS
7>  testargs            :  SUCCESS
7>  testhash            :  SUCCESS
7>  testhooks           :  SUCCESS
7>  testipsub           :  SUCCESS
7>  testlock            :  SUCCESS
7>  testcond            :  SUCCESS
7>  testlfs             :  SUCCESS
7>  testmmap            :  SUCCESS
7>  testnames           :  SUCCESS
7>  testoc              :  SUCCESS
7>  testpath            :  SUCCESS
7>  Line 201: Couldn't set pipe timeout (22): Invalid argument
7>
7>  Line 215: Wait for pipe failed
7>  testpipe            :  FAILED 1 of 10
7>  Line 577: pollcb interface not supported
7>  Line 604: pollcb interface not supported
7>  Line 630: pollcb interface not supported
7>  Line 646: pollcb interface not supported
7>  Line 726: pollcb interface not supported
7>  testpoll            :  SUCCESS
7>  testpools           :  SUCCESS
7>  Line 808: pollcb interface not supported
7>  testproc            :  SUCCESS
7>  testprocmutex       :  SUCCESS
7>  Line 177: APR lacks fork() support
7>  testrand            :  SUCCESS
7>  testsleep           :  SUCCESS
7>  Line 175: Error allocating shared memory block (720005): Access is
denied.
7>
7>  Line 239: Error allocating shared memory block (720005): Access is
denied.
7>
7>  testshm             :  FAILED 2 of 5
7>  Line 370: Cannot test if connect completes synchronously
7>  testsock            :  SUCCESS
7>  testsockets         :  SUCCESS
7>  testsockopt         :  SUCCESS
7>  Line 84: TCP isn't corkable
7>  teststr             :  SUCCESS
7>  teststrnatcmp       :  SUCCESS
7>  testtable           :  SUCCESS
7>  testtemp            :  SUCCESS
7>  testthread          :  SUCCESS
7>  testtime            :  SUCCESS
7>  testud              :  SUCCESS
7>  Line 67: Groups from apr_uid_get
7>  testuser            :  FAILED 1 of 3
7>  testvsn             :  SUCCESS
7>  teststrmatch        :  SUCCESS
7>  testuri             :  SUCCESS
7>  testuuid            :  SUCCESS
7>  Line 90: apr_gid_name_get failed (721789): The trust relationship
between this workstation and the primary domain failed.
7>
7>  testbuckets         :  SUCCESS
7>  testpass            :  SUCCESS
7>  testbase64          :  SUCCESS
7>  testmd4             :  SUCCESS
7>  testmd5             :  SUCCESS
7>  testcrypto          :  SUCCESS
7>  testdbd             :  SUCCESS
7>  testdate            :  SUCCESS
7>  testmemcache        :  SUCCESS
7>  testxml             :  SUCCESS
7>  testxlate           :  SUCCESS
7>  testrmm             :  SUCCESS
7>  testdbm             :  SUCCESS
7>  testqueue           :  SUCCESS
7>  Line 255: expected <10>, but saw <20>
7>  testreslist         :  FAILED 1 of 1
7>  testlfsabi          :  SUCCESS
7>  Failed Tests   Total Fail Failed %
7>  ===================================================
7>  testfile          36   1  2.78%
7>  testpipe          10   1 10.00%
7>  testshm            5   2 40.00%
7>  testuser           3   1 33.33%
7>  testreslist        1   1 100.00%
7>  LibR\testall.exe failed
7>  Testing LibR\testlockperf.exe
7>  APR Lock Performance Test
7>  ==============
7>
7>  apr_thread_mutex_t Tests
7>      Initializing the apr_thread_mutex_t (UNNESTED)          OK
7>      Starting 1 threads    OK
7>  microseconds: 635036 usec
7>  apr_thread_mutex_t Tests
7>      Initializing the apr_thread_mutex_t (NESTED)            OK
7>      Starting 1 threads    OK
7>  microseconds: 28002 usec
7>  apr_thread_rwlock_t Tests
7>      Initializing the apr_thread_rwlock_t                    OK
7>      Starting 1 threads    OK
7>  microseconds: 675039 usec
7>  apr_thread_mutex_t Tests
7>      Initializing the apr_thread_mutex_t (UNNESTED)          OK
7>      Starting 2 threads    OK
7>  microseconds: 4327247 usec
7>  apr_thread_mutex_t Tests
7>      Initializing the apr_thread_mutex_t (NESTED)            OK
7>      Starting 2 threads    OK
7>  microseconds: 141008 usec
7>  apr_thread_rwlock_t Tests
7>      Initializing the apr_thread_rwlock_t                    OK
7>      Starting 2 threads    OK
7>  microseconds: 4023230 usec
7>  apr_thread_mutex_t Tests
7>      Initializing the apr_thread_mutex_t (UNNESTED)          OK
7>      Starting 3 threads    OK
7>  microseconds: 6263359 usec
7>  apr_thread_mutex_t Tests
7>      Initializing the apr_thread_mutex_t (NESTED)            OK
7>      Starting 3 threads    OK
7>  microseconds: 178010 usec
7>  apr_thread_rwlock_t Tests
7>      Initializing the apr_thread_rwlock_t                    OK
7>      Starting 3 threads    OK
7>  microseconds: 6056346 usec
7>  apr_thread_mutex_t Tests
7>      Initializing the apr_thread_mutex_t (UNNESTED)          OK
7>      Starting 4 threads    OK
7>  microseconds: 8160467 usec
7>  apr_thread_mutex_t Tests
7>      Initializing the apr_thread_mutex_t (NESTED)            OK
7>      Starting 4 threads    OK
7>  microseconds: 383022 usec
7>  apr_thread_rwlock_t Tests
7>      Initializing the apr_thread_rwlock_t                    OK
7>      Starting 4 threads    OK
7>  microseconds: 8442483 usec
7>  apr_thread_mutex_t Tests
7>      Initializing the apr_thread_mutex_t (UNNESTED)          OK
7>      Starting 5 threads    OK
7>  microseconds: 9377536 usec
7>  apr_thread_mutex_t Tests
7>      Initializing the apr_thread_mutex_t (NESTED)            OK
7>      Starting 5 threads    OK
7>  microseconds: 362021 usec
7>  apr_thread_rwlock_t Tests
7>      Initializing the apr_thread_rwlock_t                    OK
7>      Starting 5 threads    OK
7>  microseconds: 9792560 usec
7>  apr_thread_mutex_t Tests
7>      Initializing the apr_thread_mutex_t (UNNESTED)          OK
7>      Starting 6 threads    OK
7>  microseconds: 11127636 usec
7>  apr_thread_mutex_t Tests
7>      Initializing the apr_thread_mutex_t (NESTED)            OK
7>      Starting 6 threads    OK
7>  microseconds: 617036 usec
7>  apr_thread_rwlock_t Tests
7>      Initializing the apr_thread_rwlock_t                    OK
7>      Starting 6 threads    OK
7>  microseconds: 11977685 usec
7>  Testing LibR\testmutexscope.exe
7>  Trying proc mutexes with mechanism `default'...
7>    Mutex mechanism `default' is global in scope on this platform.
7>  Trying global mutexes with mechanism `default'...
7>    no problems encountered...
========== Build: 8 succeeded, 0 failed, 0 up-to-date, 0 skipped ==========



On Sat, Aug 11, 2012 at 4:35 PM, Paul Matthews <thekestrel@gmail.com> wrote:

> Getting closer..
>    Upgraded the test project via 2008 express -> 2010 -> 2012 RC and I'm
> at 4/8 compiling now.
>
> 1>------ Build started: Project: apr, Configuration: Release Win32 ------
> 2>------ Build started: Project: libapr, Configuration: Release Win32
> ------
> 1>C:\Users\matthep\Documents\Code\apr\apr\apr.vcxproj(85,5): warning
> MSB4011:
> "C:\Users\matthep\AppData\Local\Microsoft\MSBuild\v4.0\Microsoft.Cpp.Win32.user.props"
> cannot be imported again. It was already imported at
> "C:\Users\matthep\Documents\Code\apr\apr\apr.vcxproj (75,5)". This is most
> likely a build authoring error. This subsequent import will be ignored.
> 2>C:\Users\matthep\Documents\Code\apr\apr\apr.vcxproj(85,5): warning
> MSB4011:
> "C:\Users\matthep\AppData\Local\Microsoft\MSBuild\v4.0\Microsoft.Cpp.Win32.user.props"
> cannot be imported again. It was already imported at
> "C:\Users\matthep\Documents\Code\apr\apr\apr.vcxproj (75,5)". This is most
> likely a build authoring error. This subsequent import will be ignored.
> 1>C:\Users\matthep\Documents\Code\apr\apr\libapr.vcxproj(81,5): warning
> MSB4011:
> "C:\Users\matthep\AppData\Local\Microsoft\MSBuild\v4.0\Microsoft.Cpp.Win32.user.props"
> cannot be imported again. It was already imported at
> "C:\Users\matthep\Documents\Code\apr\apr\libapr.vcxproj (75,5)". This is
> most likely a build authoring error. This subsequent import will be
> ignored.
> 2>C:\Users\matthep\Documents\Code\apr\apr\libapr.vcxproj(81,5): warning
> MSB4011:
> "C:\Users\matthep\AppData\Local\Microsoft\MSBuild\v4.0\Microsoft.Cpp.Win32.user.props"
> cannot be imported again. It was already imported at
> "C:\Users\matthep\Documents\Code\apr\apr\libapr.vcxproj (75,5)". This is
> most likely a build authoring error. This subsequent import will be
> ignored.
> 1>C:\Program Files
> (x86)\MSBuild\Microsoft.Cpp\v4.0\V110\Microsoft.CppCommon.targets(177,5):
> warning MSB8018: No outputs specified for item "include\apr.hw". Its custom
> build command will be skipped.
> 1>C:\Program Files
> (x86)\MSBuild\Microsoft.Cpp\v4.0\V110\Microsoft.CppCommon.targets(177,5):
> warning MSB8018: No outputs specified for item
> "include\private\apu_select_dbm.hw". Its custom build command will be
> skipped.
> 1>C:\Program Files
> (x86)\MSBuild\Microsoft.Cpp\v4.0\V110\Microsoft.CppCommon.targets(177,5):
> warning MSB8018: No outputs specified for item "include\apu_want.hw". Its
> custom build command will be skipped.
> 2>C:\Program Files
> (x86)\MSBuild\Microsoft.Cpp\v4.0\V110\Microsoft.CppCommon.targets(177,5):
> warning MSB8018: No outputs specified for item "include\apr.hw". Its custom
> build command will be skipped.
> 2>C:\Program Files
> (x86)\MSBuild\Microsoft.Cpp\v4.0\V110\Microsoft.CppCommon.targets(177,5):
> warning MSB8018: No outputs specified for item
> "include\private\apu_select_dbm.hw". Its custom build command will be
> skipped.
> 2>C:\Program Files
> (x86)\MSBuild\Microsoft.Cpp\v4.0\V110\Microsoft.CppCommon.targets(177,5):
> warning MSB8018: No outputs specified for item "include\apu_want.hw". Its
> custom build command will be skipped.
> 2>  apr_atomic.c
> 1>  apr_atomic.c
> 2>  apr_brigade.c
> 1>  apr_brigade.c
> 2>  apr_buckets.c
> 1>  apr_buckets.c
> 2>  apr_buckets_alloc.c
> 1>  apr_buckets_alloc.c
> 1>  apr_buckets_eos.c
> 2>  apr_buckets_eos.c
> 1>  apr_buckets_file.c
> 2>  apr_buckets_file.c
> 1>  apr_buckets_flush.c
> 2>  apr_buckets_flush.c
> 1>  apr_buckets_heap.c
> 2>  apr_buckets_heap.c
> 1>  apr_buckets_mmap.c
> 2>  apr_buckets_mmap.c
> 1>  apr_buckets_pipe.c
> 2>  apr_buckets_pipe.c
> 1>  apr_buckets_pool.c
> 2>  apr_buckets_pool.c
> 1>  apr_buckets_refcount.c
> 2>  apr_buckets_refcount.c
> 1>  apr_buckets_simple.c
> 2>  apr_buckets_simple.c
> 1>  apr_buckets_socket.c
> 2>  apr_buckets_socket.c
> 1>  apr_crypto.c
> 2>  apr_crypto.c
> 1>  apr_md4.c
> 2>  apr_md4.c
> 1>  apr_md5.c
> 2>  apr_md5.c
> 1>  apr_passwd.c
> 2>  apr_passwd.c
> 1>  apr_sha1.c
> 2>  apr_sha1.c
> 1>  crypt_blowfish.c
> 1>crypto\crypt_blowfish.c(894): warning C4244: '=' : conversion from
> 'unsigned long' to 'char', possible loss of data
> 2>  crypt_blowfish.c
> 1>  Generating Code...
> 2>crypto\crypt_blowfish.c(894): warning C4244: '=' : conversion from
> 'unsigned long' to 'char', possible loss of data
> 2>  Generating Code...
> 1>  Compiling...
> 1>  getuuid.c
> 2>  Compiling...
> 2>  getuuid.c
> 1>  uuid.c
> 2>  uuid.c
> 1>  apr_dbd.c
> 2>  apr_dbd.c
> 1>  apr_dbd_freetds.c
> 2>  apr_dbd_freetds.c
> 1>  apr_dbd_mysql.c
> 2>  apr_dbd_mysql.c
> 1>  apr_dbd_odbc.c
> 2>  apr_dbd_odbc.c
> 1>  apr_dbd_oracle.c
> 2>  apr_dbd_oracle.c
> 1>  apr_dbd_pgsql.c
> 2>  apr_dbd_pgsql.c
> 1>  apr_dbd_sqlite2.c
> 2>  apr_dbd_sqlite2.c
> 1>  apr_dbd_sqlite3.c
> 2>  apr_dbd_sqlite3.c
> 1>  apr_dbm.c
> 2>  apr_dbm.c
> 1>  apr_dbm_berkeleydb.c
> 2>  apr_dbm_berkeleydb.c
> 1>  apr_dbm_gdbm.c
> 2>  apr_dbm_gdbm.c
> 1>  apr_dbm_sdbm.c
> 2>  apr_dbm_sdbm.c
> 1>  dso.c
> 2>  dso.c
> 1>  apr_base64.c
> 2>  apr_base64.c
> 1>  buffer.c
> 2>  buffer.c
> 1>  copy.c
> 2>  copy.c
> 1>  dir.c
> 2>  dir.c
> 1>  fileacc.c
> 2>  fileacc.c
> 1>  Generating Code...
> 2>  Generating Code...
>  1>  Compiling...
> 1>  filedup.c
> 2>  Compiling...
> 2>  filedup.c
> 1>  filepath.c
> 2>  filepath.c
> 1>  filepath_util.c
> 2>  filepath_util.c
> 1>  filestat.c
> 2>  filestat.c
> 1>  filesys.c
> 2>  filesys.c
> 1>  flock.c
> 2>  flock.c
> 1>  fullrw.c
> 2>  fullrw.c
> 1>  mktemp.c
> 2>  mktemp.c
> 1>  open.c
> 2>  open.c
> 1>  pipe.c
> 2>  pipe.c
> 1>  readwrite.c
> 2>  readwrite.c
> 1>  seek.c
> 2>  seek.c
> 1>  tempdir.c
> 2>  tempdir.c
> 1>  apr_hooks.c
> 2>  apr_hooks.c
> 1>  proc_mutex.c
> 2>  proc_mutex.c
> 1>  thread_cond.c
> 2>  thread_cond.c
> 1>  thread_mutex.c
> 2>  thread_mutex.c
> 1>  thread_rwlock.c
> 2>  thread_rwlock.c
> 1>  apr_memcache.c
> 2>  apr_memcache.c
> 1>  apr_pools.c
> 2>  apr_pools.c
> 1>  Generating Code...
> 2>  Generating Code...
> 1>  Compiling...
> 1>  charset.c
> 2>  Compiling...
> 2>  charset.c
> 1>  env.c
> 2>  env.c
> 1>  errorcodes.c
> 2>  errorcodes.c
> 1>  getopt.c
> 2>  getopt.c
> 1>  internal.c
> 2>  internal.c
> 1>  misc.c
> 2>  misc.c
> 1>  otherchild.c
> 2>  otherchild.c
> 1>  rand.c
> 2>  rand.c
> 1>  start.c
> 2>  start.c
> 1>  utf8.c
> 2>  utf8.c
> 1>  version.c
> 2>  version.c
> 1>  common.c
> 2>  common.c
> 1>  mmap.c
> 2>  mmap.c
> 1>  inet_ntop.c
> 2>  inet_ntop.c
> 1>  inet_pton.c
> 2>  inet_pton.c
> 1>  multicast.c
> 2>  multicast.c
> 1>  sendrecv.c
> 2>  sendrecv.c
> 1>  sockaddr.c
> 2>  sockaddr.c
> 1>  sockets.c
> 2>  sockets.c
> 1>  socket_util.c
> 2>  socket_util.c
> 1>  Generating Code...
> 2>  Generating Code...
> 1>  Compiling...
> 1>  sockopt.c
> 2>  Compiling...
> 2>  sockopt.c
> 1>  apr_getpass.c
> 2>  apr_getpass.c
> 1>  pollcb.c
> 2>  pollcb.c
> 1>  pollset.c
> 2>  pollset.c
> 1>  poll.c
> 2>  poll.c
> 1>  select.c
> 2>  select.c
> 1>  wakeup.c
> 2>  wakeup.c
> 1>  apr_random.c
> 2>  apr_random.c
> 1>  sha2.c
> 2>  sha2.c
> 1>  sha2_glue.c
> 2>  sha2_glue.c
> 1>  sdbm.c
> 2>  sdbm.c
> 1>  sdbm_hash.c
> 2>  sdbm_hash.c
> 1>  sdbm_lock.c
> 2>  sdbm_lock.c
> 1>  sdbm_pair.c
> 2>  sdbm_pair.c
> 1>  shm.c
> 2>  shm.c
> 1>  apr_cpystrn.c
> 2>  apr_cpystrn.c
> 1>  apr_fnmatch.c
> 2>  apr_fnmatch.c
> 1>  apr_snprintf.c
> 2>  apr_snprintf.c
> 1>  apr_strings.c
> 2>  apr_strings.c
> 1>  apr_strnatcmp.c
> 2>  apr_strnatcmp.c
> 1>  Generating Code...
> 2>  Generating Code...
> 1>  Compiling...
> 1>  apr_strtok.c
> 2>  Compiling...
> 2>  apr_strtok.c
> 1>  apr_strmatch.c
> 2>  apr_strmatch.c
>  1>  apr_hash.c
> 2>  apr_hash.c
> 1>  apr_tables.c
> 2>  apr_tables.c
> 1>  proc.c
> 2>  proc.c
> 1>  signals.c
> 2>  signals.c
> 1>  thread.c
> 2>  thread.c
> 1>  threadpriv.c
> 2>  threadpriv.c
> 1>  time.c
> 2>  time.c
> 1>  timestr.c
> 2>  timestr.c
> 1>  apr_uri.c
> 2>  apr_uri.c
> 1>  groupinfo.c
> 2>  groupinfo.c
> 1>  userinfo.c
> 1>  apr_date.c
> 2>  userinfo.c
> 2>  apr_date.c
> 1>  apu_dso.c
> 2>  apu_dso.c
> 1>  apr_queue.c
> 2>  apr_queue.c
> 1>  apr_reslist.c
> 2>  apr_reslist.c
> 1>  apr_rmm.c
> 2>  apr_rmm.c
> 1>  apr_thread_pool.c
> 2>  apr_thread_pool.c
> 1>  xlate.c
> 2>  xlate.c
> 1>  Generating Code...
> 2>  Generating Code...
> 1>  Compiling...
> 1>  apr_xml.c
> 2>  Compiling...
> 2>  apr_xml.c
> 1>  apr_xml_expat.c
> 2>  apr_xml_expat.c
> 1>xml\apr_xml_expat.c(29): fatal error C1083: Cannot open include file:
> 'expat.h': No such file or directory
> 1>  Generating Code...
> 2>xml\apr_xml_expat.c(29): fatal error C1083: Cannot open include file:
> 'expat.h': No such file or directory
> 2>  Generating Code...
> 3>------ Build started: Project: preaprapp, Configuration: Release Win32
> ------
> 3>C:\Users\matthep\Documents\Code\apr\apr\build\preaprapp.vcxproj(82,5):
> warning MSB4011:
> "C:\Users\matthep\AppData\Local\Microsoft\MSBuild\v4.0\Microsoft.Cpp.Win32.user.props"
> cannot be imported again. It was already imported at
> "C:\Users\matthep\Documents\Code\apr\apr\build\preaprapp.vcxproj (76,5)".
> This is most likely a build authoring error. This subsequent import will be
> ignored.
> 4>------ Build started: Project: prelibaprapp, Configuration: Release
> Win32 ------
> 5>------ Build started: Project: apr_crypto_nss, Configuration: Release
> Win32 ------
> 6>------ Build started: Project: apr_crypto_openssl, Configuration:
> Release Win32 ------
> 4>C:\Users\matthep\Documents\Code\apr\apr\build\prelibaprapp.vcxproj(82,5):
> warning MSB4011:
> "C:\Users\matthep\AppData\Local\Microsoft\MSBuild\v4.0\Microsoft.Cpp.Win32.user.props"
> cannot be imported again. It was already imported at
> "C:\Users\matthep\Documents\Code\apr\apr\build\prelibaprapp.vcxproj
> (76,5)". This is most likely a build authoring error. This subsequent
> import will be ignored.
> 5>C:\Users\matthep\Documents\Code\apr\apr\build\prelibaprapp.vcxproj(82,5):
> warning MSB4011:
> "C:\Users\matthep\AppData\Local\Microsoft\MSBuild\v4.0\Microsoft.Cpp.Win32.user.props"
> cannot be imported again. It was already imported at
> "C:\Users\matthep\Documents\Code\apr\apr\build\prelibaprapp.vcxproj
> (76,5)". This is most likely a build authoring error. This subsequent
> import will be ignored.
> 5>C:\Users\matthep\Documents\Code\apr\apr\crypto\apr_crypto_nss.vcxproj(85,5):
> warning MSB4011:
> "C:\Users\matthep\AppData\Local\Microsoft\MSBuild\v4.0\Microsoft.Cpp.Win32.user.props"
> cannot be imported again. It was already imported at
> "C:\Users\matthep\Documents\Code\apr\apr\crypto\apr_crypto_nss.vcxproj
> (78,5)". This is most likely a build authoring error. This subsequent
> import will be ignored.
> 6>C:\Users\matthep\Documents\Code\apr\apr\build\prelibaprapp.vcxproj(82,5):
> warning MSB4011:
> "C:\Users\matthep\AppData\Local\Microsoft\MSBuild\v4.0\Microsoft.Cpp.Win32.user.props"
> cannot be imported again. It was already imported at
> "C:\Users\matthep\Documents\Code\apr\apr\build\prelibaprapp.vcxproj
> (76,5)". This is most likely a build authoring error. This subsequent
> import will be ignored.
> 6>C:\Users\matthep\Documents\Code\apr\apr\crypto\apr_crypto_nss.vcxproj(85,5):
> warning MSB4011:
> "C:\Users\matthep\AppData\Local\Microsoft\MSBuild\v4.0\Microsoft.Cpp.Win32.user.props"
> cannot be imported again. It was already imported at
> "C:\Users\matthep\Documents\Code\apr\apr\crypto\apr_crypto_nss.vcxproj
> (78,5)". This is most likely a build authoring error. This subsequent
> import will be ignored.
> 4>C:\Users\matthep\Documents\Code\apr\apr\crypto\apr_crypto_nss.vcxproj(85,5):
> warning MSB4011:
> "C:\Users\matthep\AppData\Local\Microsoft\MSBuild\v4.0\Microsoft.Cpp.Win32.user.props"
> cannot be imported again. It was already imported at
> "C:\Users\matthep\Documents\Code\apr\apr\crypto\apr_crypto_nss.vcxproj
> (78,5)". This is most likely a build authoring error. This subsequent
> import will be ignored.
> 4>C:\Users\matthep\Documents\Code\apr\apr\crypto\apr_crypto_openssl.vcxproj(85,5):
> warning MSB4011:
> "C:\Users\matthep\AppData\Local\Microsoft\MSBuild\v4.0\Microsoft.Cpp.Win32.user.props"
> cannot be imported again. It was already imported at
> "C:\Users\matthep\Documents\Code\apr\apr\crypto\apr_crypto_openssl.vcxproj
> (78,5)". This is most likely a build authoring error. This subsequent
> import will be ignored.
> 5>C:\Users\matthep\Documents\Code\apr\apr\crypto\apr_crypto_openssl.vcxproj(85,5):
> warning MSB4011:
> "C:\Users\matthep\AppData\Local\Microsoft\MSBuild\v4.0\Microsoft.Cpp.Win32.user.props"
> cannot be imported again. It was already imported at
> "C:\Users\matthep\Documents\Code\apr\apr\crypto\apr_crypto_openssl.vcxproj
> (78,5)". This is most likely a build authoring error. This subsequent
> import will be ignored.
> 6>C:\Users\matthep\Documents\Code\apr\apr\crypto\apr_crypto_openssl.vcxproj(85,5):
> warning MSB4011:
> "C:\Users\matthep\AppData\Local\Microsoft\MSBuild\v4.0\Microsoft.Cpp.Win32.user.props"
> cannot be imported again. It was already imported at
> "C:\Users\matthep\Documents\Code\apr\apr\crypto\apr_crypto_openssl.vcxproj
> (78,5)". This is most likely a build authoring error. This subsequent
> import will be ignored.
> 7>------ Build started: Project: aprapp, Configuration: Release Win32
> ------
> 5>C:\Users\matthep\Documents\Code\apr\apr\build\aprapp.vcxproj(81,5):
> warning MSB4011:
> "C:\Users\matthep\AppData\Local\Microsoft\MSBuild\v4.0\Microsoft.Cpp.Win32.user.props"
> cannot be imported again. It was already imported at
> "C:\Users\matthep\Documents\Code\apr\apr\build\aprapp.vcxproj (78,5)". This
> is most likely a build authoring error. This subsequent import will be
> ignored.
> 6>C:\Users\matthep\Documents\Code\apr\apr\build\aprapp.vcxproj(81,5):
> warning MSB4011:
> "C:\Users\matthep\AppData\Local\Microsoft\MSBuild\v4.0\Microsoft.Cpp.Win32.user.props"
> cannot be imported again. It was already imported at
> "C:\Users\matthep\Documents\Code\apr\apr\build\aprapp.vcxproj (78,5)". This
> is most likely a build authoring error. This subsequent import will be
> ignored.
> 7>C:\Users\matthep\Documents\Code\apr\apr\build\aprapp.vcxproj(81,5):
> warning MSB4011:
> "C:\Users\matthep\AppData\Local\Microsoft\MSBuild\v4.0\Microsoft.Cpp.Win32.user.props"
> cannot be imported again. It was already imported at
> "C:\Users\matthep\Documents\Code\apr\apr\build\aprapp.vcxproj (78,5)". This
> is most likely a build authoring error. This subsequent import will be
> ignored.
> 5>  apr_crypto_nss.c
> 6>  apr_crypto_openssl.c
> 7>  apr_app.c
> 6>apr_crypto_openssl.c(19): fatal error C1083: Cannot open include file:
> 'apr_private.h': No such file or directory
> 5>apr_crypto_nss.c(19): fatal error C1083: Cannot open include file:
> 'apr_private.h': No such file or directory
> 5>FileTracker : error FTK1011: could not create the new file tracking log
> file:
> C:\Users\matthep\Documents\Code\apr\apr\crypto\Release\CL.read.1.tlog. The
> file exists.
> 5>
> 5>
> 5>
> 8>------ Build started: Project: libaprapp, Configuration: Release Win32
> ------
> 7>C:\Users\matthep\Documents\Code\apr\apr\build\libaprapp.vcxproj(78,5):
> warning MSB4011:
> "C:\Users\matthep\AppData\Local\Microsoft\MSBuild\v4.0\Microsoft.Cpp.Win32.user.props"
> cannot be imported again. It was already imported at
> "C:\Users\matthep\Documents\Code\apr\apr\build\libaprapp.vcxproj (75,5)".
> This is most likely a build authoring error. This subsequent import will be
> ignored.
> 8>C:\Users\matthep\Documents\Code\apr\apr\build\libaprapp.vcxproj(78,5):
> warning MSB4011:
> "C:\Users\matthep\AppData\Local\Microsoft\MSBuild\v4.0\Microsoft.Cpp.Win32.user.props"
> cannot be imported again. It was already imported at
> "C:\Users\matthep\Documents\Code\apr\apr\build\libaprapp.vcxproj (75,5)".
> This is most likely a build authoring error. This subsequent import will be
> ignored.
> 8>  apr_app.c
> 7>  aprapp.vcxproj ->
> C:\Users\matthep\Documents\Code\apr\apr\build\..\LibR\aprapp-2.lib
> 8>  internal.c
> 8>  Generating Code...
> 8>  libaprapp.vcxproj ->
> C:\Users\matthep\Documents\Code\apr\apr\build\..\Release\libaprapp-2.lib
> ========== Build: 4 succeeded, 4 failed, 0 up-to-date, 0 skipped ==========
>
>
> On Sat, Aug 11, 2012 at 2:36 PM, Jeff Trawick <trawick@gmail.com> wrote:
>
>> On Sat, Aug 11, 2012 at 12:46 PM, Jeff Trawick <trawick@gmail.com> wrote:
>> > On Fri, Aug 10, 2012 at 9:56 PM, Paul Matthews <thekestrel@gmail.com>
>> wrote:
>> >> Hi,
>> >>    New to Apr and I'm trying to build with Visual Studio 2012 RC. I
>> expected
>> >> some project conversion issues, but rectifying them it taking longer
>> than I
>> >> expected so I thought I'd try and get some help (or at least provide
>> some
>> >> data for someone else). First import of .dsw failed for apr directory,
>> but
>> >> picked it up on the second pass. Keep getting 'Cpp.Win32.user.props
>> warnings
>> >> and deleting the file and restarting VS as some forums advise does
>> >> nothing.I'm seeing a few missing files, but a  quick investigation
>> seemed to
>> >> indicate I should not need them (i.e. no mysql installed).If there are
>> some
>> >> quick tips for removing some of these errors it would be appreciated.
>> >
>> > Here's what I've done successfully:
>> >
>> > clean checkout of apr trunk
>> > open apr/test/ dsw file with Visual Studio 2008, let it create new
>> > solution files for everything, exit/save
>> > open the new apr/test/ solution file with Visual Studio 2010, run
>> > through its translator
>> > build (successful)
>> >
>> > I haven't installed Visual Studio 2012 RC yet.
>>
>> Now I have, and loading the 2010-upgraded files upgraded them again
>> and built successfully.  (But I had to delete the .pdb files in the
>> test/LibD directory for some incompatibility issue; maybe they're not
>> being cleaned properly for the rebuild action.)
>>
>> >  Can you try a stepwise
>> > upgrade and see if you get better results?  (I suspect that Visual C++
>> > Express 2008 can play the role of Visual Studio 2008 in the steps
>> > above, if you don't have Visual Studio 2008.)
>> >
>> >>
>> >> 1>------ Build started: Project: apr, Configuration: Release Win32
>> ------
>> >> 2>------ Build started: Project: libapr, Configuration: Release Win32
>> ------
>> >> 3>------ Build started: Project: libaprutil, Configuration: Release
>> Win32
>> >> ------
>> >> 4>------ Build started: Project: preaprutil, Configuration: Release
>> Win32
>> >> ------
>> >> 5>------ Build started: Project: apr_crypto_nss, Configuration: Release
>> >> Win32 ------
>> >> 6>------ Build started: Project: apr_crypto_openssl, Configuration:
>> Release
>> >> Win32 ------
>> >> 7>------ Build started: Project: apr_dbd_freetds, Configuration:
>> Release
>> >> Win32 ------
>> >> 8>------ Build started: Project: apr_dbd_mysql, Configuration: Release
>> Win32
>> >> ------
>> >> 1>C:\Users\matthep\Documents\Code\apr\apr\apr.vcxproj(100,5): warning
>> >> MSB4011:
>> >>
>> "C:\Users\matthep\AppData\Local\Microsoft\MSBuild\v4.0\Microsoft.Cpp.Win32.user.props"
>> >> cannot be imported again. It was already imported at
>> >> "C:\Users\matthep\Documents\Code\apr\apr\apr.vcxproj (86,5)". This is
>> most
>> >> likely a build authoring error. This subsequent import will be ignored.
>> >> 2>C:\Users\matthep\Documents\Code\apr\apr\apr.vcxproj(100,5): warning
>> >> MSB4011:
>> >>
>> "C:\Users\matthep\AppData\Local\Microsoft\MSBuild\v4.0\Microsoft.Cpp.Win32.user.props"
>> >> cannot be imported again. It was already imported at
>> >> "C:\Users\matthep\Documents\Code\apr\apr\apr.vcxproj (86,5)". This is
>> most
>> >> likely a build authoring error. This subsequent import will be ignored.
>> >> 3>C:\Users\matthep\Documents\Code\apr\apr\apr.vcxproj(100,5): warning
>> >> MSB4011:
>> >>
>> "C:\Users\matthep\AppData\Local\Microsoft\MSBuild\v4.0\Microsoft.Cpp.Win32.user.props"
>> >> cannot be imported again. It was already imported at
>> >> "C:\Users\matthep\Documents\Code\apr\apr\apr.vcxproj (86,5)". This is
>> most
>> >> likely a build authoring error. This subsequent import will be ignored.
>> >>
>> 3>C:\Users\matthep\Documents\Code\apr\apr-util\crypto\apr_crypto_nss.vcxproj(70,5):
>> >> warning MSB4011:
>> >>
>> "C:\Users\matthep\AppData\Local\Microsoft\MSBuild\v4.0\Microsoft.Cpp.Win32.user.props"
>> >> cannot be imported again. It was already imported at
>> >>
>> "C:\Users\matthep\Documents\Code\apr\apr-util\crypto\apr_crypto_nss.vcxproj
>> >> (63,5)". This is most likely a build authoring error. This subsequent
>> import
>> >> will be ignored.
>> >> 4>C:\Users\matthep\Documents\Code\apr\apr\apr.vcxproj(100,5): warning
>> >> MSB4011:
>> >>
>> "C:\Users\matthep\AppData\Local\Microsoft\MSBuild\v4.0\Microsoft.Cpp.Win32.user.props"
>> >> cannot be imported again. It was already imported at
>> >> "C:\Users\matthep\Documents\Code\apr\apr\apr.vcxproj (86,5)". This is
>> most
>> >> likely a build authoring error. This subsequent import will be ignored.
>> >>
>> 4>C:\Users\matthep\Documents\Code\apr\apr-util\crypto\apr_crypto_nss.vcxproj(70,5):
>> >> warning MSB4011:
>> >>
>> "C:\Users\matthep\AppData\Local\Microsoft\MSBuild\v4.0\Microsoft.Cpp.Win32.user.props"
>> >> cannot be imported again. It was already imported at
>> >>
>> "C:\Users\matthep\Documents\Code\apr\apr-util\crypto\apr_crypto_nss.vcxproj
>> >> (63,5)". This is most likely a build authoring error. This subsequent
>> import
>> >> will be ignored.
>> >> 5>C:\Users\matthep\Documents\Code\apr\apr\apr.vcxproj(100,5): warning
>> >> MSB4011:
>> >>
>> "C:\Users\matthep\AppData\Local\Microsoft\MSBuild\v4.0\Microsoft.Cpp.Win32.user.props"
>> >> cannot be imported again. It was already imported at
>> >> "C:\Users\matthep\Documents\Code\apr\apr\apr.vcxproj (86,5)". This is
>> most
>> >> likely a build authoring error. This subsequent import will be ignored.
>> >>
>> 5>C:\Users\matthep\Documents\Code\apr\apr-util\crypto\apr_crypto_nss.vcxproj(70,5):
>> >> warning MSB4011:
>> >>
>> "C:\Users\matthep\AppData\Local\Microsoft\MSBuild\v4.0\Microsoft.Cpp.Win32.user.props"
>> >> cannot be imported again. It was already imported at
>> >>
>> "C:\Users\matthep\Documents\Code\apr\apr-util\crypto\apr_crypto_nss.vcxproj
>> >> (63,5)". This is most likely a build authoring error. This subsequent
>> import
>> >> will be ignored.
>> >> 6>C:\Users\matthep\Documents\Code\apr\apr\apr.vcxproj(100,5): warning
>> >> MSB4011:
>> >>
>> "C:\Users\matthep\AppData\Local\Microsoft\MSBuild\v4.0\Microsoft.Cpp.Win32.user.props"
>> >> cannot be imported again. It was already imported at
>> >> "C:\Users\matthep\Documents\Code\apr\apr\apr.vcxproj (86,5)". This is
>> most
>> >> likely a build authoring error. This subsequent import will be ignored.
>> >>
>> 6>C:\Users\matthep\Documents\Code\apr\apr-util\crypto\apr_crypto_nss.vcxproj(70,5):
>> >> warning MSB4011:
>> >>
>> "C:\Users\matthep\AppData\Local\Microsoft\MSBuild\v4.0\Microsoft.Cpp.Win32.user.props"
>> >> cannot be imported again. It was already imported at
>> >>
>> "C:\Users\matthep\Documents\Code\apr\apr-util\crypto\apr_crypto_nss.vcxproj
>> >> (63,5)". This is most likely a build authoring error. This subsequent
>> import
>> >> will be ignored.
>> >>
>> 6>C:\Users\matthep\Documents\Code\apr\apr-util\crypto\apr_crypto_openssl.vcxproj(85,5):
>> >> warning MSB4011:
>> >>
>> "C:\Users\matthep\AppData\Local\Microsoft\MSBuild\v4.0\Microsoft.Cpp.Win32.user.props"
>> >> cannot be imported again. It was already imported at
>> >>
>> "C:\Users\matthep\Documents\Code\apr\apr-util\crypto\apr_crypto_openssl.vcxproj
>> >> (78,5)". This is most likely a build authoring error. This subsequent
>> import
>> >> will be ignored.
>> >>
>> 6>C:\Users\matthep\Documents\Code\apr\apr-util\dbd\apr_dbd_mysql.vcxproj(81,5):
>> >> warning MSB4011:
>> >>
>> "C:\Users\matthep\AppData\Local\Microsoft\MSBuild\v4.0\Microsoft.Cpp.Win32.user.props"
>> >> cannot be imported again. It was already imported at
>> >> "C:\Users\matthep\Documents\Code\apr\apr-util\dbd\apr_dbd_mysql.vcxproj
>> >> (75,5)". This is most likely a build authoring error. This subsequent
>> import
>> >> will be ignored.
>> >>
>> 6>C:\Users\matthep\Documents\Code\apr\apr-util\libaprutil.vcxproj(81,5):
>> >> warning MSB4011:
>> >>
>> "C:\Users\matthep\AppData\Local\Microsoft\MSBuild\v4.0\Microsoft.Cpp.Win32.user.props"
>> >> cannot be imported again. It was already imported at
>> >> "C:\Users\matthep\Documents\Code\apr\apr-util\libaprutil.vcxproj
>> (78,5)".
>> >> This is most likely a build authoring error. This subsequent import
>> will be
>> >> ignored.
>> >> 8>C:\Users\matthep\Documents\Code\apr\apr\apr.vcxproj(100,5): warning
>> >> MSB4011:
>> >>
>> "C:\Users\matthep\AppData\Local\Microsoft\MSBuild\v4.0\Microsoft.Cpp.Win32.user.props"
>> >> cannot be imported again. It was already imported at
>> >> "C:\Users\matthep\Documents\Code\apr\apr\apr.vcxproj (86,5)". This is
>> most
>> >> likely a build authoring error. This subsequent import will be ignored.
>> >>
>> 8>C:\Users\matthep\Documents\Code\apr\apr-util\crypto\apr_crypto_nss.vcxproj(70,5):
>> >> warning MSB4011:
>> >>
>> "C:\Users\matthep\AppData\Local\Microsoft\MSBuild\v4.0\Microsoft.Cpp.Win32.user.props"
>> >> cannot be imported again. It was already imported at
>> >>
>> "C:\Users\matthep\Documents\Code\apr\apr-util\crypto\apr_crypto_nss.vcxproj
>> >> (63,5)". This is most likely a build authoring error. This subsequent
>> import
>> >> will be ignored.
>> >>
>> 8>C:\Users\matthep\Documents\Code\apr\apr-util\crypto\apr_crypto_openssl.vcxproj(85,5):
>> >> warning MSB4011:
>> >>
>> "C:\Users\matthep\AppData\Local\Microsoft\MSBuild\v4.0\Microsoft.Cpp.Win32.user.props"
>> >> cannot be imported again. It was already imported at
>> >>
>> "C:\Users\matthep\Documents\Code\apr\apr-util\crypto\apr_crypto_openssl.vcxproj
>> >> (78,5)". This is most likely a build authoring error. This subsequent
>> import
>> >> will be ignored.
>> >>
>> 8>C:\Users\matthep\Documents\Code\apr\apr-util\dbd\apr_dbd_mysql.vcxproj(81,5):
>> >> warning MSB4011:
>> >>
>> "C:\Users\matthep\AppData\Local\Microsoft\MSBuild\v4.0\Microsoft.Cpp.Win32.user.props"
>> >> cannot be imported again. It was already imported at
>> >> "C:\Users\matthep\Documents\Code\apr\apr-util\dbd\apr_dbd_mysql.vcxproj
>> >> (75,5)". This is most likely a build authoring error. This subsequent
>> import
>> >> will be ignored.
>> >>
>> 8>C:\Users\matthep\Documents\Code\apr\apr-util\libaprutil.vcxproj(81,5):
>> >> warning MSB4011:
>> >>
>> "C:\Users\matthep\AppData\Local\Microsoft\MSBuild\v4.0\Microsoft.Cpp.Win32.user.props"
>> >> cannot be imported again. It was already imported at
>> >> "C:\Users\matthep\Documents\Code\apr\apr-util\libaprutil.vcxproj
>> (78,5)".
>> >> This is most likely a build authoring error. This subsequent import
>> will be
>> >> ignored.
>> >> 8>C:\Users\matthep\Documents\Code\apr\apr\libapr.vcxproj(111,5):
>> warning
>> >> MSB4011:
>> >>
>> "C:\Users\matthep\AppData\Local\Microsoft\MSBuild\v4.0\Microsoft.Cpp.Win32.user.props"
>> >> cannot be imported again. It was already imported at
>> >> "C:\Users\matthep\Documents\Code\apr\apr\libapr.vcxproj (101,5)". This
>> is
>> >> most likely a build authoring error. This subsequent import will be
>> ignored.
>> >> 7>C:\Users\matthep\Documents\Code\apr\apr\apr.vcxproj(100,5): warning
>> >> MSB4011:
>> >>
>> "C:\Users\matthep\AppData\Local\Microsoft\MSBuild\v4.0\Microsoft.Cpp.Win32.user.props"
>> >> cannot be imported again. It was already imported at
>> >> "C:\Users\matthep\Documents\Code\apr\apr\apr.vcxproj (86,5)". This is
>> most
>> >> likely a build authoring error. This subsequent import will be ignored.
>> >>
>> 7>C:\Users\matthep\Documents\Code\apr\apr-util\crypto\apr_crypto_nss.vcxproj(70,5):
>> >> warning MSB4011:
>> >>
>> "C:\Users\matthep\AppData\Local\Microsoft\MSBuild\v4.0\Microsoft.Cpp.Win32.user.props"
>> >> cannot be imported again. It was already imported at
>> >>
>> "C:\Users\matthep\Documents\Code\apr\apr-util\crypto\apr_crypto_nss.vcxproj
>> >> (63,5)". This is most likely a build authoring error. This subsequent
>> import
>> >> will be ignored.
>> >>
>> 7>C:\Users\matthep\Documents\Code\apr\apr-util\crypto\apr_crypto_openssl.vcxproj(85,5):
>> >> warning MSB4011:
>> >>
>> "C:\Users\matthep\AppData\Local\Microsoft\MSBuild\v4.0\Microsoft.Cpp.Win32.user.props"
>> >> cannot be imported again. It was already imported at
>> >>
>> "C:\Users\matthep\Documents\Code\apr\apr-util\crypto\apr_crypto_openssl.vcxproj
>> >> (78,5)". This is most likely a build authoring error. This subsequent
>> import
>> >> will be ignored.
>> >>
>> 7>C:\Users\matthep\Documents\Code\apr\apr-util\dbd\apr_dbd_mysql.vcxproj(81,5):
>> >> warning MSB4011:
>> >>
>> "C:\Users\matthep\AppData\Local\Microsoft\MSBuild\v4.0\Microsoft.Cpp.Win32.user.props"
>> >> cannot be imported again. It was already imported at
>> >> "C:\Users\matthep\Documents\Code\apr\apr-util\dbd\apr_dbd_mysql.vcxproj
>> >> (75,5)". This is most likely a build authoring error. This subsequent
>> import
>> >> will be ignored.
>> >>
>> 7>C:\Users\matthep\Documents\Code\apr\apr-util\libaprutil.vcxproj(81,5):
>> >> warning MSB4011:
>> >>
>> "C:\Users\matthep\AppData\Local\Microsoft\MSBuild\v4.0\Microsoft.Cpp.Win32.user.props"
>> >> cannot be imported again. It was already imported at
>> >> "C:\Users\matthep\Documents\Code\apr\apr-util\libaprutil.vcxproj
>> (78,5)".
>> >> This is most likely a build authoring error. This subsequent import
>> will be
>> >> ignored.
>> >> 7>C:\Users\matthep\Documents\Code\apr\apr\libapr.vcxproj(111,5):
>> warning
>> >> MSB4011:
>> >>
>> "C:\Users\matthep\AppData\Local\Microsoft\MSBuild\v4.0\Microsoft.Cpp.Win32.user.props"
>> >> cannot be imported again. It was already imported at
>> >> "C:\Users\matthep\Documents\Code\apr\apr\libapr.vcxproj (101,5)". This
>> is
>> >> most likely a build authoring error. This subsequent import will be
>> ignored.
>> >>
>> 7>C:\Users\matthep\Documents\Code\apr\apr-util\build\preaprutil.vcxproj(86,5):
>> >> warning MSB4011:
>> >>
>> "C:\Users\matthep\AppData\Local\Microsoft\MSBuild\v4.0\Microsoft.Cpp.Win32.user.props"
>> >> cannot be imported again. It was already imported at
>> >> "C:\Users\matthep\Documents\Code\apr\apr-util\build\preaprutil.vcxproj
>> >> (79,5)". This is most likely a build authoring error. This subsequent
>> import
>> >> will be ignored.
>> >>
>> 1>C:\Users\matthep\Documents\Code\apr\apr-util\crypto\apr_crypto_nss.vcxproj(70,5):
>> >> warning MSB4011:
>> >>
>> "C:\Users\matthep\AppData\Local\Microsoft\MSBuild\v4.0\Microsoft.Cpp.Win32.user.props"
>> >> cannot be imported again. It was already imported at
>> >>
>> "C:\Users\matthep\Documents\Code\apr\apr-util\crypto\apr_crypto_nss.vcxproj
>> >> (63,5)". This is most likely a build authoring error. This subsequent
>> import
>> >> will be ignored.
>> >> 1>C:\Program Files
>> >>
>> (x86)\MSBuild\Microsoft.Cpp\v4.0\V110\Microsoft.CppCommon.targets(177,5):
>> >> warning MSB8018: No outputs specified for item "include\apr.hw". Its
>> custom
>> >> build command will be skipped.
>> >>
>> 1>C:\Users\matthep\Documents\Code\apr\apr-util\crypto\apr_crypto_openssl.vcxproj(85,5):
>> >> warning MSB4011:
>> >>
>> "C:\Users\matthep\AppData\Local\Microsoft\MSBuild\v4.0\Microsoft.Cpp.Win32.user.props"
>> >> cannot be imported again. It was already imported at
>> >>
>> "C:\Users\matthep\Documents\Code\apr\apr-util\crypto\apr_crypto_openssl.vcxproj
>> >> (78,5)". This is most likely a build authoring error. This subsequent
>> import
>> >> will be ignored.
>> >>
>> 1>C:\Users\matthep\Documents\Code\apr\apr-util\dbd\apr_dbd_mysql.vcxproj(81,5):
>> >> warning MSB4011:
>> >>
>> "C:\Users\matthep\AppData\Local\Microsoft\MSBuild\v4.0\Microsoft.Cpp.Win32.user.props"
>> >> cannot be imported again. It was already imported at
>> >> "C:\Users\matthep\Documents\Code\apr\apr-util\dbd\apr_dbd_mysql.vcxproj
>> >> (75,5)". This is most likely a build authoring error. This subsequent
>> import
>> >> will be ignored.
>> >>
>> 1>C:\Users\matthep\Documents\Code\apr\apr-util\libaprutil.vcxproj(81,5):
>> >> warning MSB4011:
>> >>
>> "C:\Users\matthep\AppData\Local\Microsoft\MSBuild\v4.0\Microsoft.Cpp.Win32.user.props"
>> >> cannot be imported again. It was already imported at
>> >> "C:\Users\matthep\Documents\Code\apr\apr-util\libaprutil.vcxproj
>> (78,5)".
>> >> This is most likely a build authoring error. This subsequent import
>> will be
>> >> ignored.
>> >> 1>C:\Users\matthep\Documents\Code\apr\apr\libapr.vcxproj(111,5):
>> warning
>> >> MSB4011:
>> >>
>> "C:\Users\matthep\AppData\Local\Microsoft\MSBuild\v4.0\Microsoft.Cpp.Win32.user.props"
>> >> cannot be imported again. It was already imported at
>> >> "C:\Users\matthep\Documents\Code\apr\apr\libapr.vcxproj (101,5)". This
>> is
>> >> most likely a build authoring error. This subsequent import will be
>> ignored.
>> >>
>> 1>C:\Users\matthep\Documents\Code\apr\apr-util\build\preaprutil.vcxproj(86,5):
>> >> warning MSB4011:
>> >>
>> "C:\Users\matthep\AppData\Local\Microsoft\MSBuild\v4.0\Microsoft.Cpp.Win32.user.props"
>> >> cannot be imported again. It was already imported at
>> >> "C:\Users\matthep\Documents\Code\apr\apr-util\build\preaprutil.vcxproj
>> >> (79,5)". This is most likely a build authoring error. This subsequent
>> import
>> >> will be ignored.
>> >>
>> 1>C:\Users\matthep\Documents\Code\apr\apr-util\dbd\apr_dbd_freetds.vcxproj(81,5):
>> >> warning MSB4011:
>> >>
>> "C:\Users\matthep\AppData\Local\Microsoft\MSBuild\v4.0\Microsoft.Cpp.Win32.user.props"
>> >> cannot be imported again. It was already imported at
>> >>
>> "C:\Users\matthep\Documents\Code\apr\apr-util\dbd\apr_dbd_freetds.vcxproj
>> >> (75,5)". This is most likely a build authoring error. This subsequent
>> import
>> >> will be ignored.
>> >> 1>  apr_atomic.c
>> >>
>> 2>C:\Users\matthep\Documents\Code\apr\apr-util\crypto\apr_crypto_nss.vcxproj(70,5):
>> >> warning MSB4011:
>> >>
>> "C:\Users\matthep\AppData\Local\Microsoft\MSBuild\v4.0\Microsoft.Cpp.Win32.user.props"
>> >> cannot be imported again. It was already imported at
>> >>
>> "C:\Users\matthep\Documents\Code\apr\apr-util\crypto\apr_crypto_nss.vcxproj
>> >> (63,5)". This is most likely a build authoring error. This subsequent
>> import
>> >> will be ignored.
>> >>
>> 2>C:\Users\matthep\Documents\Code\apr\apr-util\crypto\apr_crypto_openssl.vcxproj(85,5):
>> >> warning MSB4011:
>> >>
>> "C:\Users\matthep\AppData\Local\Microsoft\MSBuild\v4.0\Microsoft.Cpp.Win32.user.props"
>> >> cannot be imported again. It was already imported at
>> >>
>> "C:\Users\matthep\Documents\Code\apr\apr-util\crypto\apr_crypto_openssl.vcxproj
>> >> (78,5)". This is most likely a build authoring error. This subsequent
>> import
>> >> will be ignored.
>> >>
>> 2>C:\Users\matthep\Documents\Code\apr\apr-util\dbd\apr_dbd_mysql.vcxproj(81,5):
>> >> warning MSB4011:
>> >>
>> "C:\Users\matthep\AppData\Local\Microsoft\MSBuild\v4.0\Microsoft.Cpp.Win32.user.props"
>> >> cannot be imported again. It was already imported at
>> >> "C:\Users\matthep\Documents\Code\apr\apr-util\dbd\apr_dbd_mysql.vcxproj
>> >> (75,5)". This is most likely a build authoring error. This subsequent
>> import
>> >> will be ignored.
>> >>
>> 2>C:\Users\matthep\Documents\Code\apr\apr-util\libaprutil.vcxproj(81,5):
>> >> warning MSB4011:
>> >>
>> "C:\Users\matthep\AppData\Local\Microsoft\MSBuild\v4.0\Microsoft.Cpp.Win32.user.props"
>> >> cannot be imported again. It was already imported at
>> >> "C:\Users\matthep\Documents\Code\apr\apr-util\libaprutil.vcxproj
>> (78,5)".
>> >> This is most likely a build authoring error. This subsequent import
>> will be
>> >> ignored.
>> >> 2>C:\Users\matthep\Documents\Code\apr\apr\libapr.vcxproj(111,5):
>> warning
>> >> MSB4011:
>> >>
>> "C:\Users\matthep\AppData\Local\Microsoft\MSBuild\v4.0\Microsoft.Cpp.Win32.user.props"
>> >> cannot be imported again. It was already imported at
>> >> "C:\Users\matthep\Documents\Code\apr\apr\libapr.vcxproj (101,5)". This
>> is
>> >> most likely a build authoring error. This subsequent import will be
>> ignored.
>> >>
>> 2>C:\Users\matthep\Documents\Code\apr\apr-util\build\preaprutil.vcxproj(86,5):
>> >> warning MSB4011:
>> >>
>> "C:\Users\matthep\AppData\Local\Microsoft\MSBuild\v4.0\Microsoft.Cpp.Win32.user.props"
>> >> cannot be imported again. It was already imported at
>> >> "C:\Users\matthep\Documents\Code\apr\apr-util\build\preaprutil.vcxproj
>> >> (79,5)". This is most likely a build authoring error. This subsequent
>> import
>> >> will be ignored.
>> >> 2>C:\Program Files
>> >>
>> (x86)\MSBuild\Microsoft.Cpp\v4.0\V110\Microsoft.CppCommon.targets(177,5):
>> >> warning MSB8018: No outputs specified for item "include\apr.hw". Its
>> custom
>> >> build command will be skipped.
>> >>
>> 2>C:\Users\matthep\Documents\Code\apr\apr-util\dbd\apr_dbd_freetds.vcxproj(81,5):
>> >> warning MSB4011:
>> >>
>> "C:\Users\matthep\AppData\Local\Microsoft\MSBuild\v4.0\Microsoft.Cpp.Win32.user.props"
>> >> cannot be imported again. It was already imported at
>> >>
>> "C:\Users\matthep\Documents\Code\apr\apr-util\dbd\apr_dbd_freetds.vcxproj
>> >> (75,5)". This is most likely a build authoring error. This subsequent
>> import
>> >> will be ignored.
>> >>
>> 3>C:\Users\matthep\Documents\Code\apr\apr-util\crypto\apr_crypto_openssl.vcxproj(85,5):
>> >> warning MSB4011:
>> >>
>> "C:\Users\matthep\AppData\Local\Microsoft\MSBuild\v4.0\Microsoft.Cpp.Win32.user.props"
>> >> cannot be imported again. It was already imported at
>> >>
>> "C:\Users\matthep\Documents\Code\apr\apr-util\crypto\apr_crypto_openssl.vcxproj
>> >> (78,5)". This is most likely a build authoring error. This subsequent
>> import
>> >> will be ignored.
>> >>
>> 3>C:\Users\matthep\Documents\Code\apr\apr-util\dbd\apr_dbd_mysql.vcxproj(81,5):
>> >> warning MSB4011:
>> >>
>> "C:\Users\matthep\AppData\Local\Microsoft\MSBuild\v4.0\Microsoft.Cpp.Win32.user.props"
>> >> cannot be imported again. It was already imported at
>> >> "C:\Users\matthep\Documents\Code\apr\apr-util\dbd\apr_dbd_mysql.vcxproj
>> >> (75,5)". This is most likely a build authoring error. This subsequent
>> import
>> >> will be ignored.
>> >>
>> 3>C:\Users\matthep\Documents\Code\apr\apr-util\libaprutil.vcxproj(81,5):
>> >> warning MSB4011:
>> >>
>> "C:\Users\matthep\AppData\Local\Microsoft\MSBuild\v4.0\Microsoft.Cpp.Win32.user.props"
>> >> cannot be imported again. It was already imported at
>> >> "C:\Users\matthep\Documents\Code\apr\apr-util\libaprutil.vcxproj
>> (78,5)".
>> >> This is most likely a build authoring error. This subsequent import
>> will be
>> >> ignored.
>> >> 3>C:\Program Files
>> >>
>> (x86)\MSBuild\Microsoft.Cpp\v4.0\V110\Microsoft.CppCommon.targets(177,5):
>> >> warning MSB8018: No outputs specified for item "include\apr_ldap.hw".
>> Its
>> >> custom build command will be skipped.
>> >> 3>C:\Program Files
>> >>
>> (x86)\MSBuild\Microsoft.Cpp\v4.0\V110\Microsoft.CppCommon.targets(177,5):
>> >> warning MSB8018: No outputs specified for item "include\apu.hw". Its
>> custom
>> >> build command will be skipped.
>> >> 3>C:\Program Files
>> >>
>> (x86)\MSBuild\Microsoft.Cpp\v4.0\V110\Microsoft.CppCommon.targets(177,5):
>> >> warning MSB8018: No outputs specified for item
>> >> "include\private\apu_config.hw". Its custom build command will be
>> skipped.
>> >> 3>C:\Program Files
>> >>
>> (x86)\MSBuild\Microsoft.Cpp\v4.0\V110\Microsoft.CppCommon.targets(177,5):
>> >> warning MSB8018: No outputs specified for item
>> >> "include\private\apu_select_dbm.hw". Its custom build command will be
>> >> skipped.
>> >> 3>C:\Program Files
>> >>
>> (x86)\MSBuild\Microsoft.Cpp\v4.0\V110\Microsoft.CppCommon.targets(177,5):
>> >> warning MSB8018: No outputs specified for item "include\apu_want.hw".
>> Its
>> >> custom build command will be skipped.
>> >> 3>C:\Users\matthep\Documents\Code\apr\apr\libapr.vcxproj(111,5):
>> warning
>> >> MSB4011:
>> >>
>> "C:\Users\matthep\AppData\Local\Microsoft\MSBuild\v4.0\Microsoft.Cpp.Win32.user.props"
>> >> cannot be imported again. It was already imported at
>> >> "C:\Users\matthep\Documents\Code\apr\apr\libapr.vcxproj (101,5)". This
>> is
>> >> most likely a build authoring error. This subsequent import will be
>> ignored.
>> >>
>> 3>C:\Users\matthep\Documents\Code\apr\apr-util\build\preaprutil.vcxproj(86,5):
>> >> warning MSB4011:
>> >>
>> "C:\Users\matthep\AppData\Local\Microsoft\MSBuild\v4.0\Microsoft.Cpp.Win32.user.props"
>> >> cannot be imported again. It was already imported at
>> >> "C:\Users\matthep\Documents\Code\apr\apr-util\build\preaprutil.vcxproj
>> >> (79,5)". This is most likely a build authoring error. This subsequent
>> import
>> >> will be ignored.
>> >>
>> 3>C:\Users\matthep\Documents\Code\apr\apr-util\dbd\apr_dbd_freetds.vcxproj(81,5):
>> >> warning MSB4011:
>> >>
>> "C:\Users\matthep\AppData\Local\Microsoft\MSBuild\v4.0\Microsoft.Cpp.Win32.user.props"
>> >> cannot be imported again. It was already imported at
>> >>
>> "C:\Users\matthep\Documents\Code\apr\apr-util\dbd\apr_dbd_freetds.vcxproj
>> >> (75,5)". This is most likely a build authoring error. This subsequent
>> import
>> >> will be ignored.
>> >> 3>  apr_brigade.c
>> >>
>> 4>C:\Users\matthep\Documents\Code\apr\apr-util\crypto\apr_crypto_openssl.vcxproj(85,5):
>> >> warning MSB4011:
>> >>
>> "C:\Users\matthep\AppData\Local\Microsoft\MSBuild\v4.0\Microsoft.Cpp.Win32.user.props"
>> >> cannot be imported again. It was already imported at
>> >>
>> "C:\Users\matthep\Documents\Code\apr\apr-util\crypto\apr_crypto_openssl.vcxproj
>> >> (78,5)". This is most likely a build authoring error. This subsequent
>> import
>> >> will be ignored.
>> >>
>> 4>C:\Users\matthep\Documents\Code\apr\apr-util\dbd\apr_dbd_mysql.vcxproj(81,5):
>> >> warning MSB4011:
>> >>
>> "C:\Users\matthep\AppData\Local\Microsoft\MSBuild\v4.0\Microsoft.Cpp.Win32.user.props"
>> >> cannot be imported again. It was already imported at
>> >> "C:\Users\matthep\Documents\Code\apr\apr-util\dbd\apr_dbd_mysql.vcxproj
>> >> (75,5)". This is most likely a build authoring error. This subsequent
>> import
>> >> will be ignored.
>> >>
>> 4>C:\Users\matthep\Documents\Code\apr\apr-util\libaprutil.vcxproj(81,5):
>> >> warning MSB4011:
>> >>
>> "C:\Users\matthep\AppData\Local\Microsoft\MSBuild\v4.0\Microsoft.Cpp.Win32.user.props"
>> >> cannot be imported again. It was already imported at
>> >> "C:\Users\matthep\Documents\Code\apr\apr-util\libaprutil.vcxproj
>> (78,5)".
>> >> This is most likely a build authoring error. This subsequent import
>> will be
>> >> ignored.
>> >> 4>C:\Users\matthep\Documents\Code\apr\apr\libapr.vcxproj(111,5):
>> warning
>> >> MSB4011:
>> >>
>> "C:\Users\matthep\AppData\Local\Microsoft\MSBuild\v4.0\Microsoft.Cpp.Win32.user.props"
>> >> cannot be imported again. It was already imported at
>> >> "C:\Users\matthep\Documents\Code\apr\apr\libapr.vcxproj (101,5)". This
>> is
>> >> most likely a build authoring error. This subsequent import will be
>> ignored.
>> >>
>> 4>C:\Users\matthep\Documents\Code\apr\apr-util\build\preaprutil.vcxproj(86,5):
>> >> warning MSB4011:
>> >>
>> "C:\Users\matthep\AppData\Local\Microsoft\MSBuild\v4.0\Microsoft.Cpp.Win32.user.props"
>> >> cannot be imported again. It was already imported at
>> >> "C:\Users\matthep\Documents\Code\apr\apr-util\build\preaprutil.vcxproj
>> >> (79,5)". This is most likely a build authoring error. This subsequent
>> import
>> >> will be ignored.
>> >>
>> 5>C:\Users\matthep\Documents\Code\apr\apr-util\crypto\apr_crypto_openssl.vcxproj(85,5):
>> >> warning MSB4011:
>> >>
>> "C:\Users\matthep\AppData\Local\Microsoft\MSBuild\v4.0\Microsoft.Cpp.Win32.user.props"
>> >> cannot be imported again. It was already imported at
>> >>
>> "C:\Users\matthep\Documents\Code\apr\apr-util\crypto\apr_crypto_openssl.vcxproj
>> >> (78,5)". This is most likely a build authoring error. This subsequent
>> import
>> >> will be ignored.
>> >>
>> 5>C:\Users\matthep\Documents\Code\apr\apr-util\dbd\apr_dbd_mysql.vcxproj(81,5):
>> >> warning MSB4011:
>> >>
>> "C:\Users\matthep\AppData\Local\Microsoft\MSBuild\v4.0\Microsoft.Cpp.Win32.user.props"
>> >> cannot be imported again. It was already imported at
>> >> "C:\Users\matthep\Documents\Code\apr\apr-util\dbd\apr_dbd_mysql.vcxproj
>> >> (75,5)". This is most likely a build authoring error. This subsequent
>> import
>> >> will be ignored.
>> >>
>> 5>C:\Users\matthep\Documents\Code\apr\apr-util\libaprutil.vcxproj(81,5):
>> >> warning MSB4011:
>> >>
>> "C:\Users\matthep\AppData\Local\Microsoft\MSBuild\v4.0\Microsoft.Cpp.Win32.user.props"
>> >> cannot be imported again. It was already imported at
>> >> "C:\Users\matthep\Documents\Code\apr\apr-util\libaprutil.vcxproj
>> (78,5)".
>> >> This is most likely a build authoring error. This subsequent import
>> will be
>> >> ignored.
>> >> 5>C:\Users\matthep\Documents\Code\apr\apr\libapr.vcxproj(111,5):
>> warning
>> >> MSB4011:
>> >>
>> "C:\Users\matthep\AppData\Local\Microsoft\MSBuild\v4.0\Microsoft.Cpp.Win32.user.props"
>> >> cannot be imported again. It was already imported at
>> >> "C:\Users\matthep\Documents\Code\apr\apr\libapr.vcxproj (101,5)". This
>> is
>> >> most likely a build authoring error. This subsequent import will be
>> ignored.
>> >> 5>  apr_crypto_nss.c
>> >> 6>  apr_crypto_openssl.c
>> >>
>> 8>C:\Users\matthep\Documents\Code\apr\apr-util\build\preaprutil.vcxproj(86,5):
>> >> warning MSB4011:
>> >>
>> "C:\Users\matthep\AppData\Local\Microsoft\MSBuild\v4.0\Microsoft.Cpp.Win32.user.props"
>> >> cannot be imported again. It was already imported at
>> >> "C:\Users\matthep\Documents\Code\apr\apr-util\build\preaprutil.vcxproj
>> >> (79,5)". This is most likely a build authoring error. This subsequent
>> import
>> >> will be ignored.
>> >>
>> 8>C:\Users\matthep\Documents\Code\apr\apr-util\dbd\apr_dbd_freetds.vcxproj(81,5):
>> >> warning MSB4011:
>> >>
>> "C:\Users\matthep\AppData\Local\Microsoft\MSBuild\v4.0\Microsoft.Cpp.Win32.user.props"
>> >> cannot be imported again. It was already imported at
>> >>
>> "C:\Users\matthep\Documents\Code\apr\apr-util\dbd\apr_dbd_freetds.vcxproj
>> >> (75,5)". This is most likely a build authoring error. This subsequent
>> import
>> >> will be ignored.
>> >> 8>  apr_dbd_mysql.c
>> >>
>> 7>C:\Users\matthep\Documents\Code\apr\apr-util\dbd\apr_dbd_freetds.vcxproj(81,5):
>> >> warning MSB4011:
>> >>
>> "C:\Users\matthep\AppData\Local\Microsoft\MSBuild\v4.0\Microsoft.Cpp.Win32.user.props"
>> >> cannot be imported again. It was already imported at
>> >>
>> "C:\Users\matthep\Documents\Code\apr\apr-util\dbd\apr_dbd_freetds.vcxproj
>> >> (75,5)". This is most likely a build authoring error. This subsequent
>> import
>> >> will be ignored.
>> >> 7>  apr_dbd_freetds.c
>> >> 2>  apr_atomic.c
>> >> 2>  dso.c
>> >> 7>apr_dbd_freetds.c(48): fatal error C1083: Cannot open include file:
>> >> 'regex.h': No such file or directory
>> >> 8>apr_dbd_mysql.c(43): fatal error C1083: Cannot open include file:
>> >> 'mysql.h': No such file or directory
>> >> 9>------ Build started: Project: apr_dbd_oracle, Configuration: Release
>> >> Win32 ------
>> >> 6>C:\Users\matthep\Documents\Code\apr\apr\libapr.vcxproj(111,5):
>> warning
>> >> MSB4011:
>> >>
>> "C:\Users\matthep\AppData\Local\Microsoft\MSBuild\v4.0\Microsoft.Cpp.Win32.user.props"
>> >> cannot be imported again. It was already imported at
>> >> "C:\Users\matthep\Documents\Code\apr\apr\libapr.vcxproj (101,5)". This
>> is
>> >> most likely a build authoring error. This subsequent import will be
>> ignored.
>> >>
>> 6>C:\Users\matthep\Documents\Code\apr\apr-util\build\preaprutil.vcxproj(86,5):
>> >> warning MSB4011:
>> >>
>> "C:\Users\matthep\AppData\Local\Microsoft\MSBuild\v4.0\Microsoft.Cpp.Win32.user.props"
>> >> cannot be imported again. It was already imported at
>> >> "C:\Users\matthep\Documents\Code\apr\apr-util\build\preaprutil.vcxproj
>> >> (79,5)". This is most likely a build authoring error. This subsequent
>> import
>> >> will be ignored.
>> >>
>> 6>C:\Users\matthep\Documents\Code\apr\apr-util\dbd\apr_dbd_freetds.vcxproj(81,5):
>> >> warning MSB4011:
>> >>
>> "C:\Users\matthep\AppData\Local\Microsoft\MSBuild\v4.0\Microsoft.Cpp.Win32.user.props"
>> >> cannot be imported again. It was already imported at
>> >>
>> "C:\Users\matthep\Documents\Code\apr\apr-util\dbd\apr_dbd_freetds.vcxproj
>> >> (75,5)". This is most likely a build authoring error. This subsequent
>> import
>> >> will be ignored.
>> >> 6>LINK : fatal error LNK1181: cannot open input file 'libeay32.lib'
>> >> 10>------ Build started: Project: apr_dbd_pgsql, Configuration: Release
>> >> Win32 ------
>> >>
>> 2>C:\Users\matthep\Documents\Code\apr\apr-util\dbd\apr_dbd_oracle.vcxproj(85,5):
>> >> warning MSB4011:
>> >>
>> "C:\Users\matthep\AppData\Local\Microsoft\MSBuild\v4.0\Microsoft.Cpp.Win32.user.props"
>> >> cannot be imported again. It was already imported at
>> >>
>> "C:\Users\matthep\Documents\Code\apr\apr-util\dbd\apr_dbd_oracle.vcxproj
>> >> (75,5)". This is most likely a build authoring error. This subsequent
>> import
>> >> will be ignored.
>> >>
>> 9>C:\Users\matthep\Documents\Code\apr\apr-util\dbd\apr_dbd_oracle.vcxproj(85,5):
>> >> warning MSB4011:
>> >>
>> "C:\Users\matthep\AppData\Local\Microsoft\MSBuild\v4.0\Microsoft.Cpp.Win32.user.props"
>> >> cannot be imported again. It was already imported at
>> >>
>> "C:\Users\matthep\Documents\Code\apr\apr-util\dbd\apr_dbd_oracle.vcxproj
>> >> (75,5)". This is most likely a build authoring error. This subsequent
>> import
>> >> will be ignored.
>> >>
>> 5>C:\Users\matthep\Documents\Code\apr\apr-util\build\preaprutil.vcxproj(86,5):
>> >> warning MSB4011:
>> >>
>> "C:\Users\matthep\AppData\Local\Microsoft\MSBuild\v4.0\Microsoft.Cpp.Win32.user.props"
>> >> cannot be imported again. It was already imported at
>> >> "C:\Users\matthep\Documents\Code\apr\apr-util\build\preaprutil.vcxproj
>> >> (79,5)". This is most likely a build authoring error. This subsequent
>> import
>> >> will be ignored.
>> >>
>> 5>C:\Users\matthep\Documents\Code\apr\apr-util\dbd\apr_dbd_freetds.vcxproj(81,5):
>> >> warning MSB4011:
>> >>
>> "C:\Users\matthep\AppData\Local\Microsoft\MSBuild\v4.0\Microsoft.Cpp.Win32.user.props"
>> >> cannot be imported again. It was already imported at
>> >>
>> "C:\Users\matthep\Documents\Code\apr\apr-util\dbd\apr_dbd_freetds.vcxproj
>> >> (75,5)". This is most likely a build authoring error. This subsequent
>> import
>> >> will be ignored.
>> >> 5>FileTracker : error FTK1011: could not create the new file tracking
>> log
>> >> file:
>> >>
>> C:\Users\matthep\Documents\Code\apr\apr-util\crypto\Release\CL.read.1.tlog.
>> >> The file exists.
>> >> 5>
>> >> 11>------ Build started: Project: apr_dbd_sqlite2, Configuration:
>> Release
>> >> Win32 ------
>> >> 5>
>> >> 5>
>> >> 3>  apr_buckets.c
>> >>
>> 2>C:\Users\matthep\Documents\Code\apr\apr-util\dbd\apr_dbd_pgsql.vcxproj(85,5):
>> >> warning MSB4011:
>> >>
>> "C:\Users\matthep\AppData\Local\Microsoft\MSBuild\v4.0\Microsoft.Cpp.Win32.user.props"
>> >> cannot be imported again. It was already imported at
>> >> "C:\Users\matthep\Documents\Code\apr\apr-util\dbd\apr_dbd_pgsql.vcxproj
>> >> (75,5)". This is most likely a build authoring error. This subsequent
>> import
>> >> will be ignored.
>> >>
>> 9>C:\Users\matthep\Documents\Code\apr\apr-util\dbd\apr_dbd_pgsql.vcxproj(85,5):
>> >> warning MSB4011:
>> >>
>> "C:\Users\matthep\AppData\Local\Microsoft\MSBuild\v4.0\Microsoft.Cpp.Win32.user.props"
>> >> cannot be imported again. It was already imported at
>> >> "C:\Users\matthep\Documents\Code\apr\apr-util\dbd\apr_dbd_pgsql.vcxproj
>> >> (75,5)". This is most likely a build authoring error. This subsequent
>> import
>> >> will be ignored.
>> >>
>> 10>C:\Users\matthep\Documents\Code\apr\apr-util\dbd\apr_dbd_pgsql.vcxproj(85,5):
>> >> warning MSB4011:
>> >>
>> "C:\Users\matthep\AppData\Local\Microsoft\MSBuild\v4.0\Microsoft.Cpp.Win32.user.props"
>> >> cannot be imported again. It was already imported at
>> >> "C:\Users\matthep\Documents\Code\apr\apr-util\dbd\apr_dbd_pgsql.vcxproj
>> >> (75,5)". This is most likely a build authoring error. This subsequent
>> import
>> >> will be ignored.
>> >>
>> 11>C:\Users\matthep\Documents\Code\apr\apr-util\dbd\apr_dbd_pgsql.vcxproj(85,5):
>> >> warning MSB4011:
>> >>
>> "C:\Users\matthep\AppData\Local\Microsoft\MSBuild\v4.0\Microsoft.Cpp.Win32.user.props"
>> >> cannot be imported again. It was already imported at
>> >> "C:\Users\matthep\Documents\Code\apr\apr-util\dbd\apr_dbd_pgsql.vcxproj
>> >> (75,5)". This is most likely a build authoring error. This subsequent
>> import
>> >> will be ignored.
>> >>
>> 11>C:\Users\matthep\Documents\Code\apr\apr-util\dbd\apr_dbd_sqlite2.vcxproj(85,5):
>> >> warning MSB4011:
>> >>
>> "C:\Users\matthep\AppData\Local\Microsoft\MSBuild\v4.0\Microsoft.Cpp.Win32.user.props"
>> >> cannot be imported again. It was already imported at
>> >>
>> "C:\Users\matthep\Documents\Code\apr\apr-util\dbd\apr_dbd_sqlite2.vcxproj
>> >> (82,5)". This is most likely a build authoring error. This subsequent
>> import
>> >> will be ignored.
>> >> 9>  apr_dbd_oracle.c
>> >>
>> 2>C:\Users\matthep\Documents\Code\apr\apr-util\dbd\apr_dbd_sqlite2.vcxproj(85,5):
>> >> warning MSB4011:
>> >>
>> "C:\Users\matthep\AppData\Local\Microsoft\MSBuild\v4.0\Microsoft.Cpp.Win32.user.props"
>> >> cannot be imported again. It was already imported at
>> >>
>> "C:\Users\matthep\Documents\Code\apr\apr-util\dbd\apr_dbd_sqlite2.vcxproj
>> >> (82,5)". This is most likely a build authoring error. This subsequent
>> import
>> >> will be ignored.
>> >>
>> 10>C:\Users\matthep\Documents\Code\apr\apr-util\dbd\apr_dbd_sqlite2.vcxproj(85,5):
>> >> warning MSB4011:
>> >>
>> "C:\Users\matthep\AppData\Local\Microsoft\MSBuild\v4.0\Microsoft.Cpp.Win32.user.props"
>> >> cannot be imported again. It was already imported at
>> >>
>> "C:\Users\matthep\Documents\Code\apr\apr-util\dbd\apr_dbd_sqlite2.vcxproj
>> >> (82,5)". This is most likely a build authoring error. This subsequent
>> import
>> >> will be ignored.
>> >>
>> 9>C:\Users\matthep\Documents\Code\apr\apr-util\dbd\apr_dbd_sqlite2.vcxproj(85,5):
>> >> warning MSB4011:
>> >>
>> "C:\Users\matthep\AppData\Local\Microsoft\MSBuild\v4.0\Microsoft.Cpp.Win32.user.props"
>> >> cannot be imported again. It was already imported at
>> >>
>> "C:\Users\matthep\Documents\Code\apr\apr-util\dbd\apr_dbd_sqlite2.vcxproj
>> >> (82,5)". This is most likely a build authoring error. This subsequent
>> import
>> >> will be ignored.
>> >> 9>apr_dbd_oracle.c(60): fatal error C1083: Cannot open include file:
>> >> 'oci.h': No such file or directory
>> >> 10>  apr_dbd_pgsql.c
>> >> 12>------ Build started: Project: apr_dbd_sqlite3, Configuration:
>> Release
>> >> Win32 ------
>> >>
>> 3>C:\Users\matthep\Documents\Code\apr\apr-util\dbd\apr_dbd_oracle.vcxproj(85,5):
>> >> warning MSB4011:
>> >>
>> "C:\Users\matthep\AppData\Local\Microsoft\MSBuild\v4.0\Microsoft.Cpp.Win32.user.props"
>> >> cannot be imported again. It was already imported at
>> >>
>> "C:\Users\matthep\Documents\Code\apr\apr-util\dbd\apr_dbd_oracle.vcxproj
>> >> (75,5)". This is most likely a build authoring error. This subsequent
>> import
>> >> will be ignored.
>> >>
>> 3>C:\Users\matthep\Documents\Code\apr\apr-util\dbd\apr_dbd_pgsql.vcxproj(85,5):
>> >> warning MSB4011:
>> >>
>> "C:\Users\matthep\AppData\Local\Microsoft\MSBuild\v4.0\Microsoft.Cpp.Win32.user.props"
>> >> cannot be imported again. It was already imported at
>> >> "C:\Users\matthep\Documents\Code\apr\apr-util\dbd\apr_dbd_pgsql.vcxproj
>> >> (75,5)". This is most likely a build authoring error. This subsequent
>> import
>> >> will be ignored.
>> >>
>> 3>C:\Users\matthep\Documents\Code\apr\apr-util\dbd\apr_dbd_sqlite2.vcxproj(85,5):
>> >> warning MSB4011:
>> >>
>> "C:\Users\matthep\AppData\Local\Microsoft\MSBuild\v4.0\Microsoft.Cpp.Win32.user.props"
>> >> cannot be imported again. It was already imported at
>> >>
>> "C:\Users\matthep\Documents\Code\apr\apr-util\dbd\apr_dbd_sqlite2.vcxproj
>> >> (82,5)". This is most likely a build authoring error. This subsequent
>> import
>> >> will be ignored.
>> >> 11>  apr_dbd_sqlite2.c
>> >> 10>apr_dbd_pgsql.c(27): fatal error C1083: Cannot open include file:
>> >> 'libpq-fe.h': No such file or directory
>> >> 3>  apr_buckets_alloc.c
>> >> 13>------ Build started: Project: apr_dbm_db, Configuration: Release
>> Win32
>> >> ------
>> >>
>> 2>C:\Users\matthep\Documents\Code\apr\apr-util\dbd\apr_dbd_sqlite3.vcxproj(85,5):
>> >> warning MSB4011:
>> >>
>> "C:\Users\matthep\AppData\Local\Microsoft\MSBuild\v4.0\Microsoft.Cpp.Win32.user.props"
>> >> cannot be imported again. It was already imported at
>> >>
>> "C:\Users\matthep\Documents\Code\apr\apr-util\dbd\apr_dbd_sqlite3.vcxproj
>> >> (82,5)". This is most likely a build authoring error. This subsequent
>> import
>> >> will be ignored.
>> >>
>> 10>C:\Users\matthep\Documents\Code\apr\apr-util\dbd\apr_dbd_sqlite3.vcxproj(85,5):
>> >> warning MSB4011:
>> >>
>> "C:\Users\matthep\AppData\Local\Microsoft\MSBuild\v4.0\Microsoft.Cpp.Win32.user.props"
>> >> cannot be imported again. It was already imported at
>> >>
>> "C:\Users\matthep\Documents\Code\apr\apr-util\dbd\apr_dbd_sqlite3.vcxproj
>> >> (82,5)". This is most likely a build authoring error. This subsequent
>> import
>> >> will be ignored.
>> >>
>> 12>C:\Users\matthep\Documents\Code\apr\apr-util\dbd\apr_dbd_sqlite3.vcxproj(85,5):
>> >> warning MSB4011:
>> >>
>> "C:\Users\matthep\AppData\Local\Microsoft\MSBuild\v4.0\Microsoft.Cpp.Win32.user.props"
>> >> cannot be imported again. It was already imported at
>> >>
>> "C:\Users\matthep\Documents\Code\apr\apr-util\dbd\apr_dbd_sqlite3.vcxproj
>> >> (82,5)". This is most likely a build authoring error. This subsequent
>> import
>> >> will be ignored.
>> >> 2>  buffer.c
>> >>
>> 3>C:\Users\matthep\Documents\Code\apr\apr-util\dbd\apr_dbd_sqlite3.vcxproj(85,5):
>> >> warning MSB4011:
>> >>
>> "C:\Users\matthep\AppData\Local\Microsoft\MSBuild\v4.0\Microsoft.Cpp.Win32.user.props"
>> >> cannot be imported again. It was already imported at
>> >>
>> "C:\Users\matthep\Documents\Code\apr\apr-util\dbd\apr_dbd_sqlite3.vcxproj
>> >> (82,5)". This is most likely a build authoring error. This subsequent
>> import
>> >> will be ignored.
>> >>
>> 2>C:\Users\matthep\Documents\Code\apr\apr-util\dbm\apr_dbm_db.vcxproj(78,5):
>> >> warning MSB4011:
>> >>
>> "C:\Users\matthep\AppData\Local\Microsoft\MSBuild\v4.0\Microsoft.Cpp.Win32.user.props"
>> >> cannot be imported again. It was already imported at
>> >> "C:\Users\matthep\Documents\Code\apr\apr-util\dbm\apr_dbm_db.vcxproj
>> >> (75,5)". This is most likely a build authoring error. This subsequent
>> import
>> >> will be ignored.
>> >>
>> 3>C:\Users\matthep\Documents\Code\apr\apr-util\dbm\apr_dbm_db.vcxproj(78,5):
>> >> warning MSB4011:
>> >>
>> "C:\Users\matthep\AppData\Local\Microsoft\MSBuild\v4.0\Microsoft.Cpp.Win32.user.props"
>> >> cannot be imported again. It was already imported at
>> >> "C:\Users\matthep\Documents\Code\apr\apr-util\dbm\apr_dbm_db.vcxproj
>> >> (75,5)". This is most likely a build authoring error. This subsequent
>> import
>> >> will be ignored.
>> >>
>> 10>C:\Users\matthep\Documents\Code\apr\apr-util\dbm\apr_dbm_db.vcxproj(78,5):
>> >> warning MSB4011:
>> >>
>> "C:\Users\matthep\AppData\Local\Microsoft\MSBuild\v4.0\Microsoft.Cpp.Win32.user.props"
>> >> cannot be imported again. It was already imported at
>> >> "C:\Users\matthep\Documents\Code\apr\apr-util\dbm\apr_dbm_db.vcxproj
>> >> (75,5)". This is most likely a build authoring error. This subsequent
>> import
>> >> will be ignored.
>> >>
>> 12>C:\Users\matthep\Documents\Code\apr\apr-util\dbm\apr_dbm_db.vcxproj(78,5):
>> >> warning MSB4011:
>> >>
>> "C:\Users\matthep\AppData\Local\Microsoft\MSBuild\v4.0\Microsoft.Cpp.Win32.user.props"
>> >> cannot be imported again. It was already imported at
>> >> "C:\Users\matthep\Documents\Code\apr\apr-util\dbm\apr_dbm_db.vcxproj
>> >> (75,5)". This is most likely a build authoring error. This subsequent
>> import
>> >> will be ignored.
>> >>
>> 13>C:\Users\matthep\Documents\Code\apr\apr-util\dbm\apr_dbm_db.vcxproj(78,5):
>> >> warning MSB4011:
>> >>
>> "C:\Users\matthep\AppData\Local\Microsoft\MSBuild\v4.0\Microsoft.Cpp.Win32.user.props"
>> >> cannot be imported again. It was already imported at
>> >> "C:\Users\matthep\Documents\Code\apr\apr-util\dbm\apr_dbm_db.vcxproj
>> >> (75,5)". This is most likely a build authoring error. This subsequent
>> import
>> >> will be ignored.
>> >> 14>------ Build started: Project: apr_dbm_gdbm, Configuration: Release
>> Win32
>> >> ------
>> >> 12>  apr_dbd_sqlite3.c
>> >>
>> 11>C:\Users\matthep\Documents\Code\apr\apr-util\dbd\apr_dbd_sqlite3.vcxproj(85,5):
>> >> warning MSB4011:
>> >>
>> "C:\Users\matthep\AppData\Local\Microsoft\MSBuild\v4.0\Microsoft.Cpp.Win32.user.props"
>> >> cannot be imported again. It was already imported at
>> >>
>> "C:\Users\matthep\Documents\Code\apr\apr-util\dbd\apr_dbd_sqlite3.vcxproj
>> >> (82,5)". This is most likely a build authoring error. This subsequent
>> import
>> >> will be ignored.
>> >> 11>apr_dbd_sqlite2.c(24): fatal error C1083: Cannot open include file:
>> >> 'sqlite.h': No such file or directory
>> >>
>> 11>C:\Users\matthep\Documents\Code\apr\apr-util\dbm\apr_dbm_db.vcxproj(78,5):
>> >> warning MSB4011:
>> >>
>> "C:\Users\matthep\AppData\Local\Microsoft\MSBuild\v4.0\Microsoft.Cpp.Win32.user.props"
>> >> cannot be imported again. It was already imported at
>> >> "C:\Users\matthep\Documents\Code\apr\apr-util\dbm\apr_dbm_db.vcxproj
>> >> (75,5)". This is most likely a build authoring error. This subsequent
>> import
>> >> will be ignored.
>> >> 12>apr_dbd_sqlite3.c(24): fatal error C1083: Cannot open include file:
>> >> 'sqlite3.h': No such file or directory
>> >> 13>  apr_dbm_berkeleydb.c
>> >> 15>------ Build started: Project: apr_ldap, Configuration: Release
>> Win32
>> >> ------
>> >> 1>  dso.c
>> >>
>> 1>C:\Users\matthep\Documents\Code\apr\apr-util\dbd\apr_dbd_oracle.vcxproj(85,5):
>> >> warning MSB4011:
>> >>
>> "C:\Users\matthep\AppData\Local\Microsoft\MSBuild\v4.0\Microsoft.Cpp.Win32.user.props"
>> >> cannot be imported again. It was already imported at
>> >>
>> "C:\Users\matthep\Documents\Code\apr\apr-util\dbd\apr_dbd_oracle.vcxproj
>> >> (75,5)". This is most likely a build authoring error. This subsequent
>> import
>> >> will be ignored.
>> >>
>> 1>C:\Users\matthep\Documents\Code\apr\apr-util\dbd\apr_dbd_pgsql.vcxproj(85,5):
>> >> warning MSB4011:
>> >>
>> "C:\Users\matthep\AppData\Local\Microsoft\MSBuild\v4.0\Microsoft.Cpp.Win32.user.props"
>> >> cannot be imported again. It was already imported at
>> >> "C:\Users\matthep\Documents\Code\apr\apr-util\dbd\apr_dbd_pgsql.vcxproj
>> >> (75,5)". This is most likely a build authoring error. This subsequent
>> import
>> >> will be ignored.
>> >>
>> 1>C:\Users\matthep\Documents\Code\apr\apr-util\dbd\apr_dbd_sqlite2.vcxproj(85,5):
>> >> warning MSB4011:
>> >>
>> "C:\Users\matthep\AppData\Local\Microsoft\MSBuild\v4.0\Microsoft.Cpp.Win32.user.props"
>> >> cannot be imported again. It was already imported at
>> >>
>> "C:\Users\matthep\Documents\Code\apr\apr-util\dbd\apr_dbd_sqlite2.vcxproj
>> >> (82,5)". This is most likely a build authoring error. This subsequent
>> import
>> >> will be ignored.
>> >> 1>  buffer.c
>> >>
>> 2>C:\Users\matthep\Documents\Code\apr\apr-util\dbm\apr_dbm_gdbm.vcxproj(78,5):
>> >> warning MSB4011:
>> >>
>> "C:\Users\matthep\AppData\Local\Microsoft\MSBuild\v4.0\Microsoft.Cpp.Win32.user.props"
>> >> cannot be imported again. It was already imported at
>> >> "C:\Users\matthep\Documents\Code\apr\apr-util\dbm\apr_dbm_gdbm.vcxproj
>> >> (75,5)". This is most likely a build authoring error. This subsequent
>> import
>> >> will be ignored.
>> >>
>> 3>C:\Users\matthep\Documents\Code\apr\apr-util\dbm\apr_dbm_gdbm.vcxproj(78,5):
>> >> warning MSB4011:
>> >>
>> "C:\Users\matthep\AppData\Local\Microsoft\MSBuild\v4.0\Microsoft.Cpp.Win32.user.props"
>> >> cannot be imported again. It was already imported at
>> >> "C:\Users\matthep\Documents\Code\apr\apr-util\dbm\apr_dbm_gdbm.vcxproj
>> >> (75,5)". This is most likely a build authoring error. This subsequent
>> import
>> >> will be ignored.
>> >>
>> 12>C:\Users\matthep\Documents\Code\apr\apr-util\dbm\apr_dbm_gdbm.vcxproj(78,5):
>> >> warning MSB4011:
>> >>
>> "C:\Users\matthep\AppData\Local\Microsoft\MSBuild\v4.0\Microsoft.Cpp.Win32.user.props"
>> >> cannot be imported again. It was already imported at
>> >> "C:\Users\matthep\Documents\Code\apr\apr-util\dbm\apr_dbm_gdbm.vcxproj
>> >> (75,5)". This is most likely a build authoring error. This subsequent
>> import
>> >> will be ignored.
>> >>
>> 13>C:\Users\matthep\Documents\Code\apr\apr-util\dbm\apr_dbm_gdbm.vcxproj(78,5):
>> >> warning MSB4011:
>> >>
>> "C:\Users\matthep\AppData\Local\Microsoft\MSBuild\v4.0\Microsoft.Cpp.Win32.user.props"
>> >> cannot be imported again. It was already imported at
>> >> "C:\Users\matthep\Documents\Code\apr\apr-util\dbm\apr_dbm_gdbm.vcxproj
>> >> (75,5)". This is most likely a build authoring error. This subsequent
>> import
>> >> will be ignored.
>> >>
>> 14>C:\Users\matthep\Documents\Code\apr\apr-util\dbm\apr_dbm_gdbm.vcxproj(78,5):
>> >> warning MSB4011:
>> >>
>> "C:\Users\matthep\AppData\Local\Microsoft\MSBuild\v4.0\Microsoft.Cpp.Win32.user.props"
>> >> cannot be imported again. It was already imported at
>> >> "C:\Users\matthep\Documents\Code\apr\apr-util\dbm\apr_dbm_gdbm.vcxproj
>> >> (75,5)". This is most likely a build authoring error. This subsequent
>> import
>> >> will be ignored.
>> >> 14>  apr_dbm_gdbm.c
>> >>
>> 2>C:\Users\matthep\Documents\Code\apr\apr-util\ldap\apr_ldap.vcxproj(85,5):
>> >> warning MSB4011:
>> >>
>> "C:\Users\matthep\AppData\Local\Microsoft\MSBuild\v4.0\Microsoft.Cpp.Win32.user.props"
>> >> cannot be imported again. It was already imported at
>> >> "C:\Users\matthep\Documents\Code\apr\apr-util\ldap\apr_ldap.vcxproj
>> (78,5)".
>> >> This is most likely a build authoring error. This subsequent import
>> will be
>> >> ignored.
>> >>
>> 3>C:\Users\matthep\Documents\Code\apr\apr-util\ldap\apr_ldap.vcxproj(85,5):
>> >> warning MSB4011:
>> >>
>> "C:\Users\matthep\AppData\Local\Microsoft\MSBuild\v4.0\Microsoft.Cpp.Win32.user.props"
>> >> cannot be imported again. It was already imported at
>> >> "C:\Users\matthep\Documents\Code\apr\apr-util\ldap\apr_ldap.vcxproj
>> (78,5)".
>> >> This is most likely a build authoring error. This subsequent import
>> will be
>> >> ignored.
>> >>
>> 13>C:\Users\matthep\Documents\Code\apr\apr-util\ldap\apr_ldap.vcxproj(85,5):
>> >> warning MSB4011:
>> >>
>> "C:\Users\matthep\AppData\Local\Microsoft\MSBuild\v4.0\Microsoft.Cpp.Win32.user.props"
>> >> cannot be imported again. It was already imported at
>> >> "C:\Users\matthep\Documents\Code\apr\apr-util\ldap\apr_ldap.vcxproj
>> (78,5)".
>> >> This is most likely a build authoring error. This subsequent import
>> will be
>> >> ignored.
>> >>
>> 15>C:\Users\matthep\Documents\Code\apr\apr-util\ldap\apr_ldap.vcxproj(85,5):
>> >> warning MSB4011:
>> >>
>> "C:\Users\matthep\AppData\Local\Microsoft\MSBuild\v4.0\Microsoft.Cpp.Win32.user.props"
>> >> cannot be imported again. It was already imported at
>> >> "C:\Users\matthep\Documents\Code\apr\apr-util\ldap\apr_ldap.vcxproj
>> (78,5)".
>> >> This is most likely a build authoring error. This subsequent import
>> will be
>> >> ignored.
>> >> 3>  apr_buckets_eos.c
>> >>
>> 14>C:\Users\matthep\Documents\Code\apr\apr-util\ldap\apr_ldap.vcxproj(85,5):
>> >> warning MSB4011:
>> >>
>> "C:\Users\matthep\AppData\Local\Microsoft\MSBuild\v4.0\Microsoft.Cpp.Win32.user.props"
>> >> cannot be imported again. It was already imported at
>> >> "C:\Users\matthep\Documents\Code\apr\apr-util\ldap\apr_ldap.vcxproj
>> (78,5)".
>> >> This is most likely a build authoring error. This subsequent import
>> will be
>> >> ignored.
>> >> 16>------ Build started: Project: aprutil, Configuration: Release Win32
>> >> ------
>> >>
>> 1>C:\Users\matthep\Documents\Code\apr\apr-util\dbd\apr_dbd_sqlite3.vcxproj(85,5):
>> >> warning MSB4011:
>> >>
>> "C:\Users\matthep\AppData\Local\Microsoft\MSBuild\v4.0\Microsoft.Cpp.Win32.user.props"
>> >> cannot be imported again. It was already imported at
>> >>
>> "C:\Users\matthep\Documents\Code\apr\apr-util\dbd\apr_dbd_sqlite3.vcxproj
>> >> (82,5)". This is most likely a build authoring error. This subsequent
>> import
>> >> will be ignored.
>> >>
>> 1>C:\Users\matthep\Documents\Code\apr\apr-util\dbm\apr_dbm_db.vcxproj(78,5):
>> >> warning MSB4011:
>> >>
>> "C:\Users\matthep\AppData\Local\Microsoft\MSBuild\v4.0\Microsoft.Cpp.Win32.user.props"
>> >> cannot be imported again. It was already imported at
>> >> "C:\Users\matthep\Documents\Code\apr\apr-util\dbm\apr_dbm_db.vcxproj
>> >> (75,5)". This is most likely a build authoring error. This subsequent
>> import
>> >> will be ignored.
>> >> 15>  apr_ldap_init.c
>> >> 2>  copy.c
>> >>
>> 1>C:\Users\matthep\Documents\Code\apr\apr-util\dbm\apr_dbm_gdbm.vcxproj(78,5):
>> >> warning MSB4011:
>> >>
>> "C:\Users\matthep\AppData\Local\Microsoft\MSBuild\v4.0\Microsoft.Cpp.Win32.user.props"
>> >> cannot be imported again. It was already imported at
>> >> "C:\Users\matthep\Documents\Code\apr\apr-util\dbm\apr_dbm_gdbm.vcxproj
>> >> (75,5)". This is most likely a build authoring error. This subsequent
>> import
>> >> will be ignored.
>> >> 1>  copy.c
>> >>
>> 1>C:\Users\matthep\Documents\Code\apr\apr-util\ldap\apr_ldap.vcxproj(85,5):
>> >> warning MSB4011:
>> >>
>> "C:\Users\matthep\AppData\Local\Microsoft\MSBuild\v4.0\Microsoft.Cpp.Win32.user.props"
>> >> cannot be imported again. It was already imported at
>> >> "C:\Users\matthep\Documents\Code\apr\apr-util\ldap\apr_ldap.vcxproj
>> (78,5)".
>> >> This is most likely a build authoring error. This subsequent import
>> will be
>> >> ignored.
>> >> 1>C:\Users\matthep\Documents\Code\apr\apr-util\aprutil.vcxproj(81,5):
>> >> warning MSB4011:
>> >>
>> "C:\Users\matthep\AppData\Local\Microsoft\MSBuild\v4.0\Microsoft.Cpp.Win32.user.props"
>> >> cannot be imported again. It was already imported at
>> >> "C:\Users\matthep\Documents\Code\apr\apr-util\aprutil.vcxproj (75,5)".
>> This
>> >> is most likely a build authoring error. This subsequent import will be
>> >> ignored.
>> >> 3>C:\Users\matthep\Documents\Code\apr\apr-util\aprutil.vcxproj(81,5):
>> >> warning MSB4011:
>> >>
>> "C:\Users\matthep\AppData\Local\Microsoft\MSBuild\v4.0\Microsoft.Cpp.Win32.user.props"
>> >> cannot be imported again. It was already imported at
>> >> "C:\Users\matthep\Documents\Code\apr\apr-util\aprutil.vcxproj (75,5)".
>> This
>> >> is most likely a build authoring error. This subsequent import will be
>> >> ignored.
>> >> 13>C:\Users\matthep\Documents\Code\apr\apr-util\aprutil.vcxproj(81,5):
>> >> warning MSB4011:
>> >>
>> "C:\Users\matthep\AppData\Local\Microsoft\MSBuild\v4.0\Microsoft.Cpp.Win32.user.props"
>> >> cannot be imported again. It was already imported at
>> >> "C:\Users\matthep\Documents\Code\apr\apr-util\aprutil.vcxproj (75,5)".
>> This
>> >> is most likely a build authoring error. This subsequent import will be
>> >> ignored.
>> >> 13>C:\Users\matthep\Documents\Code\apr\apr-util\include\apu_want.h(46):
>> >> fatal error C1083: Cannot open include file: 'db.h': No such file or
>> >> directory
>> >> 14>C:\Users\matthep\Documents\Code\apr\apr-util\aprutil.vcxproj(81,5):
>> >> warning MSB4011:
>> >>
>> "C:\Users\matthep\AppData\Local\Microsoft\MSBuild\v4.0\Microsoft.Cpp.Win32.user.props"
>> >> cannot be imported again. It was already imported at
>> >> "C:\Users\matthep\Documents\Code\apr\apr-util\aprutil.vcxproj (75,5)".
>> This
>> >> is most likely a build authoring error. This subsequent import will be
>> >> ignored.
>> >> 16>C:\Users\matthep\Documents\Code\apr\apr-util\aprutil.vcxproj(81,5):
>> >> warning MSB4011:
>> >>
>> "C:\Users\matthep\AppData\Local\Microsoft\MSBuild\v4.0\Microsoft.Cpp.Win32.user.props"
>> >> cannot be imported again. It was already imported at
>> >> "C:\Users\matthep\Documents\Code\apr\apr-util\aprutil.vcxproj (75,5)".
>> This
>> >> is most likely a build authoring error. This subsequent import will be
>> >> ignored.
>> >> 16>C:\Program Files
>> >>
>> (x86)\MSBuild\Microsoft.Cpp\v4.0\V110\Microsoft.CppCommon.targets(177,5):
>> >> warning MSB8018: No outputs specified for item "include\apr_ldap.hw".
>> Its
>> >> custom build command will be skipped.
>> >> 16>C:\Program Files
>> >>
>> (x86)\MSBuild\Microsoft.Cpp\v4.0\V110\Microsoft.CppCommon.targets(177,5):
>> >> warning MSB8018: No outputs specified for item "include\apu.hw". Its
>> custom
>> >> build command will be skipped.
>> >> 16>C:\Program Files
>> >>
>> (x86)\MSBuild\Microsoft.Cpp\v4.0\V110\Microsoft.CppCommon.targets(177,5):
>> >> warning MSB8018: No outputs specified for item
>> >> "include\private\apu_config.hw". Its custom build command will be
>> skipped.
>> >> 16>C:\Program Files
>> >>
>> (x86)\MSBuild\Microsoft.Cpp\v4.0\V110\Microsoft.CppCommon.targets(177,5):
>> >> warning MSB8018: No outputs specified for item
>> >> "include\private\apu_select_dbm.hw". Its custom build command will be
>> >> skipped.
>> >> 16>C:\Program Files
>> >>
>> (x86)\MSBuild\Microsoft.Cpp\v4.0\V110\Microsoft.CppCommon.targets(177,5):
>> >> warning MSB8018: No outputs specified for item "include\apu_want.hw".
>> Its
>> >> custom build command will be skipped.
>> >> 14>apr_dbm_gdbm.c(28): fatal error C1083: Cannot open include file:
>> >> 'gdbm.h': No such file or directory
>> >> 17>------ Build started: Project: xml, Configuration: Release Win32
>> ------
>> >> 2>C:\Users\matthep\Documents\Code\apr\apr-util\aprutil.vcxproj(81,5):
>> >> warning MSB4011:
>> >>
>> "C:\Users\matthep\AppData\Local\Microsoft\MSBuild\v4.0\Microsoft.Cpp.Win32.user.props"
>> >> cannot be imported again. It was already imported at
>> >> "C:\Users\matthep\Documents\Code\apr\apr-util\aprutil.vcxproj (75,5)".
>> This
>> >> is most likely a build authoring error. This subsequent import will be
>> >> ignored.
>> >> 1>  dir.c
>> >> 15>C:\Users\matthep\Documents\Code\apr\apr-util\aprutil.vcxproj(81,5):
>> >> warning MSB4011:
>> >>
>> "C:\Users\matthep\AppData\Local\Microsoft\MSBuild\v4.0\Microsoft.Cpp.Win32.user.props"
>> >> cannot be imported again. It was already imported at
>> >> "C:\Users\matthep\Documents\Code\apr\apr-util\aprutil.vcxproj (75,5)".
>> This
>> >> is most likely a build authoring error. This subsequent import will be
>> >> ignored.
>> >>
>> 1>C:\Users\matthep\Documents\Code\apr\apr-util\xml\expat\lib\xml.vcxproj(85,5):
>> >> warning MSB4011:
>> >>
>> "C:\Users\matthep\AppData\Local\Microsoft\MSBuild\v4.0\Microsoft.Cpp.Win32.user.props"
>> >> cannot be imported again. It was already imported at
>> >> "C:\Users\matthep\Documents\Code\apr\apr-util\xml\expat\lib\xml.vcxproj
>> >> (79,5)". This is most likely a build authoring error. This subsequent
>> import
>> >> will be ignored.
>> >>
>> 2>C:\Users\matthep\Documents\Code\apr\apr-util\xml\expat\lib\xml.vcxproj(85,5):
>> >> warning MSB4011:
>> >>
>> "C:\Users\matthep\AppData\Local\Microsoft\MSBuild\v4.0\Microsoft.Cpp.Win32.user.props"
>> >> cannot be imported again. It was already imported at
>> >> "C:\Users\matthep\Documents\Code\apr\apr-util\xml\expat\lib\xml.vcxproj
>> >> (79,5)". This is most likely a build authoring error. This subsequent
>> import
>> >> will be ignored.
>> >>
>> 3>C:\Users\matthep\Documents\Code\apr\apr-util\xml\expat\lib\xml.vcxproj(85,5):
>> >> warning MSB4011:
>> >>
>> "C:\Users\matthep\AppData\Local\Microsoft\MSBuild\v4.0\Microsoft.Cpp.Win32.user.props"
>> >> cannot be imported again. It was already imported at
>> >> "C:\Users\matthep\Documents\Code\apr\apr-util\xml\expat\lib\xml.vcxproj
>> >> (79,5)". This is most likely a build authoring error. This subsequent
>> import
>> >> will be ignored.
>> >> 3>  apr_buckets_file.c
>> >>
>> 14>C:\Users\matthep\Documents\Code\apr\apr-util\xml\expat\lib\xml.vcxproj(85,5):
>> >> warning MSB4011:
>> >>
>> "C:\Users\matthep\AppData\Local\Microsoft\MSBuild\v4.0\Microsoft.Cpp.Win32.user.props"
>> >> cannot be imported again. It was already imported at
>> >> "C:\Users\matthep\Documents\Code\apr\apr-util\xml\expat\lib\xml.vcxproj
>> >> (79,5)". This is most likely a build authoring error. This subsequent
>> import
>> >> will be ignored.
>> >>
>> 15>C:\Users\matthep\Documents\Code\apr\apr-util\xml\expat\lib\xml.vcxproj(85,5):
>> >> warning MSB4011:
>> >>
>> "C:\Users\matthep\AppData\Local\Microsoft\MSBuild\v4.0\Microsoft.Cpp.Win32.user.props"
>> >> cannot be imported again. It was already imported at
>> >> "C:\Users\matthep\Documents\Code\apr\apr-util\xml\expat\lib\xml.vcxproj
>> >> (79,5)". This is most likely a build authoring error. This subsequent
>> import
>> >> will be ignored.
>> >>
>> 16>C:\Users\matthep\Documents\Code\apr\apr-util\xml\expat\lib\xml.vcxproj(85,5):
>> >> warning MSB4011:
>> >>
>> "C:\Users\matthep\AppData\Local\Microsoft\MSBuild\v4.0\Microsoft.Cpp.Win32.user.props"
>> >> cannot be imported again. It was already imported at
>> >> "C:\Users\matthep\Documents\Code\apr\apr-util\xml\expat\lib\xml.vcxproj
>> >> (79,5)". This is most likely a build authoring error. This subsequent
>> import
>> >> will be ignored.
>> >> 16>  apr_brigade.c
>> >>
>> 17>C:\Users\matthep\Documents\Code\apr\apr-util\xml\expat\lib\xml.vcxproj(85,5):
>> >> warning MSB4011:
>> >>
>> "C:\Users\matthep\AppData\Local\Microsoft\MSBuild\v4.0\Microsoft.Cpp.Win32.user.props"
>> >> cannot be imported again. It was already imported at
>> >> "C:\Users\matthep\Documents\Code\apr\apr-util\xml\expat\lib\xml.vcxproj
>> >> (79,5)". This is most likely a build authoring error. This subsequent
>> import
>> >> will be ignored.
>> >> 17>  xmlparse.c
>> >> 15>  apr_ldap_option.c
>> >> 2>  dir.c
>> >> 1>  fileacc.c
>> >> 3>  apr_buckets_flush.c
>> >> 16>  apr_buckets.c
>> >> 17>  xmlrole.c
>> >> 15>  apr_ldap_rebind.c
>> >> 2>  fileacc.c
>> >> 3>  apr_buckets_heap.c
>> >> 16>  apr_buckets_alloc.c
>> >> 1>  filedup.c
>> >> 17>  xmltok.c
>> >> 15>  Generating Code...
>> >> 2>  filedup.c
>> >> 3>  apr_buckets_mmap.c
>> >> 16>  apr_buckets_eos.c
>> >> 17>  Generating Code...
>> >> 15>     Creating library Release\apr_ldap-1.lib and object
>> >> Release\apr_ldap-1.exp
>> >> 1>  filepath.c
>> >> 2>  filepath.c
>> >> 3>  apr_buckets_pipe.c
>> >> 15>apr_ldap_init.obj : error LNK2019: unresolved external symbol
>> >> __imp__apr_palloc@8 referenced in function _apr__ldap_ssl_init
>> >> 16>  apr_buckets_file.c
>> >> 15>apr_ldap_option.obj : error LNK2001: unresolved external symbol
>> >> __imp__apr_palloc@8
>> >> 15>apr_ldap_rebind.obj : error LNK2001: unresolved external symbol
>> >> __imp__apr_palloc@8
>> >> 15>apr_ldap_option.obj : error LNK2019: unresolved external symbol
>> >> __imp__apr_pstrdup@8 referenced in function _apr__ldap_get_option
>> >> 15>apr_ldap_rebind.obj : error LNK2001: unresolved external symbol
>> >> __imp__apr_pstrdup@8
>> >> 15>apr_ldap_rebind.obj : error LNK2019: unresolved external symbol
>> >> __imp__apr_thread_mutex_create@12 referenced in function
>> >> _apr__ldap_rebind_init
>> >> 15>apr_ldap_rebind.obj : error LNK2019: unresolved external symbol
>> >> __imp__apr_thread_mutex_lock@4 referenced in function
>> _apr__ldap_rebind_add
>> >> 15>apr_ldap_rebind.obj : error LNK2019: unresolved external symbol
>> >> __imp__apr_thread_mutex_unlock@4 referenced in function
>> >> _apr__ldap_rebind_add
>> >> 15>apr_ldap_rebind.obj : error LNK2019: unresolved external symbol
>> >> __imp__apr_pool_cleanup_register@16 referenced in function
>> >> _apr__ldap_rebind_init
>> >> 15>apr_ldap_rebind.obj : error LNK2019: unresolved external symbol
>> >> __imp__apr_pool_cleanup_kill@12 referenced in function
>> >> _apr__ldap_rebind_remove
>> >> 15>apr_ldap_rebind.obj : error LNK2019: unresolved external symbol
>> >> __imp__apr_pool_cleanup_null referenced in function
>> _apr__ldap_rebind_init
>> >> 15>Release\apr_ldap-1.dll : fatal error LNK1120: 8 unresolved externals
>> >> 1>  filepath_util.c
>> >> 3>  apr_buckets_pool.c
>> >> 16>  apr_buckets_flush.c
>> >> 2>  filepath_util.c
>> >> 1>  filestat.c
>> >> 17>  xml.vcxproj ->
>> >> C:\Users\matthep\Documents\Code\apr\apr-util\xml\expat\lib\LibR\xml.lib
>> >> 3>  apr_buckets_refcount.c
>> >> 16>  apr_buckets_heap.c
>> >> 2>  filestat.c
>> >> 1>  filesys.c
>> >> 3>  apr_buckets_simple.c
>> >> 16>  apr_buckets_mmap.c
>> >> 2>  filesys.c
>> >> 1>  flock.c
>> >> 3>  apr_buckets_socket.c
>> >> 16>  apr_buckets_pipe.c
>> >> 2>  flock.c
>> >> 1>  fullrw.c
>> >> 3>  apr_crypto.c
>> >> 16>  apr_buckets_pool.c
>> >> 2>  fullrw.c
>> >> 1>  mktemp.c
>> >> 3>  apr_md4.c
>> >> 16>  apr_buckets_refcount.c
>> >> 2>  mktemp.c
>> >> 3>  apr_md5.c
>> >> 1>  open.c
>> >> 16>  apr_buckets_simple.c
>> >> 3>  apr_sha1.c
>> >> 2>  open.c
>> >> 16>  apr_buckets_socket.c
>> >> 1>  pipe.c
>> >> 3>  getuuid.c
>> >> 16>  apr_crypto.c
>> >> 2>  pipe.c
>> >> 1>  readwrite.c
>> >> 3>  uuid.c
>> >> 16>  apr_md4.c
>> >> 2>  readwrite.c
>> >> 1>  seek.c
>> >> 3>  apr_dbd.c
>> >> 16>  apr_md5.c
>> >> 2>  seek.c
>> >> 3>  Generating Code...
>> >> 1>  tempdir.c
>> >> 16>  apr_sha1.c
>> >> 2>  tempdir.c
>> >> 1>  proc_mutex.c
>> >> 16>  getuuid.c
>> >> 3>  Compiling...
>> >> 3>  apr_dbm.c
>> >> 2>  proc_mutex.c
>> >> 1>  Generating Code...
>> >> 16>  uuid.c
>> >> 3>  apr_dbm_sdbm.c
>> >> 2>  Generating Code...
>> >> 16>  apr_dbd.c
>> >> 3>  apr_base64.c
>> >> 1>  Compiling...
>> >> 1>  thread_cond.c
>> >> 16>  Generating Code...
>> >> 3>  apr_hooks.c
>> >> 2>  Compiling...
>> >> 2>  thread_cond.c
>> >> 1>  thread_mutex.c
>> >> 3>  apr_ldap_stub.c
>> >> 2>  thread_mutex.c
>> >> 16>  Compiling...
>> >> 16>  apr_dbd_freetds.c
>> >> 16>  apr_dbd_mysql.c
>> >> 16>  apr_dbd_odbc.c
>> >> 1>  thread_rwlock.c
>> >> 3>  apr_ldap_url.c
>> >> 2>  thread_rwlock.c
>> >> 1>  apr_pools.c
>> >> 16>  apr_dbd_oracle.c
>> >> 16>  apr_dbd_pgsql.c
>> >> 16>  apr_dbd_sqlite2.c
>> >> 16>  apr_dbd_sqlite3.c
>> >> 16>  apr_dbm.c
>> >> 3>  apr_memcache.c
>> >> 2>  apr_pools.c
>> >> 1>  charset.c
>> >> 16>  apr_dbm_berkeleydb.c
>> >> 3>  apr_date.c
>> >> 2>  charset.c
>> >> 1>  env.c
>> >> 16>  apr_dbm_gdbm.c
>> >> 3>  apu_dso.c
>> >> 2>  env.c
>> >> 1>  errorcodes.c
>> >> 16>  apr_dbm_sdbm.c
>> >> 3>  apr_queue.c
>> >> 2>  errorcodes.c
>> >> 1>  getopt.c
>> >> 16>  apr_base64.c
>> >> 3>  apr_reslist.c
>> >> 16>  apr_hooks.c
>> >> 2>  getopt.c
>> >> 1>  internal.c
>> >> 3>  apr_rmm.c
>> >> 16>  apr_ldap_init.c
>> >> 2>  internal.c
>> >> 1>  misc.c
>> >> 3>  apr_thread_pool.c
>> >> 16>  apr_ldap_option.c
>> >> 2>  misc.c
>> >> 1>  otherchild.c
>> >> 3>  apu_version.c
>> >> 16>  apr_ldap_rebind.c
>> >> 2>  otherchild.c
>> >> 1>  rand.c
>> >> 3>  sdbm.c
>> >> 16>  apr_ldap_stub.c
>> >> 2>  rand.c
>> >> 3>  sdbm_hash.c
>> >> 1>  start.c
>> >> 16>  apr_ldap_url.c
>> >> 3>  sdbm_lock.c
>> >> 2>  start.c
>> >> 1>  utf8.c
>> >> 16>  apr_memcache.c
>> >> 3>  sdbm_pair.c
>> >> 1>  version.c
>> >> 2>  utf8.c
>> >> 16>  apr_date.c
>> >> 2>  version.c
>> >> 3>  apr_strmatch.c
>> >> 1>  common.c
>> >> 16>  Generating Code...
>> >> 2>  common.c
>> >> 3>  apr_uri.c
>> >> 1>  mmap.c
>> >> 16>  Compiling...
>> >> 16>  apu_dso.c
>> >> 3>  Generating Code...
>> >> 2>  mmap.c
>> >> 1>  inet_ntop.c
>> >> 16>  apr_queue.c
>> >> 2>  inet_ntop.c
>> >> 1>  inet_pton.c
>> >> 3>  Compiling...
>> >> 3>  xlate.c
>> >> 16>  apr_reslist.c
>> >> 2>  inet_pton.c
>> >> 1>  multicast.c
>> >> 16>  apr_rmm.c
>> >> 3>  apr_xml.c
>> >> 2>  multicast.c
>> >> 1>  Generating Code...
>> >> 16>  apr_thread_pool.c
>> >> 3>  Generating Code...
>> >> 2>  Generating Code...
>> >> 1>  Compiling...
>> >> 1>  sendrecv.c
>> >> 16>  apu_version.c
>> >> 2>  Compiling...
>> >> 2>  sendrecv.c
>> >> 16>  sdbm.c
>> >> 1>  sockaddr.c
>> >> 16>  sdbm_hash.c
>> >> 3>     Creating library Release\libaprutil-1.lib and object
>> >> Release\libaprutil-1.exp
>> >> 2>  sockaddr.c
>> >> 1>  sockets.c
>> >> 3>apr_brigade.obj : error LNK2019: unresolved external symbol
>> >> __imp__apr_vformatter@16 referenced in function
>> _apr_brigade_vprintf@20
>> >> 3>apr_xml.obj : error LNK2001: unresolved external symbol
>> >> __imp__apr_palloc@8
>> >> 3>apr_rmm.obj : error LNK2001: unresolved external symbol
>> >> __imp__apr_palloc@8
>> >> 3>apr_thread_pool.obj : error LNK2001: unresolved external symbol
>> >> __imp__apr_palloc@8
>> >> 3>apr_strmatch.obj : error LNK2001: unresolved external symbol
>> >> __imp__apr_palloc@8
>> >> 3>xlate.obj : error LNK2001: unresolved external symbol
>> __imp__apr_palloc@8
>> >> 3>apr_ldap_url.obj : error LNK2001: unresolved external symbol
>> >> __imp__apr_palloc@8
>> >> 3>apr_memcache.obj : error LNK2001: unresolved external symbol
>> >> __imp__apr_palloc@8
>> >> 3>apr_queue.obj : error LNK2001: unresolved external symbol
>> >> __imp__apr_palloc@8
>> >> 3>apr_reslist.obj : error LNK2001: unresolved external symbol
>> >> __imp__apr_palloc@8
>> >> 3>apr_brigade.obj : error LNK2019: unresolved external symbol
>> >> __imp__apr_palloc@8 referenced in function _apr_brigade_create@8
>> >> 3>apr_dbd.obj : error LNK2001: unresolved external symbol
>> >> __imp__apr_palloc@8
>> >> 3>apr_dbm_sdbm.obj : error LNK2001: unresolved external symbol
>> >> __imp__apr_palloc@8
>> >> 3>apr_hooks.obj : error LNK2001: unresolved external symbol
>> >> __imp__apr_palloc@8
>> >> 3>apr_xml.obj : error LNK2001: unresolved external symbol
>> >> __imp__apr_pool_cleanup_register@16
>> >> 3>apr_reslist.obj : error LNK2001: unresolved external symbol
>> >> __imp__apr_pool_cleanup_register@16
>> >> 3>apr_thread_pool.obj : error LNK2001: unresolved external symbol
>> >> __imp__apr_pool_cleanup_register@16
>> >> 3>sdbm.obj : error LNK2001: unresolved external symbol
>> >> __imp__apr_pool_cleanup_register@16
>> >> 3>xlate.obj : error LNK2001: unresolved external symbol
>> >> __imp__apr_pool_cleanup_register@16
>> >> 3>apr_dbd.obj : error LNK2001: unresolved external symbol
>> >> __imp__apr_pool_cleanup_register@16
>> >> 3>apr_dbm.obj : error LNK2001: unresolved external symbol
>> >> __imp__apr_pool_cleanup_register@16
>> >> 3>apu_dso.obj : error LNK2001: unresolved external symbol
>> >> __imp__apr_pool_cleanup_register@16
>> >> 3>apr_queue.obj : error LNK2001: unresolved external symbol
>> >> __imp__apr_pool_cleanup_register@16
>> >> 3>apr_brigade.obj : error LNK2019: unresolved external symbol
>> >> __imp__apr_pool_cleanup_register@16 referenced in function
>> >> _apr_brigade_create@8
>> >> 3>apr_buckets_alloc.obj : error LNK2001: unresolved external symbol
>> >> __imp__apr_pool_cleanup_register@16
>> >> 3>apr_buckets_mmap.obj : error LNK2001: unresolved external symbol
>> >> __imp__apr_pool_cleanup_register@16
>> >> 3>apr_buckets_pool.obj : error LNK2001: unresolved external symbol
>> >> __imp__apr_pool_cleanup_register@16
>> >> 3>apr_dbd.obj : error LNK2001: unresolved external symbol
>> >> __imp__apr_pool_cleanup_kill@12
>> >> 3>apr_reslist.obj : error LNK2001: unresolved external symbol
>> >> __imp__apr_pool_cleanup_kill@12
>> >> 3>apr_brigade.obj : error LNK2019: unresolved external symbol
>> >> __imp__apr_pool_cleanup_kill@12 referenced in function
>> >> _apr_brigade_destroy@4
>> >> 3>apr_buckets_alloc.obj : error LNK2001: unresolved external symbol
>> >> __imp__apr_pool_cleanup_kill@12
>> >> 3>apr_buckets_mmap.obj : error LNK2001: unresolved external symbol
>> >> __imp__apr_pool_cleanup_kill@12
>> >> 3>apr_buckets_pool.obj : error LNK2001: unresolved external symbol
>> >> __imp__apr_pool_cleanup_kill@12
>> >> 3>apr_xml.obj : error LNK2019: unresolved external symbol
>> >> __imp__apr_pool_cleanup_null referenced in function _start_handler
>> >> 3>apr_reslist.obj : error LNK2001: unresolved external symbol
>> >> __imp__apr_pool_cleanup_null
>> >> 3>apr_thread_pool.obj : error LNK2001: unresolved external symbol
>> >> __imp__apr_pool_cleanup_null
>> >> 3>sdbm.obj : error LNK2001: unresolved external symbol
>> >> __imp__apr_pool_cleanup_null
>> >> 3>xlate.obj : error LNK2001: unresolved external symbol
>> >> __imp__apr_pool_cleanup_null
>> >> 3>apr_dbd.obj : error LNK2001: unresolved external symbol
>> >> __imp__apr_pool_cleanup_null
>> >> 3>apr_dbm.obj : error LNK2001: unresolved external symbol
>> >> __imp__apr_pool_cleanup_null
>> >> 3>apu_dso.obj : error LNK2001: unresolved external symbol
>> >> __imp__apr_pool_cleanup_null
>> >> 3>apr_queue.obj : error LNK2001: unresolved external symbol
>> >> __imp__apr_pool_cleanup_null
>> >> 3>apr_brigade.obj : error LNK2001: unresolved external symbol
>> >> __imp__apr_pool_cleanup_null
>> >> 3>apr_buckets_alloc.obj : error LNK2001: unresolved external symbol
>> >> __imp__apr_pool_cleanup_null
>> >> 3>apr_buckets_mmap.obj : error LNK2001: unresolved external symbol
>> >> __imp__apr_pool_cleanup_null
>> >> 3>apr_buckets_pool.obj : error LNK2001: unresolved external symbol
>> >> __imp__apr_pool_cleanup_null
>> >> 3>apr_buckets_alloc.obj : error LNK2019: unresolved external symbol
>> >> __imp__apr_allocator_alloc@8 referenced in function _apr_bucket_alloc
>> >> 3>apr_buckets_alloc.obj : error LNK2019: unresolved external symbol
>> >> __imp__apr_allocator_free@8 referenced in function _alloc_cleanup
>> >> 3>apr_buckets_alloc.obj : error LNK2019: unresolved external symbol
>> >> __imp__apr_pool_allocator_get@4 referenced in function
>> >> _apr_bucket_alloc_create
>> >> 3>apr_buckets_file.obj : error LNK2019: unresolved external symbol
>> >> __imp__apr_pool_is_ancestor@8 referenced in function
>> _file_bucket_setaside
>> >> 3>apr_buckets_mmap.obj : error LNK2001: unresolved external symbol
>> >> __imp__apr_pool_is_ancestor@8
>> >> 3>apr_buckets_file.obj : error LNK2019: unresolved external symbol
>> >> __imp__apr_file_read@12 referenced in function _file_bucket_read
>> >> 3>apr_buckets_pipe.obj : error LNK2001: unresolved external symbol
>> >> __imp__apr_file_read@12
>> >> 3>apr_xml.obj : error LNK2001: unresolved external symbol
>> >> __imp__apr_file_read@12
>> >> 3>apr_buckets_file.obj : error LNK2019: unresolved external symbol
>> >> __imp__apr_file_setaside@12 referenced in function
>> _file_bucket_setaside
>> >> 3>apr_buckets_file.obj : error LNK2019: unresolved external symbol
>> >> __imp__apr_file_seek@12 referenced in function _file_bucket_read
>> >> 3>sdbm.obj : error LNK2001: unresolved external symbol
>> >> __imp__apr_file_seek@12
>> >> 3>apr_buckets_file.obj : error LNK2019: unresolved external symbol
>> >> __imp__apr_file_pool_get@4 referenced in function
>> _file_bucket_setaside
>> >> 3>apr_buckets_file.obj : error LNK2019: unresolved external symbol
>> >> __imp__apr_mmap_create@28 referenced in function _file_make_mmap
>> >> 3>apr_buckets_mmap.obj : error LNK2019: unresolved external symbol
>> >> __imp__apr_mmap_dup@12 referenced in function _mmap_bucket_setaside
>> >> 3>apr_buckets_mmap.obj : error LNK2019: unresolved external symbol
>> >> __imp__apr_mmap_delete@4 referenced in function _mmap_bucket_destroy
>> >> 3>apr_buckets_mmap.obj : error LNK2019: unresolved external symbol
>> >> __imp__apr_mmap_offset@16 referenced in function _mmap_bucket_read
>> >> 3>apr_buckets_pipe.obj : error LNK2019: unresolved external symbol
>> >> __imp__apr_file_close@4 referenced in function _pipe_bucket_read
>> >> 3>sdbm.obj : error LNK2001: unresolved external symbol
>> >> __imp__apr_file_close@4
>> >> 3>apr_buckets_pipe.obj : error LNK2019: unresolved external symbol
>> >> __imp__apr_file_pipe_timeout_get@8 referenced in function
>> _pipe_bucket_read
>> >> 3>apr_buckets_pipe.obj : error LNK2019: unresolved external symbol
>> >> __imp__apr_file_pipe_timeout_set@12 referenced in function
>> _pipe_bucket_read
>> >> 3>apr_buckets_socket.obj : error LNK2019: unresolved external symbol
>> >> __imp__apr_socket_recv@12 referenced in function _socket_bucket_read
>> >> 3>apr_buckets_socket.obj : error LNK2019: unresolved external symbol
>> >> __imp__apr_socket_timeout_set@12 referenced in function
>> _socket_bucket_read
>> >> 3>apr_memcache.obj : error LNK2001: unresolved external symbol
>> >> __imp__apr_socket_timeout_set@12
>> >> 3>apr_buckets_socket.obj : error LNK2019: unresolved external symbol
>> >> __imp__apr_socket_timeout_get@8 referenced in function
>> _socket_bucket_read
>> >> 3>apr_xml.obj : error LNK2001: unresolved external symbol
>> >> __imp__apr_cpystrn@12
>> >> 3>apr_md5.obj : error LNK2019: unresolved external symbol
>> >> __imp__apr_cpystrn@12 referenced in function _apr_md5_encode@16
>> >> 3>apr_sha1.obj : error LNK2001: unresolved external symbol
>> >> __imp__apr_cpystrn@12
>> >> 3>apr_dbm.obj : error LNK2001: unresolved external symbol
>> >> __imp__apr_cpystrn@12
>> >> 3>apu_dso.obj : error LNK2001: unresolved external symbol
>> >> __imp__apr_cpystrn@12
>> >> 3>getuuid.obj : error LNK2019: unresolved external symbol
>> >> __imp__apr_generate_random_bytes@8 referenced in function
>> >> _get_pseudo_node_identifier
>> >> 3>getuuid.obj : error LNK2019: unresolved external symbol
>> >> __imp__apr_time_now@0 referenced in function _get_current_time
>> >> 3>apr_memcache.obj : error LNK2001: unresolved external symbol
>> >> __imp__apr_time_now@0
>> >> 3>apr_reslist.obj : error LNK2001: unresolved external symbol
>> >> __imp__apr_time_now@0
>> >> 3>apr_thread_pool.obj : error LNK2001: unresolved external symbol
>> >> __imp__apr_time_now@0
>> >> 3>getuuid.obj : error LNK2019: unresolved external symbol
>> >> __imp__apr_os_uuid_get@4 referenced in function _apr_uuid_get@4
>> >> 3>apr_reslist.obj : error LNK2001: unresolved external symbol
>> >> __imp__apr_thread_mutex_create@12
>> >> 3>apr_thread_pool.obj : error LNK2001: unresolved external symbol
>> >> __imp__apr_thread_mutex_create@12
>> >> 3>apr_dbd.obj : error LNK2019: unresolved external symbol
>> >> __imp__apr_thread_mutex_create@12 referenced in function
>> _apr_dbd_init@4
>> >> 3>apr_memcache.obj : error LNK2001: unresolved external symbol
>> >> __imp__apr_thread_mutex_create@12
>> >> 3>apu_dso.obj : error LNK2001: unresolved external symbol
>> >> __imp__apr_thread_mutex_create@12
>> >> 3>apr_queue.obj : error LNK2001: unresolved external symbol
>> >> __imp__apr_thread_mutex_create@12
>> >> 3>apr_reslist.obj : error LNK2001: unresolved external symbol
>> >> __imp__apr_thread_mutex_lock@4
>> >> 3>apr_rmm.obj : error LNK2001: unresolved external symbol
>> >> __imp__apr_thread_mutex_lock@4
>> >> 3>apr_thread_pool.obj : error LNK2001: unresolved external symbol
>> >> __imp__apr_thread_mutex_lock@4
>> >> 3>apr_dbd.obj : error LNK2019: unresolved external symbol
>> >> __imp__apr_thread_mutex_lock@4 referenced in function
>> _apr_dbd_mutex_lock@0
>> >> 3>apr_memcache.obj : error LNK2001: unresolved external symbol
>> >> __imp__apr_thread_mutex_lock@4
>> >> 3>apu_dso.obj : error LNK2001: unresolved external symbol
>> >> __imp__apr_thread_mutex_lock@4
>> >> 3>apr_queue.obj : error LNK2001: unresolved external symbol
>> >> __imp__apr_thread_mutex_lock@4
>> >> 3>apr_reslist.obj : error LNK2001: unresolved external symbol
>> >> __imp__apr_thread_mutex_unlock@4
>> >> 3>apr_rmm.obj : error LNK2001: unresolved external symbol
>> >> __imp__apr_thread_mutex_unlock@4
>> >> 3>apr_thread_pool.obj : error LNK2001: unresolved external symbol
>> >> __imp__apr_thread_mutex_unlock@4
>> >> 3>apr_dbd.obj : error LNK2019: unresolved external symbol
>> >> __imp__apr_thread_mutex_unlock@4 referenced in function
>> >> _apr_dbd_mutex_unlock@0
>> >> 3>apr_memcache.obj : error LNK2001: unresolved external symbol
>> >> __imp__apr_thread_mutex_unlock@4
>> >> 3>apu_dso.obj : error LNK2001: unresolved external symbol
>> >> __imp__apr_thread_mutex_unlock@4
>> >> 3>apr_queue.obj : error LNK2001: unresolved external symbol
>> >> __imp__apr_thread_mutex_unlock@4
>> >> 3>apr_dbd.obj : error LNK2019: unresolved external symbol
>> >> __imp__apr_pool_parent_get@4 referenced in function _apr_dbd_init@4
>> >> 3>apr_dbm.obj : error LNK2001: unresolved external symbol
>> >> __imp__apr_pool_parent_get@4
>> >> 3>apu_dso.obj : error LNK2001: unresolved external symbol
>> >> __imp__apr_pool_parent_get@4
>> >> 3>apu_dso.obj : error LNK2001: unresolved external symbol
>> >> __imp__apr_pstrdup@8
>> >> 3>apr_uri.obj : error LNK2001: unresolved external symbol
>> >> __imp__apr_pstrdup@8
>> >> 3>xlate.obj : error LNK2001: unresolved external symbol
>> __imp__apr_pstrdup@8
>> >> 3>apr_xml.obj : error LNK2001: unresolved external symbol
>> >> __imp__apr_pstrdup@8
>> >> 3>apr_dbd.obj : error LNK2019: unresolved external symbol
>> >> __imp__apr_pstrdup@8 referenced in function _apr_dbd_get_driver@12
>> >> 3>apr_dbm.obj : error LNK2001: unresolved external symbol
>> >> __imp__apr_pstrdup@8
>> >> 3>apr_ldap_url.obj : error LNK2001: unresolved external symbol
>> >> __imp__apr_pstrdup@8
>> >> 3>apr_memcache.obj : error LNK2001: unresolved external symbol
>> >> __imp__apr_pstrdup@8
>> >> 3>apr_dbd.obj : error LNK2019: unresolved external symbol
>> >> __imp__apr_snprintf referenced in function _apr_dbd_get_driver@12
>> >> 3>apr_dbm.obj : error LNK2001: unresolved external symbol
>> >> __imp__apr_snprintf
>> >> 3>apr_memcache.obj : error LNK2001: unresolved external symbol
>> >> __imp__apr_snprintf
>> >> 3>apr_xml.obj : error LNK2001: unresolved external symbol
>> >> __imp__apr_snprintf
>> >> 3>apu_dso.obj : error LNK2001: unresolved external symbol
>> >> __imp__apr_hash_make@4
>> >> 3>apr_dbd.obj : error LNK2019: unresolved external symbol
>> >> __imp__apr_hash_make@4 referenced in function _apr_dbd_init@4
>> >> 3>apr_dbm.obj : error LNK2001: unresolved external symbol
>> >> __imp__apr_hash_make@4
>> >> 3>apr_hooks.obj : error LNK2001: unresolved external symbol
>> >> __imp__apr_hash_make@4
>> >> 3>apr_memcache.obj : error LNK2001: unresolved external symbol
>> >> __imp__apr_hash_make@4
>> >> 3>apu_dso.obj : error LNK2001: unresolved external symbol
>> >> __imp__apr_hash_set@16
>> >> 3>apr_dbd.obj : error LNK2019: unresolved external symbol
>> >> __imp__apr_hash_set@16 referenced in function _apr_dbd_get_driver@12
>> >> 3>apr_dbm.obj : error LNK2001: unresolved external symbol
>> >> __imp__apr_hash_set@16
>> >> 3>apr_hooks.obj : error LNK2001: unresolved external symbol
>> >> __imp__apr_hash_set@16
>> >> 3>apr_memcache.obj : error LNK2001: unresolved external symbol
>> >> __imp__apr_hash_set@16
>> >> 3>apu_dso.obj : error LNK2001: unresolved external symbol
>> >> __imp__apr_hash_get@12
>> >> 3>apr_dbd.obj : error LNK2019: unresolved external symbol
>> >> __imp__apr_hash_get@12 referenced in function _apr_dbd_get_driver@12
>> >> 3>apr_dbm.obj : error LNK2001: unresolved external symbol
>> >> __imp__apr_hash_get@12
>> >> 3>apr_hooks.obj : error LNK2001: unresolved external symbol
>> >> __imp__apr_hash_get@12
>> >> 3>apr_memcache.obj : error LNK2001: unresolved external symbol
>> >> __imp__apr_hash_get@12
>> >> 3>apr_dbd.obj : error LNK2019: unresolved external symbol
>> >> __imp__apr_hash_pool_get@4 referenced in function
>> _apr_dbd_get_driver@12
>> >> 3>apr_dbm.obj : error LNK2001: unresolved external symbol
>> >> __imp__apr_hash_pool_get@4
>> >> 3>apu_dso.obj : error LNK2001: unresolved external symbol
>> >> __imp__apr_hash_pool_get@4
>> >> 3>apr_dbd.obj : error LNK2019: unresolved external symbol
>> >> __imp__apr_atomic_read32@4 referenced in function _apr_dbd_init@4
>> >> 3>apr_dbm.obj : error LNK2001: unresolved external symbol
>> >> __imp__apr_atomic_read32@4
>> >> 3>apu_dso.obj : error LNK2001: unresolved external symbol
>> >> __imp__apr_atomic_read32@4
>> >> 3>apr_dbd.obj : error LNK2019: unresolved external symbol
>> >> __imp__apr_atomic_set32@8 referenced in function _apr_dbd_init@4
>> >> 3>apr_dbm.obj : error LNK2001: unresolved external symbol
>> >> __imp__apr_atomic_set32@8
>> >> 3>apu_dso.obj : error LNK2001: unresolved external symbol
>> >> __imp__apr_atomic_set32@8
>> >> 3>apr_dbd.obj : error LNK2019: unresolved external symbol
>> >> __imp__apr_atomic_inc32@4 referenced in function _apr_dbd_init@4
>> >> 3>apr_dbm.obj : error LNK2001: unresolved external symbol
>> >> __imp__apr_atomic_inc32@4
>> >> 3>apu_dso.obj : error LNK2001: unresolved external symbol
>> >> __imp__apr_atomic_inc32@4
>> >> 3>apr_dbd.obj : error LNK2019: unresolved external symbol
>> >> __imp__apr_atomic_dec32@4 referenced in function _apr_dbd_init@4
>> >> 3>apr_dbm.obj : error LNK2001: unresolved external symbol
>> >> __imp__apr_atomic_dec32@4
>> >> 3>apu_dso.obj : error LNK2001: unresolved external symbol
>> >> __imp__apr_atomic_dec32@4
>> >> 3>apr_dbm_sdbm.obj : error LNK2019: unresolved external symbol
>> >> __imp__apr_pstrcat referenced in function _vt_sdbm_usednames
>> >> 3>sdbm.obj : error LNK2001: unresolved external symbol
>> __imp__apr_pstrcat
>> >> 3>apr_uri.obj : error LNK2001: unresolved external symbol
>> __imp__apr_pstrcat
>> >> 3>apr_dbm_sdbm.obj : error LNK2019: unresolved external symbol
>> >> __imp__apr_psprintf referenced in function _vt_sdbm_fetch
>> >> 3>apr_xml.obj : error LNK2001: unresolved external symbol
>> >> __imp__apr_psprintf
>> >> 3>apr_hooks.obj : error LNK2019: unresolved external symbol
>> >> __imp__apr_pool_create_ex@16 referenced in function
>> _apr_hook_sort_all@0
>> >> 3>apr_memcache.obj : error LNK2001: unresolved external symbol
>> >> __imp__apr_pool_create_ex@16
>> >> 3>apr_thread_pool.obj : error LNK2001: unresolved external symbol
>> >> __imp__apr_pool_create_ex@16
>> >> 3>apr_hooks.obj : error LNK2019: unresolved external symbol
>> >> __imp__apr_array_make@12 referenced in function _apr_hook_sort_all@0
>> >> 3>apu_dso.obj : error LNK2001: unresolved external symbol
>> >> __imp__apr_array_make@12
>> >> 3>apr_xml.obj : error LNK2001: unresolved external symbol
>> >> __imp__apr_array_make@12
>> >> 3>apr_hooks.obj : error LNK2019: unresolved external symbol
>> >> __imp__apr_array_push@4 referenced in function _apr_hook_sort_all@0
>> >> 3>apr_xml.obj : error LNK2001: unresolved external symbol
>> >> __imp__apr_array_push@4
>> >> 3>apr_ldap_url.obj : error LNK2019: unresolved external symbol
>> >> __imp__apr_strtok@12 referenced in function _apr_ldap_str2charray
>> >> 3>apr_memcache.obj : error LNK2001: unresolved external symbol
>> >> __imp__apr_strtok@12
>> >> 3>apr_memcache.obj : error LNK2019: unresolved external symbol
>> >> __imp__apr_pool_clear@4 referenced in function _apr_memcache_delete@12
>> >> 3>apr_memcache.obj : error LNK2019: unresolved external symbol
>> >> __imp__apr_pool_destroy@4 referenced in function _mc_conn_construct
>> >> 3>apr_memcache.obj : error LNK2019: unresolved external symbol
>> >> __imp__apr_pstrmemdup@12 referenced in function
>> _apr_memcache_version@12
>> >> 3>apr_uri.obj : error LNK2001: unresolved external symbol
>> >> __imp__apr_pstrmemdup@12
>> >> 3>apr_memcache.obj : error LNK2019: unresolved external symbol
>> >> __imp__apr_atoi64@4 referenced in function _stat_read_uint64
>> >> 3>apr_memcache.obj : error LNK2019: unresolved external symbol
>> >> __imp__apr_socket_create@20 referenced in function _mc_conn_construct
>> >> 3>apr_memcache.obj : error LNK2019: unresolved external symbol
>> >> __imp__apr_socket_close@4 referenced in function _mc_conn_destruct
>> >> 3>apr_memcache.obj : error LNK2019: unresolved external symbol
>> >> __imp__apr_socket_connect@8 referenced in function _conn_connect
>> >> 3>apr_memcache.obj : error LNK2019: unresolved external symbol
>> >> __imp__apr_sockaddr_info_get@24 referenced in function _conn_connect
>> >> 3>apr_memcache.obj : error LNK2019: unresolved external symbol
>> >> __imp__apr_socket_sendv@16 referenced in function
>> _apr_memcache_delete@12
>> >> 3>apr_memcache.obj : error LNK2019: unresolved external symbol
>> >> __imp__apr_hash_first@8 referenced in function
>> _apr_memcache_multgetp@16
>> >> 3>apr_memcache.obj : error LNK2019: unresolved external symbol
>> >> __imp__apr_hash_next@4 referenced in function
>> _apr_memcache_multgetp@16
>> >> 3>apr_memcache.obj : error LNK2019: unresolved external symbol
>> >> __imp__apr_hash_this@16 referenced in function
>> _apr_memcache_multgetp@16
>> >> 3>apr_memcache.obj : error LNK2019: unresolved external symbol
>> >> __imp__apr_hash_count@4 referenced in function
>> _apr_memcache_multgetp@16
>> >> 3>apr_memcache.obj : error LNK2019: unresolved external symbol
>> >> __imp__apr_pollset_create@16 referenced in function
>> >> _apr_memcache_multgetp@16
>> >> 3>apr_memcache.obj : error LNK2019: unresolved external symbol
>> >> __imp__apr_pollset_destroy@4 referenced in function
>> >> _apr_memcache_multgetp@16
>> >> 3>apr_memcache.obj : error LNK2019: unresolved external symbol
>> >> __imp__apr_pollset_add@8 referenced in function
>> _apr_memcache_multgetp@16
>> >> 3>apr_memcache.obj : error LNK2019: unresolved external symbol
>> >> __imp__apr_pollset_remove@8 referenced in function
>> _apr_memcache_multgetp@16
>> >> 3>apr_memcache.obj : error LNK2019: unresolved external symbol
>> >> __imp__apr_pollset_poll@20 referenced in function
>> _apr_memcache_multgetp@16
>> >> 3>apr_date.obj : error LNK2019: unresolved external symbol
>> >> __imp__apr_time_exp_get@8 referenced in function
>> _apr_date_parse_http@4
>> >> 3>apr_date.obj : error LNK2019: unresolved external symbol
>> >> __imp__apr_time_exp_gmt_get@8 referenced in function
>> _apr_date_parse_rfc@4
>> >> 3>apu_dso.obj : error LNK2019: unresolved external symbol
>> >> __imp__apr_dso_load@12 referenced in function _apu_dso_load
>> >> 3>apu_dso.obj : error LNK2019: unresolved external symbol
>> >> __imp__apr_dso_unload@4 referenced in function _apu_dso_load
>> >> 3>apu_dso.obj : error LNK2019: unresolved external symbol
>> >> __imp__apr_dso_sym@12 referenced in function _apu_dso_load
>> >> 3>apu_dso.obj : error LNK2019: unresolved external symbol
>> >> __imp__apr_filepath_list_split@12 referenced in function _apu_dso_load
>> >> 3>apu_dso.obj : error LNK2019: unresolved external symbol
>> >> __imp__apr_env_get@12 referenced in function _apu_dso_load
>> >> 3>apr_queue.obj : error LNK2019: unresolved external symbol
>> >> __imp__apr_thread_mutex_destroy@4 referenced in function
>> _queue_destroy
>> >> 3>apr_reslist.obj : error LNK2001: unresolved external symbol
>> >> __imp__apr_thread_mutex_destroy@4
>> >> 3>apr_thread_pool.obj : error LNK2001: unresolved external symbol
>> >> __imp__apr_thread_mutex_destroy@4
>> >> 3>apr_queue.obj : error LNK2019: unresolved external symbol
>> >> __imp__apr_thread_cond_create@8 referenced in function
>> _apr_queue_create@12
>> >> 3>apr_reslist.obj : error LNK2001: unresolved external symbol
>> >> __imp__apr_thread_cond_create@8
>> >> 3>apr_thread_pool.obj : error LNK2001: unresolved external symbol
>> >> __imp__apr_thread_cond_create@8
>> >> 3>apr_queue.obj : error LNK2019: unresolved external symbol
>> >> __imp__apr_thread_cond_wait@8 referenced in function _apr_queue_pop@8
>> >> 3>apr_reslist.obj : error LNK2001: unresolved external symbol
>> >> __imp__apr_thread_cond_wait@8
>> >> 3>apr_thread_pool.obj : error LNK2001: unresolved external symbol
>> >> __imp__apr_thread_cond_wait@8
>> >> 3>apr_queue.obj : error LNK2019: unresolved external symbol
>> >> __imp__apr_thread_cond_signal@4 referenced in function
>> _apr_queue_pop@8
>> >> 3>apr_reslist.obj : error LNK2001: unresolved external symbol
>> >> __imp__apr_thread_cond_signal@4
>> >> 3>apr_thread_pool.obj : error LNK2001: unresolved external symbol
>> >> __imp__apr_thread_cond_signal@4
>> >> 3>apr_queue.obj : error LNK2019: unresolved external symbol
>> >> __imp__apr_thread_cond_broadcast@4 referenced in function
>> >> _apr_queue_interrupt_all@4
>> >> 3>apr_thread_pool.obj : error LNK2001: unresolved external symbol
>> >> __imp__apr_thread_cond_broadcast@4
>> >> 3>apr_queue.obj : error LNK2019: unresolved external symbol
>> >> __imp__apr_thread_cond_destroy@4 referenced in function _queue_destroy
>> >> 3>apr_reslist.obj : error LNK2001: unresolved external symbol
>> >> __imp__apr_thread_cond_destroy@4
>> >> 3>apr_thread_pool.obj : error LNK2001: unresolved external symbol
>> >> __imp__apr_thread_cond_destroy@4
>> >> 3>apr_reslist.obj : error LNK2019: unresolved external symbol
>> >> __imp__apr_pool_pre_cleanup_register@12 referenced in function
>> >> _apr_reslist_cleanup_order_set@8
>> >> 3>apr_xml.obj : error LNK2001: unresolved external symbol
>> >> __imp__apr_pool_cleanup_run@12
>> >> 3>apr_reslist.obj : error LNK2019: unresolved external symbol
>> >> __imp__apr_pool_cleanup_run@12 referenced in function
>> _apr_reslist_destroy@4
>> >> 3>apr_thread_pool.obj : error LNK2001: unresolved external symbol
>> >> __imp__apr_pool_cleanup_run@12
>> >> 3>sdbm.obj : error LNK2001: unresolved external symbol
>> >> __imp__apr_pool_cleanup_run@12
>> >> 3>xlate.obj : error LNK2001: unresolved external symbol
>> >> __imp__apr_pool_cleanup_run@12
>> >> 3>apr_reslist.obj : error LNK2019: unresolved external symbol
>> >> __imp__apr_thread_cond_timedwait@16 referenced in function
>> >> _apr_reslist_acquire@8
>> >> 3>apr_thread_pool.obj : error LNK2001: unresolved external symbol
>> >> __imp__apr_thread_cond_timedwait@16
>> >> 3>apr_rmm.obj : error LNK2019: unresolved external symbol
>> >> __imp__apr_proc_mutex_lock@4 referenced in function _apr_rmm_calloc@8
>> >> 3>apr_rmm.obj : error LNK2019: unresolved external symbol
>> >> __imp__apr_proc_mutex_unlock@4 referenced in function
>> _apr_rmm_calloc@8
>> >> 3>apr_rmm.obj : error LNK2019: unresolved external symbol
>> >> __imp__apr_thread_rwlock_rdlock@4 referenced in function
>> _apr_rmm_calloc@8
>> >> 3>apr_rmm.obj : error LNK2019: unresolved external symbol
>> >> __imp__apr_thread_rwlock_wrlock@4 referenced in function
>> _apr_rmm_calloc@8
>> >> 3>apr_rmm.obj : error LNK2019: unresolved external symbol
>> >> __imp__apr_thread_rwlock_unlock@4 referenced in function
>> _apr_rmm_calloc@8
>> >> 3>apr_thread_pool.obj : error LNK2019: unresolved external symbol
>> >> __imp__apr_sleep@8 referenced in function _thread_pool_cleanup
>> >> 3>apr_thread_pool.obj : error LNK2019: unresolved external symbol
>> >> __imp__apr_thread_create@20 referenced in function _add_task
>> >> 3>apr_thread_pool.obj : error LNK2019: unresolved external symbol
>> >> __imp__apr_thread_exit@8 referenced in function _thread_pool_func@8
>> >> 3>apr_thread_pool.obj : error LNK2019: unresolved external symbol
>> >> __imp__apr_thread_join@8 referenced in function _trim_idle_threads
>> >> 3>apr_thread_pool.obj : error LNK2019: unresolved external symbol
>> >> __imp__apr_thread_detach@4 referenced in function _thread_pool_func@8
>> >> 3>apr_thread_pool.obj : error LNK2019: unresolved external symbol
>> >> __imp__apr_thread_data_get@12 referenced in function
>> >> _apr_thread_pool_task_owner_get@8
>> >> 3>apr_thread_pool.obj : error LNK2019: unresolved external symbol
>> >> __imp__apr_thread_data_set@16 referenced in function
>> _thread_pool_func@8
>> >> 3>sdbm.obj : error LNK2019: unresolved external symbol
>> >> __imp__apr_file_open@20 referenced in function _prep
>> >> 3>sdbm.obj : error LNK2019: unresolved external symbol
>> >> __imp__apr_file_read_full@16 referenced in function
>> _apr_sdbm_firstkey@8
>> >> 3>sdbm.obj : error LNK2019: unresolved external symbol
>> >> __imp__apr_file_write_full@16 referenced in function _makroom
>> >> 3>sdbm.obj : error LNK2019: unresolved external symbol
>> >> __imp__apr_file_unlock@4 referenced in function _database_cleanup
>> >> 3>sdbm_lock.obj : error LNK2001: unresolved external symbol
>> >> __imp__apr_file_unlock@4
>> >> 3>sdbm_lock.obj : error LNK2019: unresolved external symbol
>> >> __imp__apr_file_lock@8 referenced in function _apr_sdbm_lock@8
>> >> 3>sdbm_lock.obj : error LNK2019: unresolved external symbol
>> >> __imp__apr_file_info_get@12 referenced in function _apr_sdbm_lock@8
>> >> 3>apr_uri.obj : error LNK2019: unresolved external symbol
>> >> __imp__apr_pstrndup@12 referenced in function
>> _apr_uri_parse_hostinfo@12
>> >> 3>apr_xml.obj : error LNK2001: unresolved external symbol
>> >> __imp__apr_pstrndup@12
>> >> 3>xlate.obj : error LNK2019: unresolved external symbol
>> >> __imp__apr_os_default_encoding@4 referenced in function
>> _apr_xlate_open@16
>> >> 3>xlate.obj : error LNK2019: unresolved external symbol
>> >> __imp__apr_os_locale_encoding@4 referenced in function
>> _apr_xlate_open@16
>> >> 3>xlate.obj : error LNK2019: unresolved external symbol
>> >> __imp__apr_iconv_open@16 referenced in function _apr_xlate_open@16
>> >> 3>xlate.obj : error LNK2019: unresolved external symbol
>> __imp__apr_iconv@24
>> >> referenced in function _apr_xlate_conv_buffer@20
>> >> 3>xlate.obj : error LNK2019: unresolved external symbol
>> >> __imp__apr_iconv_close@8 referenced in function _apr_xlate_cleanup
>> >> 3>apr_xml.obj : error LNK2019: unresolved external symbol
>> >> __imp__apr_pool_abort_get@4 referenced in function
>> _apr_xml_parser_create@4
>> >> 3>apr_xml.obj : error LNK2019: unresolved external symbol
>> _XML_ParserCreate
>> >> referenced in function _apr_xml_parser_create@4
>> >> 3>apr_xml.obj : error LNK2019: unresolved external symbol
>> >> _XML_SetElementHandler referenced in function _apr_xml_parser_create@4
>> >> 3>apr_xml.obj : error LNK2019: unresolved external symbol
>> >> _XML_SetCharacterDataHandler referenced in function
>> _apr_xml_parser_create@4
>> >> 3>apr_xml.obj : error LNK2019: unresolved external symbol
>> >> _XML_SetDefaultHandler referenced in function _apr_xml_parser_create@4
>> >> 3>apr_xml.obj : error LNK2019: unresolved external symbol
>> _XML_SetUserData
>> >> referenced in function _apr_xml_parser_create@4
>> >> 3>apr_xml.obj : error LNK2019: unresolved external symbol _XML_Parse
>> >> referenced in function _apr_xml_parse_file@20
>> >> 3>apr_xml.obj : error LNK2019: unresolved external symbol
>> _XML_GetErrorCode
>> >> referenced in function _apr_xml_parse_file@20
>> >> 3>apr_xml.obj : error LNK2019: unresolved external symbol
>> _XML_ParserFree
>> >> referenced in function _cleanup_parser
>> >> 3>apr_xml.obj : error LNK2019: unresolved external symbol
>> _XML_ErrorString
>> >> referenced in function _apr_xml_parser_geterror@12
>> >> 3>Release\libaprutil-1.dll : fatal error LNK1120: 115 unresolved
>> externals
>> >> 16>  sdbm_lock.c
>> >> 2>  sockets.c
>> >> 1>  socket_util.c
>> >> 1>  sockopt.c
>> >> 2>  socket_util.c
>> >> 2>  sockopt.c
>> >> 16>  sdbm_pair.c
>> >> 16>  apr_strmatch.c
>> >> 18>------ Build started: Project: apr_dbd_odbc, Configuration: Release
>> Win32
>> >> ------
>> >>
>> 1>C:\Users\matthep\Documents\Code\apr\apr-util\dbd\apr_dbd_odbc.vcxproj(78,5):
>> >> warning MSB4011:
>> >>
>> "C:\Users\matthep\AppData\Local\Microsoft\MSBuild\v4.0\Microsoft.Cpp.Win32.user.props"
>> >> cannot be imported again. It was already imported at
>> >> "C:\Users\matthep\Documents\Code\apr\apr-util\dbd\apr_dbd_odbc.vcxproj
>> >> (75,5)". This is most likely a build authoring error. This subsequent
>> import
>> >> will be ignored.
>> >>
>> 2>C:\Users\matthep\Documents\Code\apr\apr-util\dbd\apr_dbd_odbc.vcxproj(78,5):
>> >> warning MSB4011:
>> >>
>> "C:\Users\matthep\AppData\Local\Microsoft\MSBuild\v4.0\Microsoft.Cpp.Win32.user.props"
>> >> cannot be imported again. It was already imported at
>> >> "C:\Users\matthep\Documents\Code\apr\apr-util\dbd\apr_dbd_odbc.vcxproj
>> >> (75,5)". This is most likely a build authoring error. This subsequent
>> import
>> >> will be ignored.
>> >>
>> 16>C:\Users\matthep\Documents\Code\apr\apr-util\dbd\apr_dbd_odbc.vcxproj(78,5):
>> >> warning MSB4011:
>> >>
>> "C:\Users\matthep\AppData\Local\Microsoft\MSBuild\v4.0\Microsoft.Cpp.Win32.user.props"
>> >> cannot be imported again. It was already imported at
>> >> "C:\Users\matthep\Documents\Code\apr\apr-util\dbd\apr_dbd_odbc.vcxproj
>> >> (75,5)". This is most likely a build authoring error. This subsequent
>> import
>> >> will be ignored.
>> >>
>> 18>C:\Users\matthep\Documents\Code\apr\apr-util\dbd\apr_dbd_odbc.vcxproj(78,5):
>> >> warning MSB4011:
>> >>
>> "C:\Users\matthep\AppData\Local\Microsoft\MSBuild\v4.0\Microsoft.Cpp.Win32.user.props"
>> >> cannot be imported again. It was already imported at
>> >> "C:\Users\matthep\Documents\Code\apr\apr-util\dbd\apr_dbd_odbc.vcxproj
>> >> (75,5)". This is most likely a build authoring error. This subsequent
>> import
>> >> will be ignored.
>> >> 1>  apr_getpass.c
>> >> 16>  apr_uri.c
>> >> 18>  apr_dbd_odbc.c
>> >> 2>  apr_getpass.c
>> >> 16>  xlate.c
>> >> 1>  poll.c
>> >> 18>     Creating library Release\apr_dbd_odbc-1.lib and object
>> >> Release\apr_dbd_odbc-1.exp
>> >> 16>  apr_xml.c
>> >> 2>  poll.c
>> >> 18>apr_dbd_odbc.obj : error LNK2019: unresolved external symbol
>> >> __imp__apr_palloc@8 referenced in function _odbc_open
>> >> 18>apr_dbd_odbc.obj : error LNK2019: unresolved external symbol
>> >> __imp__apr_pool_is_ancestor@8 referenced in function
>> >> _odbc_lob_bucket_setaside
>> >> 18>apr_dbd_odbc.obj : error LNK2019: unresolved external symbol
>> >> __imp__apr_pool_cleanup_register@16 referenced in function _odbc_init
>> >> 18>apr_dbd_odbc.obj : error LNK2019: unresolved external symbol
>> >> __imp__apr_pool_cleanup_null referenced in function _odbc_init
>> >> 18>apr_dbd_odbc.obj : error LNK2019: unresolved external symbol
>> >> __imp__apr_strnatcmp@8 referenced in function _odbc_set_dbname
>> >> 18>apr_dbd_odbc.obj : error LNK2019: unresolved external symbol
>> >> __imp__apr_strnatcasecmp@8 referenced in function _odbc_parse_params
>> >> 18>apr_dbd_odbc.obj : error LNK2019: unresolved external symbol
>> >> __imp__apr_pstrdup@8 referenced in function _odbc_open
>> >> 18>apr_dbd_odbc.obj : error LNK2019: unresolved external symbol
>> >> __imp__apr_pmemdup@12 referenced in function _odbc_prepare
>> >> 18>apr_dbd_odbc.obj : error LNK2019: unresolved external symbol
>> >> __imp__apr_cpystrn@12 referenced in function _odbc_query
>> >> 18>apr_dbd_odbc.obj : error LNK2019: unresolved external symbol
>> >> __imp__apr_strtok@12 referenced in function _odbc_parse_params
>> >> 18>apr_dbd_odbc.obj : error LNK2019: unresolved external symbol
>> >> __imp__apr_atoi64@4 referenced in function _odbc_bind_param
>> >> 18>apr_dbd_odbc.obj : error LNK2019: unresolved external symbol
>> >> __imp__apr_time_now@0 referenced in function _check_error
>> >> 18>apr_dbd_odbc.obj : error LNK2019: unresolved external symbol
>> >> __imp__apr_ctime@12 referenced in function _check_error
>> >> 18>apr_dbd_odbc.obj : error LNK2019: unresolved external symbol
>> >> __imp__apr_file_open_stderr@8 referenced in function _odbc_init
>> >> 18>apr_dbd_odbc.obj : error LNK2019: unresolved external symbol
>> >> __imp__apr_file_printf referenced in function _odbc_init
>> >> 18>apr_dbd_odbc.obj : error LNK2019: unresolved external symbol
>> >> __imp__apr_env_get@12 referenced in function _check_error
>> >> 18>Release\apr_dbd_odbc-1.dll : fatal error LNK1120: 16 unresolved
>> externals
>> >> 1>  pollcb.c
>> >> 16>  Generating Code...
>> >> 2>  pollcb.c
>> >> 1>  pollset.c
>> >> 2>  pollset.c
>> >> 1>  select.c
>> >> 2>  select.c
>> >> 1>  apr_random.c
>> >> 1>  sha2.c
>> >> 2>  apr_random.c
>> >> 16>  aprutil.vcxproj ->
>> >> C:\Users\matthep\Documents\Code\apr\apr-util\LibR\aprutil-1.lib
>> >> 1>  sha2_glue.c
>> >> 2>  sha2.c
>> >> 1>  shm.c
>> >> 2>  sha2_glue.c
>> >> 2>  shm.c
>> >> 1>  apr_cpystrn.c
>> >> 1>  apr_fnmatch.c
>> >> 2>  apr_cpystrn.c
>> >> 1>  apr_snprintf.c
>> >> 2>  apr_fnmatch.c
>> >> 1>  apr_strings.c
>> >> 2>  apr_snprintf.c
>> >> 1>  apr_strnatcmp.c
>> >> 2>  apr_strings.c
>> >> 1>  apr_strtok.c
>> >> 2>  apr_strnatcmp.c
>> >> 1>  Generating Code...
>> >> 2>  apr_strtok.c
>> >> 2>  Generating Code...
>> >> 1>  Compiling...
>> >> 1>  apr_hash.c
>> >> 1>  apr_tables.c
>> >> 2>  Compiling...
>> >> 2>  apr_hash.c
>> >> 1>  proc.c
>> >> 2>  apr_tables.c
>> >> 1>  signals.c
>> >> 2>  proc.c
>> >> 1>  thread.c
>> >> 2>  signals.c
>> >> 1>  threadpriv.c
>> >> 2>  thread.c
>> >> 1>  time.c
>> >> 2>  threadpriv.c
>> >> 1>  timestr.c
>> >> 2>  time.c
>> >> 1>  groupinfo.c
>> >> 2>  timestr.c
>> >> 1>  userinfo.c
>> >> 2>  groupinfo.c
>> >> 1>  Generating Code...
>> >> 2>  userinfo.c
>> >> 2>  Generating Code...
>> >> 1>  apr.vcxproj ->
>> C:\Users\matthep\Documents\Code\apr\apr\LibR\apr-1.lib
>> >> 19>------ Build started: Project: preaprapp, Configuration: Release
>> Win32
>> >> ------
>> >> 20>------ Build started: Project: preapriconv, Configuration: Release
>> Win32
>> >> ------
>> >>
>> 2>C:\Users\matthep\Documents\Code\apr\apr\build\preaprapp.vcxproj(112,5):
>> >> warning MSB4011:
>> >>
>> "C:\Users\matthep\AppData\Local\Microsoft\MSBuild\v4.0\Microsoft.Cpp.Win32.user.props"
>> >> cannot be imported again. It was already imported at
>> >> "C:\Users\matthep\Documents\Code\apr\apr\build\preaprapp.vcxproj
>> (102,5)".
>> >> This is most likely a build authoring error. This subsequent import
>> will be
>> >> ignored.
>> >>
>> 19>C:\Users\matthep\Documents\Code\apr\apr\build\preaprapp.vcxproj(112,5):
>> >> warning MSB4011:
>> >>
>> "C:\Users\matthep\AppData\Local\Microsoft\MSBuild\v4.0\Microsoft.Cpp.Win32.user.props"
>> >> cannot be imported again. It was already imported at
>> >> "C:\Users\matthep\Documents\Code\apr\apr\build\preaprapp.vcxproj
>> (102,5)".
>> >> This is most likely a build authoring error. This subsequent import
>> will be
>> >> ignored.
>> >>
>> 19>C:\Users\matthep\Documents\Code\apr\apr-iconv\build\preapriconv.vcxproj(82,5):
>> >> warning MSB4011:
>> >>
>> "C:\Users\matthep\AppData\Local\Microsoft\MSBuild\v4.0\Microsoft.Cpp.Win32.user.props"
>> >> cannot be imported again. It was already imported at
>> >>
>> "C:\Users\matthep\Documents\Code\apr\apr-iconv\build\preapriconv.vcxproj
>> >> (76,5)". This is most likely a build authoring error. This subsequent
>> import
>> >> will be ignored.
>> >>
>> 20>C:\Users\matthep\Documents\Code\apr\apr\build\preaprapp.vcxproj(112,5):
>> >> warning MSB4011:
>> >>
>> "C:\Users\matthep\AppData\Local\Microsoft\MSBuild\v4.0\Microsoft.Cpp.Win32.user.props"
>> >> cannot be imported again. It was already imported at
>> >> "C:\Users\matthep\Documents\Code\apr\apr\build\preaprapp.vcxproj
>> (102,5)".
>> >> This is most likely a build authoring error. This subsequent import
>> will be
>> >> ignored.
>> >>
>> 20>C:\Users\matthep\Documents\Code\apr\apr-iconv\build\preapriconv.vcxproj(82,5):
>> >> warning MSB4011:
>> >>
>> "C:\Users\matthep\AppData\Local\Microsoft\MSBuild\v4.0\Microsoft.Cpp.Win32.user.props"
>> >> cannot be imported again. It was already imported at
>> >>
>> "C:\Users\matthep\Documents\Code\apr\apr-iconv\build\preapriconv.vcxproj
>> >> (76,5)". This is most likely a build authoring error. This subsequent
>> import
>> >> will be ignored.
>> >>
>> 2>C:\Users\matthep\Documents\Code\apr\apr-iconv\build\preapriconv.vcxproj(82,5):
>> >> warning MSB4011:
>> >>
>> "C:\Users\matthep\AppData\Local\Microsoft\MSBuild\v4.0\Microsoft.Cpp.Win32.user.props"
>> >> cannot be imported again. It was already imported at
>> >>
>> "C:\Users\matthep\Documents\Code\apr\apr-iconv\build\preapriconv.vcxproj
>> >> (76,5)". This is most likely a build authoring error. This subsequent
>> import
>> >> will be ignored.
>> >> 21>------ Build started: Project: aprapp, Configuration: Release Win32
>> >> ------
>> >> 22>------ Build started: Project: apriconv, Configuration: Release
>> Win32
>> >> ------
>> >> 2>C:\Users\matthep\Documents\Code\apr\apr\build\aprapp.vcxproj(115,5):
>> >> warning MSB4011:
>> >>
>> "C:\Users\matthep\AppData\Local\Microsoft\MSBuild\v4.0\Microsoft.Cpp.Win32.user.props"
>> >> cannot be imported again. It was already imported at
>> >> "C:\Users\matthep\Documents\Code\apr\apr\build\aprapp.vcxproj
>> (108,5)". This
>> >> is most likely a build authoring error. This subsequent import will be
>> >> ignored.
>> >> 21>C:\Users\matthep\Documents\Code\apr\apr\build\aprapp.vcxproj(115,5):
>> >> warning MSB4011:
>> >>
>> "C:\Users\matthep\AppData\Local\Microsoft\MSBuild\v4.0\Microsoft.Cpp.Win32.user.props"
>> >> cannot be imported again. It was already imported at
>> >> "C:\Users\matthep\Documents\Code\apr\apr\build\aprapp.vcxproj
>> (108,5)". This
>> >> is most likely a build authoring error. This subsequent import will be
>> >> ignored.
>> >>
>> 21>C:\Users\matthep\Documents\Code\apr\apr-iconv\apriconv.vcxproj(78,5):
>> >> warning MSB4011:
>> >>
>> "C:\Users\matthep\AppData\Local\Microsoft\MSBuild\v4.0\Microsoft.Cpp.Win32.user.props"
>> >> cannot be imported again. It was already imported at
>> >> "C:\Users\matthep\Documents\Code\apr\apr-iconv\apriconv.vcxproj
>> (75,5)".
>> >> This is most likely a build authoring error. This subsequent import
>> will be
>> >> ignored.
>> >> 22>C:\Users\matthep\Documents\Code\apr\apr\build\aprapp.vcxproj(115,5):
>> >> warning MSB4011:
>> >>
>> "C:\Users\matthep\AppData\Local\Microsoft\MSBuild\v4.0\Microsoft.Cpp.Win32.user.props"
>> >> cannot be imported again. It was already imported at
>> >> "C:\Users\matthep\Documents\Code\apr\apr\build\aprapp.vcxproj
>> (108,5)". This
>> >> is most likely a build authoring error. This subsequent import will be
>> >> ignored.
>> >>
>> 22>C:\Users\matthep\Documents\Code\apr\apr-iconv\apriconv.vcxproj(78,5):
>> >> warning MSB4011:
>> >>
>> "C:\Users\matthep\AppData\Local\Microsoft\MSBuild\v4.0\Microsoft.Cpp.Win32.user.props"
>> >> cannot be imported again. It was already imported at
>> >> "C:\Users\matthep\Documents\Code\apr\apr-iconv\apriconv.vcxproj
>> (75,5)".
>> >> This is most likely a build authoring error. This subsequent import
>> will be
>> >> ignored.
>> >> 2>C:\Users\matthep\Documents\Code\apr\apr-iconv\apriconv.vcxproj(78,5):
>> >> warning MSB4011:
>> >>
>> "C:\Users\matthep\AppData\Local\Microsoft\MSBuild\v4.0\Microsoft.Cpp.Win32.user.props"
>> >> cannot be imported again. It was already imported at
>> >> "C:\Users\matthep\Documents\Code\apr\apr-iconv\apriconv.vcxproj
>> (75,5)".
>> >> This is most likely a build authoring error. This subsequent import
>> will be
>> >> ignored.
>> >> 2>     Creating library Release\libapr-1.lib and object
>> Release\libapr-1.exp
>> >> 21>  apr_app.c
>> >> 22>  iconv.c
>> >> 2>  libapr.vcxproj ->
>> >> C:\Users\matthep\Documents\Code\apr\apr\Release\libapr-1.dll
>> >> 22>  iconv_ces.c
>> >> 21>  aprapp.vcxproj ->
>> >> C:\Users\matthep\Documents\Code\apr\apr\build\..\LibR\aprapp-1.lib
>> >> 23>------ Build started: Project: libapriconv, Configuration: Release
>> Win32
>> >> ------
>> >> 22>  iconv_ces_euc.c
>> >> 22>  iconv_ces_iso2022.c
>> >> 24>------ Build started: Project: prelibaprapp, Configuration: Release
>> Win32
>> >> ------
>> >>
>> 22>C:\Users\matthep\Documents\Code\apr\apr-iconv\libapriconv.vcxproj(85,5):
>> >> warning MSB4011:
>> >>
>> "C:\Users\matthep\AppData\Local\Microsoft\MSBuild\v4.0\Microsoft.Cpp.Win32.user.props"
>> >> cannot be imported again. It was already imported at
>> >> "C:\Users\matthep\Documents\Code\apr\apr-iconv\libapriconv.vcxproj
>> (75,5)".
>> >> This is most likely a build authoring error. This subsequent import
>> will be
>> >> ignored.
>> >>
>> 23>C:\Users\matthep\Documents\Code\apr\apr-iconv\libapriconv.vcxproj(85,5):
>> >> warning MSB4011:
>> >>
>> "C:\Users\matthep\AppData\Local\Microsoft\MSBuild\v4.0\Microsoft.Cpp.Win32.user.props"
>> >> cannot be imported again. It was already imported at
>> >> "C:\Users\matthep\Documents\Code\apr\apr-iconv\libapriconv.vcxproj
>> (75,5)".
>> >> This is most likely a build authoring error. This subsequent import
>> will be
>> >> ignored.
>> >>
>> 23>C:\Users\matthep\Documents\Code\apr\apr\build\prelibaprapp.vcxproj(116,5):
>> >> warning MSB4011:
>> >>
>> "C:\Users\matthep\AppData\Local\Microsoft\MSBuild\v4.0\Microsoft.Cpp.Win32.user.props"
>> >> cannot be imported again. It was already imported at
>> >> "C:\Users\matthep\Documents\Code\apr\apr\build\prelibaprapp.vcxproj
>> >> (102,5)". This is most likely a build authoring error. This subsequent
>> >> import will be ignored.
>> >>
>> 24>C:\Users\matthep\Documents\Code\apr\apr-iconv\libapriconv.vcxproj(85,5):
>> >> warning MSB4011:
>> >>
>> "C:\Users\matthep\AppData\Local\Microsoft\MSBuild\v4.0\Microsoft.Cpp.Win32.user.props"
>> >> cannot be imported again. It was already imported at
>> >> "C:\Users\matthep\Documents\Code\apr\apr-iconv\libapriconv.vcxproj
>> (75,5)".
>> >> This is most likely a build authoring error. This subsequent import
>> will be
>> >> ignored.
>> >>
>> 24>C:\Users\matthep\Documents\Code\apr\apr\build\prelibaprapp.vcxproj(116,5):
>> >> warning MSB4011:
>> >>
>> "C:\Users\matthep\AppData\Local\Microsoft\MSBuild\v4.0\Microsoft.Cpp.Win32.user.props"
>> >> cannot be imported again. It was already imported at
>> >> "C:\Users\matthep\Documents\Code\apr\apr\build\prelibaprapp.vcxproj
>> >> (102,5)". This is most likely a build authoring error. This subsequent
>> >> import will be ignored.
>> >>
>> 22>C:\Users\matthep\Documents\Code\apr\apr\build\prelibaprapp.vcxproj(116,5):
>> >> warning MSB4011:
>> >>
>> "C:\Users\matthep\AppData\Local\Microsoft\MSBuild\v4.0\Microsoft.Cpp.Win32.user.props"
>> >> cannot be imported again. It was already imported at
>> >> "C:\Users\matthep\Documents\Code\apr\apr\build\prelibaprapp.vcxproj
>> >> (102,5)". This is most likely a build authoring error. This subsequent
>> >> import will be ignored.
>> >> 22>  iconv_int.c
>> >> 23>  iconv.c
>> >> 22>  iconv_module.c
>> >> 22>  iconv_uc.c
>> >> 22>  Generating Code...
>> >> 25>------ Build started: Project: libaprapp, Configuration: Release
>> Win32
>> >> ------
>> >>
>> 22>C:\Users\matthep\Documents\Code\apr\apr\build\libaprapp.vcxproj(108,5):
>> >> warning MSB4011:
>> >>
>> "C:\Users\matthep\AppData\Local\Microsoft\MSBuild\v4.0\Microsoft.Cpp.Win32.user.props"
>> >> cannot be imported again. It was already imported at
>> >> "C:\Users\matthep\Documents\Code\apr\apr\build\libaprapp.vcxproj
>> (101,5)".
>> >> This is most likely a build authoring error. This subsequent import
>> will be
>> >> ignored.
>> >>
>> 23>C:\Users\matthep\Documents\Code\apr\apr\build\libaprapp.vcxproj(108,5):
>> >> warning MSB4011:
>> >>
>> "C:\Users\matthep\AppData\Local\Microsoft\MSBuild\v4.0\Microsoft.Cpp.Win32.user.props"
>> >> cannot be imported again. It was already imported at
>> >> "C:\Users\matthep\Documents\Code\apr\apr\build\libaprapp.vcxproj
>> (101,5)".
>> >> This is most likely a build authoring error. This subsequent import
>> will be
>> >> ignored.
>> >>
>> 25>C:\Users\matthep\Documents\Code\apr\apr\build\libaprapp.vcxproj(108,5):
>> >> warning MSB4011:
>> >>
>> "C:\Users\matthep\AppData\Local\Microsoft\MSBuild\v4.0\Microsoft.Cpp.Win32.user.props"
>> >> cannot be imported again. It was already imported at
>> >> "C:\Users\matthep\Documents\Code\apr\apr\build\libaprapp.vcxproj
>> (101,5)".
>> >> This is most likely a build authoring error. This subsequent import
>> will be
>> >> ignored.
>> >> 25>  apr_app.c
>> >> 22>  apriconv.vcxproj ->
>> >> C:\Users\matthep\Documents\Code\apr\apr-iconv\LibR\apriconv-1.lib
>> >> 23>  iconv_ces.c
>> >> 23>  iconv_ces_euc.c
>> >> 25>  internal.c
>> >> 23>  iconv_ces_iso2022.c
>> >> 23>  iconv_int.c
>> >> 23>  iconv_module.c
>> >> 23>  iconv_uc.c
>> >> 23>  Generating Code...
>> >> 25>  Generating Code...
>> >> 23>     Creating library Release\libapriconv-1.lib and object
>> >> Release\libapriconv-1.exp
>> >> 25>  libaprapp.vcxproj ->
>> >>
>> C:\Users\matthep\Documents\Code\apr\apr\build\..\Release\libaprapp-1.lib
>> >> 23>  libapriconv.vcxproj ->
>> >> C:\Users\matthep\Documents\Code\apr\apr-iconv\Release\libapriconv-1.dll
>> >> 26>------ Build started: Project: libapriconv_ccs_modules,
>> Configuration:
>> >> Release Win32 ------
>> >> 27>------ Build started: Project: libapriconv_ces_modules,
>> Configuration:
>> >> Release Win32 ------
>> >>
>> 26>C:\Users\matthep\Documents\Code\apr\apr-iconv\ccs\libapriconv_ccs_modules.vcxproj(146,5):
>> >> warning MSB4011:
>> >>
>> "C:\Users\matthep\AppData\Local\Microsoft\MSBuild\v4.0\Microsoft.Cpp.Win32.user.props"
>> >> cannot be imported again. It was already imported at
>> >>
>> "C:\Users\matthep\Documents\Code\apr\apr-iconv\ccs\libapriconv_ccs_modules.vcxproj
>> >> (143,5)". This is most likely a build authoring error. This subsequent
>> >> import will be ignored.
>> >>
>> 27>C:\Users\matthep\Documents\Code\apr\apr-iconv\ccs\libapriconv_ccs_modules.vcxproj(146,5):
>> >> warning MSB4011:
>> >>
>> "C:\Users\matthep\AppData\Local\Microsoft\MSBuild\v4.0\Microsoft.Cpp.Win32.user.props"
>> >> cannot be imported again. It was already imported at
>> >>
>> "C:\Users\matthep\Documents\Code\apr\apr-iconv\ccs\libapriconv_ccs_modules.vcxproj
>> >> (143,5)". This is most likely a build authoring error. This subsequent
>> >> import will be ignored.
>> >>
>> 27>C:\Users\matthep\Documents\Code\apr\apr-iconv\ces\libapriconv_ces_modules.vcxproj(146,5):
>> >> warning MSB4011:
>> >>
>> "C:\Users\matthep\AppData\Local\Microsoft\MSBuild\v4.0\Microsoft.Cpp.Win32.user.props"
>> >> cannot be imported again. It was already imported at
>> >>
>> "C:\Users\matthep\Documents\Code\apr\apr-iconv\ces\libapriconv_ces_modules.vcxproj
>> >> (143,5)". This is most likely a build authoring error. This subsequent
>> >> import will be ignored.
>> >>
>> 26>C:\Users\matthep\Documents\Code\apr\apr-iconv\ces\libapriconv_ces_modules.vcxproj(146,5):
>> >> warning MSB4011:
>> >>
>> "C:\Users\matthep\AppData\Local\Microsoft\MSBuild\v4.0\Microsoft.Cpp.Win32.user.props"
>> >> cannot be imported again. It was already imported at
>> >>
>> "C:\Users\matthep\Documents\Code\apr\apr-iconv\ces\libapriconv_ces_modules.vcxproj
>> >> (143,5)". This is most likely a build authoring error. This subsequent
>> >> import will be ignored.
>> >> 27>  _tbl_simple.c
>> >> 26>  adobe-stdenc.c
>> >> 27>     Creating library ..\Release\iconv\_tbl_simple.lib and object
>> >> ..\Release\iconv\_tbl_simple.exp
>> >> 26>     Creating library ..\Release\iconv\adobe-stdenc.lib and object
>> >> ..\Release\iconv\adobe-stdenc.exp
>> >> 27>_tbl_simple.obj : error LNK2011: precompiled object not linked in;
>> image
>> >> may not run
>> >> 27>..\Release\iconv\_tbl_simple.so : fatal error LNK1120: 1 unresolved
>> >> externals
>> >> 27>NMAKE : fatal error U1077: '"C:\Program Files (x86)\Microsoft Visual
>> >> Studio 11.0\VC\bin\link.EXE"' : return code '0x460'
>> >> 27>  Stop.
>> >> 26>adobe-stdenc.obj : error LNK2011: precompiled object not linked in;
>> image
>> >> may not run
>> >> 26>..\Release\iconv\adobe-stdenc.so : fatal error LNK1120: 1 unresolved
>> >> externals
>> >> 26>NMAKE : fatal error U1077: '"C:\Program Files (x86)\Microsoft Visual
>> >> Studio 11.0\VC\bin\link.EXE"' : return code '0x460'
>> >> 26>  Stop.
>> >> 26>C:\Program Files
>> >> (x86)\MSBuild\Microsoft.Cpp\v4.0\V110\Microsoft.MakeFile.Targets(38,5):
>> >> error MSB3073: The command "NMAKE /nologo /f Makefile.win
>> BUILD_MODE="Win32
>> >> Release" BIND_MODE=shared" exited with code 2.
>> >> 27>C:\Program Files
>> >> (x86)\MSBuild\Microsoft.Cpp\v4.0\V110\Microsoft.MakeFile.Targets(38,5):
>> >> error MSB3073: The command "NMAKE /nologo /f Makefile.win
>> BUILD_MODE="Win32
>> >> Release" BIND_MODE=shared" exited with code 2.
>> >> ========== Build: 12 succeeded, 15 failed, 0 up-to-date, 0 skipped
>> >> ==========
>> >>
>> >> Please let me know if there is any more specific information required.
>> >>
>> >> Regards, Paul
>> >>
>> >
>> >
>> >
>> > --
>> > Born in Roswell... married an alien...
>> > http://emptyhammock.com/
>>
>>
>>
>> --
>> Born in Roswell... married an alien...
>> http://emptyhammock.com/
>>
>
>

Mime
View raw message