apr-dev mailing list archives

Site index · List index
Message view « Date » · « Thread »
Top « Date » · « Thread »
From Bojan Smojver <bo...@rexursive.com>
Subject Re: [Votes] Apr candidates in /dev/dist/
Date Sun, 18 Nov 2007 23:38:07 GMT
On Thu, 2007-11-15 at 16:26 -0500, William A. Rowe, Jr. wrote:
> Please provide your input to release.
> 
>    [+1] APR-0.9.17
>    [+1] APR-1.2.12
>    [-1] APR-util-1.2.11
>    [  ] APR-iconv-1.2.1

Fedora 8, i686 and x86_64.

Both apr-0.9.17 and apr-1.2.12 fail SHM tests:

0.9.17:
-------------------------
starting consumer.....
starting producer.....
Name-based shared memory test FAILED: [2] No such file or directory 
Name-based shared memory test FAILED: [2] No such file or directory 
Waiting for producer to exit.
Waiting for consumer to exit.
Destroying shared memory segment...OK
Named shared memory test passed!
-------------------------

1.2.12:
-------------------------
testshm             : FAILED 1 of 6
-------------------------

However, there have been comments that this is supposed to be expected
and that there is no fix available at present. So, I guess +1 in that
case.

apr-util-1.2.11 fails with:
-------------------------
testdate            : FAILED 1 of 2
-------------------------

Also, testreslist hangs, just like for some other people.

Given that Ruediger already committed patches for both of these, it
would probably be best to roll again.

-- 
Bojan


Mime
View raw message