apr-dev mailing list archives

Site index · List index
Message view « Date » · « Thread »
Top « Date » · « Thread »
From Mladen Turk <mt...@apache.org>
Subject Re: RC6 take 2
Date Thu, 26 Aug 2004 15:49:05 GMT
David Reid wrote:

 >
 > Thanks. Anyone from the world of windows care to comment...
 >

Here are some windows comments :) .

Compilation:
sha2.c
random\unix\sha2.c(461) : warning C4244: '=' : conversion from 
'apr_uint64_t' to 'unsigned int', possible loss of data
random\unix\sha2.c(507) : warning C4244: '=' : conversion from 
'apr_uint64_t' to 'unsigned int', possible loss of data
random\unix\sha2.c(783) : warning C4244: '=' : conversion from 
'apr_uint64_t' to 'unsigned int', possible loss of data
random\unix\sha2.c(823) : warning C4244: '=' : conversion from 
'apr_uint64_t' to 'unsigned int', possible loss of data

Would be nice to fix that.

Test (WIN2K3) :

testall.exe:
testatomic          : FAILED 1 of 14
testdir             : SUCCESS
testdso             : SUCCESS
testdup             : SUCCESS
testenv             : SUCCESS
testfile            : SUCCESS
testfilecopy        : SUCCESS
testfileinfo        : FAILED 1 of 5
testflock           : SUCCESS
testfmt             : SUCCESS
testfnmatch         : SUCCESS
testargs            : SUCCESS
testhash            : SUCCESS
testipsub           : SUCCESS
testlock            : SUCCESS
testlfs             : SUCCESS
testmmap            : FAILED 3 of 8
testnames           : SUCCESS
testoc              : SUCCESS
testpath            : SUCCESS
testpipe            : /
Blocks on testpipe! Had to comment the entry in abts_tests.h

testpath            : SUCCESS
testpoll            : SUCCESS
testpools           : SUCCESS
testproc            : SUCCESS
testprocmutex       : SUCCESS
testrand            : SUCCESS
testrand2           : -0x41,0xb5,0x16,0x94,0x66,0x0
....
FAILED 4 of 7
testsleep           : SUCCESS
testshm             : SUCCESS
testsock            : SUCCESS
testsockets         : SUCCESS
testsockopt         : SUCCESS
teststr             : SUCCESS
teststrnatcmp       : SUCCESS
testtable           : SUCCESS
testtemp            : SUCCESS
testthread          : SUCCESS
testtime            : SUCCESS
testud              : SUCCESS
testuser            : SUCCESS
testvsn             : SUCCESS
Failed Tests            Total   Fail    Failed %
===================================================
testatomic                 14      1      7.14%
testfileinfo                5      1     20.00%
testmmap                    8      3     37.50%
testrand2                   7      4     57.14%


Regards,
MT.

Mime
View raw message