apr-dev mailing list archives

Site index · List index
Message view « Date » · « Thread »
Top « Date » · « Thread »
From chiggsy <chig...@sockedfeet.com>
Subject problem building apr on darwin
Date Sat, 20 Sep 2003 19:10:54 GMT
Hello all,
	I am having a problem building apr on darwin.

I am using :
darwin 7.0.0
gcc 3.3
  and here is the error i get :

poll.c: In function `apr_poll':
poll.c:126: error: storage size of `pollset' isn't known
poll.c: In function `apr_pollset_create':
poll.c:353: error: invalid application of `sizeof' to an incomplete type
poll.c: In function `apr_pollset_add':
poll.c:392: error: invalid use of undefined type `struct pollfd'
poll.c:392: error: dereferencing pointer to incomplete type
poll.c:395: error: invalid use of undefined type `struct pollfd'
poll.c:395: error: dereferencing pointer to incomplete type
poll.c:398: error: invalid use of undefined type `struct pollfd'
poll.c:398: error: dereferencing pointer to incomplete type
poll.c: In function `apr_pollset_remove':
poll.c:468: error: invalid use of undefined type `struct pollfd'
poll.c:468: error: dereferencing pointer to incomplete type
poll.c:468: error: invalid use of undefined type `struct pollfd'
poll.c:468: error: dereferencing pointer to incomplete type
poll.c: In function `apr_pollset_poll':
poll.c:540: error: invalid use of undefined type `struct pollfd'
poll.c:540: error: dereferencing pointer to incomplete type
poll.c:543: error: invalid use of undefined type `struct pollfd'
poll.c:543: error: dereferencing pointer to incomplete type
make[2]: *** [poll.lo] Error 1
make[1]: *** [all-recursive] Error 1
make: *** [all-recursive] Error 1

has anyone else seen this problem ?


Mime
View raw message