apr-dev mailing list archives

Site index · List index
Message view « Date » · « Thread »
Top « Date » · « Thread »
From Jeff Trawick <traw...@attglobal.net>
Subject recent build breakage in Apache, probably due to apr-util?
Date Fri, 08 Feb 2002 21:03:19 GMT
I'm getting stuff like this on Linux and FreeBSD.

> htpasswd.o: In function `mkrecord':
> /home/regress/regress/httpd-2.0/support/htpasswd.c:235: undefined
> reference to `apr_sha1_base64'
> collect2: ld returned 1 exit status
> make[2]: *** [htpasswd] Error 1
> make[1]: *** [all-recursive] Error 1
> make: *** [all-recursive] Error 1

Is anybody else seeing this?

-- 
Jeff Trawick | trawick@attglobal.net | PGP public key at web site:
       http://www.geocities.com/SiliconValley/Park/9289/
             Born in Roswell... married an alien...

Mime
View raw message