apr-bugs mailing list archives

Site index · List index
Message view « Date » · « Thread »
Top « Date » · « Thread »
From bugzi...@apache.org
Subject [Bug 53908] New: make check fails with core dump (segmentation failure) - testxlate
Date Wed, 19 Sep 2012 22:25:17 GMT
https://issues.apache.org/bugzilla/show_bug.cgi?id=53908

          Priority: P2
            Bug ID: 53908
          Assignee: bugs@apr.apache.org
           Summary: make check fails with core dump (segmentation failure)
                    - testxlate
          Severity: normal
    Classification: Unclassified
                OS: AIX
          Reporter: mamfelt@gmail.com
          Hardware: Other
            Status: NEW
           Version: HEAD
         Component: APR-util
           Product: APR

make check (after patching Makefile - see
https://issues.apache.org/bugzilla/show_bug.cgi?id=53907

make check of apr-util-1.5.x returns:
...
testdate            : SUCCESS
testmemcache        : SUCCESS
testxml             : SUCCESS
testxlate           : |/bin/sh[17]: 10879096 Segmentation fault(coredump)
Programs failed: testall
make[1]: *** [check] Error 139

root@x104:[/data/prj/apr/apr-util-1.5.x/test]dbx testall core
Type 'help' for help.
[using memory image in core]
reading symbolic information ...

Segmentation fault in . at 0xd21c1110 ($t1)
0xd21c1110 (???) 901e0000         stw   r0,0x0(r30)
(dbx) where
_iconv_from_utf8(??, ??, ??, ??, ??) at 0xd21c1110
iconv(??, ??, ??, ??, ??) at 0xd054aff8
apr_xlate_conv_buffer() at 0xd18f6084
test_conversion() at 0x10008d7c
one_test() at 0x10008c8c
test_transformation() at 0x100089dc
abts_run_test() at 0x10001484
testxlate() at 0x10008e28
main() at 0x100004f8
(dbx)

Would appreciate assistence with a iconv test from command-line that (comes
close to) emulateing this test to determine if there is a syntax, or other
problem with IBM-iconv

thanks!

System: AIX 6.1, TL6

root@x104:[/data/prj/apr/apr-1.4.x/test]oslevel -s
6100-06-06-1140
root@x104:[/data/prj/apr/apr-1.4.x/test]lslpp -L | grep iconv
  bos.iconv.com             6.1.6.15    C     F    Common Language to Language
  bos.iconv.ucs.com         6.1.6.16    C     F    Unicode Base Converters for
  bos.rte.iconv             6.1.6.16    C     F    Language Converters

====
Same error with apr-util-1.4.x:
testdate            : SUCCESS
testmemcache        : SUCCESS
testxml             : SUCCESS
testxlate           : |/bin/sh[17]: 5767418 Segmentation fault(coredump)
Programs failed: testall
make[1]: *** [check] Error 139
make[1]: Leaving directory `/data/prj/apr/apr-util-1.4.x/test'
make: *** [check] Error 2
root@x104:[/data/prj/apr/apr-util-1.4.x]

-- 
You are receiving this mail because:
You are the assignee for the bug.

---------------------------------------------------------------------
To unsubscribe, e-mail: bugs-unsubscribe@apr.apache.org
For additional commands, e-mail: bugs-help@apr.apache.org


Mime
View raw message