apr-bugs mailing list archives

Site index · List index
Message view « Date » · « Thread »
Top « Date » · « Thread »
From bugzi...@apache.org
Subject [Bug 53906] make check failures testsockets testime test_exp_get_lt
Date Wed, 19 Sep 2012 21:38:41 GMT
https://issues.apache.org/bugzilla/show_bug.cgi?id=53906

--- Comment #1 from Michael Felt <mamfelt@gmail.com> ---
same errors with 1.5.x
root@x104:[/data/prj/apr/apr-1.5.x/test]./testall -v testsock testsockets
testtime
testsock            : \Line 327: expected <0.0.0.0>, but saw <::ffff:0.0.0.0>
FAILED 1 of 9
testsockets         : -Line 135: Could not set multicast hops (22): Invalid
argument

|Line 180: Condition is false, but expected true
FAILED 1 of 7
testtime            : /Line 146: Condition is false, but expected true
FAILED 1 of 13
Failed Tests            Total   Fail    Failed %
===================================================
testsock                    9      1     11.11%
testsockets                 7      1     14.29%
testtime                   13      1      7.69%

-- 
You are receiving this mail because:
You are the assignee for the bug.

---------------------------------------------------------------------
To unsubscribe, e-mail: bugs-unsubscribe@apr.apache.org
For additional commands, e-mail: bugs-help@apr.apache.org


Mime
View raw message