any23-user mailing list archives

Site index · List index
Message view « Date » · « Thread »
Top « Date » · « Thread »
From Anuj Kumar <anujs...@gmail.com>
Subject Build failing due to aduna repository
Date Tue, 16 Apr 2013 16:25:33 GMT
Hi All,

Recently, any-23 build has started failing due to unavailability of aduna
repository (http://repo.aduna-software.org/). Has anyone else faced a
similar issue?

Please try removing your existing openrdf dependencies from local maven
repository (~/.m2/repository/org/openrdf/) and do a clean build.

My build environment details are-
Apache Maven 3.0.4
Maven home: /usr/share/maven
Java version: 1.6.0_38, vendor: Sun Microsystems Inc.
Java home: /usr/lib/jvm/jdk1.6.0_38/jre
Default locale: en_IN, platform encoding: UTF-8
OS name: "linux", version: "3.2.0-40-generic", arch: "amd64", family: "unix"

and here is the build log-

[INFO] Scanning for projects...
[WARNING]
[WARNING] Some problems were encountered while building the effective model
for org.apache.any23:apache-any23:pom:0.8.0-SNAPSHOT
[WARNING] 'parent.relativePath' points at org.apache.any23:apache-any23
instead of org.apache:apache, please verify your project structure @ line
21, column 11
[WARNING]
[WARNING] It is highly recommended to fix these problems because they
threaten the stability of your build.
[WARNING]
[WARNING] For this reason, future Maven versions might no longer support
building such malformed projects.
[WARNING]
[INFO]
------------------------------------------------------------------------
[INFO] Reactor Build Order:
[INFO]
[INFO] Apache Any23
[INFO] Apache Any23 :: Base API
[INFO] Apache Any23 :: Test Resources
[INFO] Apache Any23 :: NQuads Parser and Writer
[INFO] Apache Any23 :: CSV Utilities
[INFO] Apache Any23 :: Mime Type Detection
[INFO] Apache Any23 :: Encoding Detection
[INFO] Apache Any23 :: Core
[INFO] Apache Any23 :: Plugins :: Basic Crawler
[INFO] Apache Any23 :: Plugins :: HTML Scraper
[INFO] Apache Any23 :: Plugins :: Office Scraper
[INFO] Apache Any23 :: Plugins :: Integration Test
[INFO] Apache Any23 :: Service
[INFO]

[INFO]
------------------------------------------------------------------------
[INFO] Building Apache Any23 0.8.0-SNAPSHOT
[INFO]
------------------------------------------------------------------------
[INFO]
[INFO] --- buildnumber-maven-plugin:1.0:create (default) @ apache-any23 ---
[INFO] Checking for local modifications: skipped.
[INFO] Updating project files from SCM: skipped.
[INFO] Executing: /bin/sh -c cd
/home/anuj/Documents/tools/apache-any23-0.7.0-incubating-src/trunk && svn
--non-interactive info
[INFO] Working directory:
/home/anuj/Documents/tools/apache-any23-0.7.0-incubating-src/trunk
[INFO] Storing buildNumber: 1448890 at timestamp: 1366129032302
[INFO] Executing: /bin/sh -c cd
/home/anuj/Documents/tools/apache-any23-0.7.0-incubating-src/trunk && svn
--non-interactive info
[INFO] Working directory:
/home/anuj/Documents/tools/apache-any23-0.7.0-incubating-src/trunk
[INFO] Storing buildScmBranch: trunk
[INFO]
[INFO] --- buildnumber-maven-plugin:1.0:create (default) @ apache-any23 ---
[INFO] Checking for local modifications: skipped.
[INFO] Updating project files from SCM: skipped.
[INFO] Executing: /bin/sh -c cd
/home/anuj/Documents/tools/apache-any23-0.7.0-incubating-src/trunk && svn
--non-interactive info
[INFO] Working directory:
/home/anuj/Documents/tools/apache-any23-0.7.0-incubating-src/trunk
[INFO] Storing buildNumber: 1448890 at timestamp: 1366129032588
[INFO] Executing: /bin/sh -c cd
/home/anuj/Documents/tools/apache-any23-0.7.0-incubating-src/trunk && svn
--non-interactive info
[INFO] Working directory:
/home/anuj/Documents/tools/apache-any23-0.7.0-incubating-src/trunk
[INFO] Storing buildScmBranch: trunk
[INFO]
[INFO] --- maven-site-plugin:3.0:attach-descriptor (attach-descriptor) @
apache-any23 ---
[INFO]
[INFO] --- maven-assembly-plugin:2.3:single (assembly) @ apache-any23 ---
[INFO] Reading assembly descriptor:
/home/anuj/Documents/tools/apache-any23-0.7.0-incubating-src/trunk/src/main/assembly/src.xml
[INFO] Building tar:
/home/anuj/Documents/tools/apache-any23-0.7.0-incubating-src/trunk/target/apache-any23-0.8.0-SNAPSHOT-src.tar.gz
[INFO] Building zip:
/home/anuj/Documents/tools/apache-any23-0.7.0-incubating-src/trunk/target/apache-any23-0.8.0-SNAPSHOT-src.zip
[INFO]

[INFO]
------------------------------------------------------------------------
[INFO] Building Apache Any23 :: Base API 0.8.0-SNAPSHOT
[INFO]
------------------------------------------------------------------------
Downloading:
http://svn.apache.org/repos/asf/any23/repo-ext/org/slf4j/slf4j-api/1.6.6/slf4j-api-1.6.6.pom
Downloading:
http://repo.aduna-software.org/maven2/releases/org/slf4j/slf4j-api/1.6.6/slf4j-api-1.6.6.pom
[WARNING] Checksum validation failed, expected <!DOCTYPE but is
961990826dc9e04153c66549fd2c29f2b2f17d3a for
http://repo.aduna-software.org/maven2/releases/org/slf4j/slf4j-api/1.6.6/slf4j-api-1.6.6.pom
[WARNING] Checksum validation failed, expected <!DOCTYPE but is
961990826dc9e04153c66549fd2c29f2b2f17d3a for
http://repo.aduna-software.org/maven2/releases/org/slf4j/slf4j-api/1.6.6/slf4j-api-1.6.6.pom
Downloaded:
http://repo.aduna-software.org/maven2/releases/org/slf4j/slf4j-api/1.6.6/slf4j-api-1.6.6.pom(2
KB at 0.6 KB/sec)
[WARNING] The POM for org.slf4j:slf4j-api:jar:1.6.6 is invalid, transitive
dependencies (if any) will not be available, enable debug logging for more
details
Downloading:
http://svn.apache.org/repos/asf/any23/repo-ext/org/openrdf/sesame/sesame-model/2.6.9/sesame-model-2.6.9.pom
Downloading:
http://repo.aduna-software.org/maven2/releases/org/openrdf/sesame/sesame-model/2.6.9/sesame-model-2.6.9.pom
[WARNING] Checksum validation failed, expected <!DOCTYPE but is
0d7a5be25726bddd96eebfccbe75aeae0b1859fe for
http://repo.aduna-software.org/maven2/releases/org/openrdf/sesame/sesame-model/2.6.9/sesame-model-2.6.9.pom
[WARNING] Checksum validation failed, expected <!DOCTYPE but is
0d7a5be25726bddd96eebfccbe75aeae0b1859fe for
http://repo.aduna-software.org/maven2/releases/org/openrdf/sesame/sesame-model/2.6.9/sesame-model-2.6.9.pom
Downloaded:
http://repo.aduna-software.org/maven2/releases/org/openrdf/sesame/sesame-model/2.6.9/sesame-model-2.6.9.pom(2
KB at 0.6 KB/sec)
[WARNING] The POM for org.openrdf.sesame:sesame-model:jar:2.6.9 is invalid,
transitive dependencies (if any) will not be available, enable debug
logging for more details
Downloading:
http://svn.apache.org/repos/asf/any23/repo-ext/org/openrdf/sesame/sesame-rio-api/2.6.9/sesame-rio-api-2.6.9.pom
Downloading:
http://repo.aduna-software.org/maven2/releases/org/openrdf/sesame/sesame-rio-api/2.6.9/sesame-rio-api-2.6.9.pom
[WARNING] Checksum validation failed, expected <!DOCTYPE but is
e8704c2054bf3d9699c108c9eefad54697a9a71f for
http://repo.aduna-software.org/maven2/releases/org/openrdf/sesame/sesame-rio-api/2.6.9/sesame-rio-api-2.6.9.pom
[WARNING] Checksum validation failed, expected <!DOCTYPE but is
e8704c2054bf3d9699c108c9eefad54697a9a71f for
http://repo.aduna-software.org/maven2/releases/org/openrdf/sesame/sesame-rio-api/2.6.9/sesame-rio-api-2.6.9.pom
Downloaded:
http://repo.aduna-software.org/maven2/releases/org/openrdf/sesame/sesame-rio-api/2.6.9/sesame-rio-api-2.6.9.pom(2
KB at 0.7 KB/sec)
[WARNING] The POM for org.openrdf.sesame:sesame-rio-api:jar:2.6.9 is
invalid, transitive dependencies (if any) will not be available, enable
debug logging for more details
Downloading:
http://svn.apache.org/repos/asf/any23/repo-ext/org/slf4j/slf4j-api/1.6.6/slf4j-api-1.6.6.jar
Downloading:
http://svn.apache.org/repos/asf/any23/repo-ext/org/openrdf/sesame/sesame-model/2.6.9/sesame-model-2.6.9.jar
Downloading:
http://svn.apache.org/repos/asf/any23/repo-ext/org/openrdf/sesame/sesame-rio-api/2.6.9/sesame-rio-api-2.6.9.jar
Downloading:
http://repo.aduna-software.org/maven2/releases/org/slf4j/slf4j-api/1.6.6/slf4j-api-1.6.6.jar
Downloading:
http://repo.aduna-software.org/maven2/releases/org/openrdf/sesame/sesame-rio-api/2.6.9/sesame-rio-api-2.6.9.jar
Downloading:
http://repo.aduna-software.org/maven2/releases/org/openrdf/sesame/sesame-model/2.6.9/sesame-model-2.6.9.jar
[WARNING] Checksum validation failed, expected <!DOCTYPE but is
f2254da845fea92360cc89332b70b20ec374c494 for
http://repo.aduna-software.org/maven2/releases/org/slf4j/slf4j-api/1.6.6/slf4j-api-1.6.6.jar
[WARNING] Checksum validation failed, expected <!DOCTYPE but is
f718bd1763d607d08f716ca3301d0470510ebadc for
http://repo.aduna-software.org/maven2/releases/org/openrdf/sesame/sesame-rio-api/2.6.9/sesame-rio-api-2.6.9.jar
[WARNING] Checksum validation failed, expected <!DOCTYPE but is
2ca4dc7872b0743bcf36a532a44b4e44393d217a for
http://repo.aduna-software.org/maven2/releases/org/openrdf/sesame/sesame-model/2.6.9/sesame-model-2.6.9.jar
[WARNING] Checksum validation failed, expected <!DOCTYPE but is
2ca4dc7872b0743bcf36a532a44b4e44393d217a for
http://repo.aduna-software.org/maven2/releases/org/openrdf/sesame/sesame-model/2.6.9/sesame-model-2.6.9.jar
Downloaded:
http://repo.aduna-software.org/maven2/releases/org/openrdf/sesame/sesame-model/2.6.9/sesame-model-2.6.9.jar(2
KB at 0.7 KB/sec)
[WARNING] Checksum validation failed, expected <!DOCTYPE but is
f718bd1763d607d08f716ca3301d0470510ebadc for
http://repo.aduna-software.org/maven2/releases/org/openrdf/sesame/sesame-rio-api/2.6.9/sesame-rio-api-2.6.9.jar
Downloaded:
http://repo.aduna-software.org/maven2/releases/org/openrdf/sesame/sesame-rio-api/2.6.9/sesame-rio-api-2.6.9.jar(2
KB at 0.7 KB/sec)
[WARNING] Checksum validation failed, expected <!DOCTYPE but is
f2254da845fea92360cc89332b70b20ec374c494 for
http://repo.aduna-software.org/maven2/releases/org/slf4j/slf4j-api/1.6.6/slf4j-api-1.6.6.jar
Downloaded:
http://repo.aduna-software.org/maven2/releases/org/slf4j/slf4j-api/1.6.6/slf4j-api-1.6.6.jar(2
KB at 0.7 KB/sec)
[INFO]
[INFO] --- buildnumber-maven-plugin:1.0:create (default) @ apache-any23-api
---
[INFO] Checking for local modifications: skipped.
[INFO] Updating project files from SCM: skipped.
[INFO] Executing: /bin/sh -c cd
/home/anuj/Documents/tools/apache-any23-0.7.0-incubating-src/trunk/api &&
svn --non-interactive info
[INFO] Working directory:
/home/anuj/Documents/tools/apache-any23-0.7.0-incubating-src/trunk/api
[INFO] Storing buildNumber: 1448871 at timestamp: 1366129051702
[INFO] Executing: /bin/sh -c cd
/home/anuj/Documents/tools/apache-any23-0.7.0-incubating-src/trunk/api &&
svn --non-interactive info
[INFO] Working directory:
/home/anuj/Documents/tools/apache-any23-0.7.0-incubating-src/trunk/api
[INFO] Storing buildScmBranch: trunk
[INFO]
[INFO] --- maven-resources-plugin:2.5:resources (default-resources) @
apache-any23-api ---
[debug] execute contextualize
[INFO] Using 'UTF-8' encoding to copy filtered resources.
[INFO] Copying 1 resource
[INFO] Copying 2 resources to META-INF
[INFO]
[INFO] --- maven-compiler-plugin:2.5.1:compile (default-compile) @
apache-any23-api ---
[INFO] Compiling 66 source files to
/home/anuj/Documents/tools/apache-any23-0.7.0-incubating-src/trunk/api/target/classes
[INFO] -------------------------------------------------------------
[ERROR] COMPILATION ERROR :
[INFO] -------------------------------------------------------------
[ERROR] error: error reading
/home/anuj/.m2/repository/org/slf4j/slf4j-api/1.6.6/slf4j-api-1.6.6.jar;
error in opening zip file
[ERROR] error: error reading
/home/anuj/.m2/repository/org/openrdf/sesame/sesame-model/2.6.9/sesame-model-2.6.9.jar;
error in opening zip file
[ERROR] error: error reading
/home/anuj/.m2/repository/org/openrdf/sesame/sesame-rio-api/2.6.9/sesame-rio-api-2.6.9.jar;
error in opening zip file
[INFO] 3 errors
[INFO] -------------------------------------------------------------
[INFO]
------------------------------------------------------------------------
[INFO] Reactor Summary:
[INFO]
[INFO] Apache Any23 ...................................... SUCCESS [7.241s]
[INFO] Apache Any23 :: Base API .......................... FAILURE [13.736s]
[INFO] Apache Any23 :: Test Resources .................... SKIPPED
[INFO] Apache Any23 :: NQuads Parser and Writer .......... SKIPPED
[INFO] Apache Any23 :: CSV Utilities ..................... SKIPPED
[INFO] Apache Any23 :: Mime Type Detection ............... SKIPPED
[INFO] Apache Any23 :: Encoding Detection ................ SKIPPED
[INFO] Apache Any23 :: Core .............................. SKIPPED
[INFO] Apache Any23 :: Plugins :: Basic Crawler .......... SKIPPED
[INFO] Apache Any23 :: Plugins :: HTML Scraper ........... SKIPPED
[INFO] Apache Any23 :: Plugins :: Office Scraper ......... SKIPPED
[INFO] Apache Any23 :: Plugins :: Integration Test ....... SKIPPED
[INFO] Apache Any23 :: Service ........................... SKIPPED
[INFO]
------------------------------------------------------------------------
[INFO] BUILD FAILURE
[INFO]
------------------------------------------------------------------------
[INFO] Total time: 21.855s
[INFO] Finished at: Tue Apr 16 21:47:32 IST 2013
[INFO] Final Memory: 16M/288M
[INFO]
------------------------------------------------------------------------
[ERROR] Failed to execute goal
org.apache.maven.plugins:maven-compiler-plugin:2.5.1:compile
(default-compile) on project apache-any23-api: Compilation failure:
Compilation failure:
[ERROR] error: error reading
/home/anuj/.m2/repository/org/slf4j/slf4j-api/1.6.6/slf4j-api-1.6.6.jar;
error in opening zip file
[ERROR] error: error reading
/home/anuj/.m2/repository/org/openrdf/sesame/sesame-model/2.6.9/sesame-model-2.6.9.jar;
error in opening zip file
[ERROR] error: error reading
/home/anuj/.m2/repository/org/openrdf/sesame/sesame-rio-api/2.6.9/sesame-rio-api-2.6.9.jar;
error in opening zip file
[ERROR] -> [Help 1]
[ERROR]
[ERROR] To see the full stack trace of the errors, re-run Maven with the -e
switch.
[ERROR] Re-run Maven using the -X switch to enable full debug logging.
[ERROR]
[ERROR] For more information about the errors and possible solutions,
please read the following articles:
[ERROR] [Help 1]
http://cwiki.apache.org/confluence/display/MAVEN/MojoFailureException
[ERROR]
[ERROR] After correcting the problems, you can resume the build with the
command
[ERROR]   mvn <goals> -rf :apache-any23-api

How can we solve this issue?

Thanks,
Anuj

Mime
View raw message