any23-dev mailing list archives

Site index · List index
Message view « Date » · « Thread »
Top « Date » · « Thread »
From Apache Jenkins Server <jenk...@builds.apache.org>
Subject Build failed in Jenkins: Any23-trunk #1516
Date Sat, 30 Dec 2017 17:27:49 GMT
See <https://builds.apache.org/job/Any23-trunk/1516/display/redirect?page=changes>

Changes:

[lewis.mcgibbney] ANY23-140 - Revise Any23 tests to remove fetching of web content

[lewis.mcgibbney] Update README.md with badges

[lewis.mcgibbney] Move LICENSE.txt to LICENSE.md

------------------------------------------
[...truncated 851.80 KB...]
[INFO] Including org.itadaki:bzip2:jar:0.9.1 in the shaded jar.
[INFO] Including edu.ucar:cdm:jar:4.5.5 in the shaded jar.
[INFO] Including edu.ucar:udunits:jar:4.5.5 in the shaded jar.
[INFO] Including joda-time:joda-time:jar:2.2 in the shaded jar.
[INFO] Including org.quartz-scheduler:quartz:jar:2.2.0 in the shaded jar.
[INFO] Including c3p0:c3p0:jar:0.9.1.1 in the shaded jar.
[INFO] Including net.sf.ehcache:ehcache-core:jar:2.6.2 in the shaded jar.
[INFO] Including edu.ucar:httpservices:jar:4.5.5 in the shaded jar.
[INFO] Including org.apache.httpcomponents:httpmime:jar:4.5.3 in the shaded jar.
[INFO] Including org.apache.sis.core:sis-utility:jar:0.6 in the shaded jar.
[INFO] Including org.apache.sis.storage:sis-netcdf:jar:0.6 in the shaded jar.
[INFO] Including org.apache.sis.storage:sis-storage:jar:0.6 in the shaded jar.
[INFO] Including org.apache.sis.core:sis-referencing:jar:0.6 in the shaded jar.
[INFO] Including org.apache.sis.core:sis-metadata:jar:0.6 in the shaded jar.
[INFO] Including org.opengis:geoapi:jar:3.0.0 in the shaded jar.
[INFO] Including javax.measure:jsr-275:jar:0.9.3 in the shaded jar.
[INFO] Including edu.usc.ir:sentiment-analysis-parser:jar:0.1 in the shaded jar.
[INFO] Including org.apache.tika:tika-langdetect:jar:1.13 in the shaded jar.
[INFO] Including com.optimaize.languagedetector:language-detector:jar:0.5 in the shaded jar.
[INFO] Including net.arnx:jsonic:jar:1.2.11 in the shaded jar.
[INFO] Including com.intellij:annotations:jar:12.0 in the shaded jar.
[INFO] Including com.fasterxml.jackson.core:jackson-core:jar:2.8.1 in the shaded jar.
[INFO] Including org.apache.commons:commons-compress:jar:1.13 in the shaded jar.
[INFO] Including org.apache.commons:commons-csv:jar:1.0-SNAPSHOT-rev1148315 in the shaded
jar.
[INFO] Including edu.uci.ics:crawler4j:jar:3.4 in the shaded jar.
[INFO] Including log4j:log4j:jar:1.2.14 in the shaded jar.
[INFO] Including commons-logging:commons-logging:jar:1.1.1 in the shaded jar.
[INFO] Including org.apache.httpcomponents:httpclient:jar:4.5.3 in the shaded jar.
[INFO] Including org.apache.httpcomponents:httpcore:jar:4.4.6 in the shaded jar.
[INFO] Including com.sleepycat:je:jar:4.0.92 in the shaded jar.
[INFO] Including org.slf4j:slf4j-api:jar:1.7.25 in the shaded jar.
[WARNING] commons-logging-1.1.1.jar, jcl-over-slf4j-1.7.25.jar define 6 overlapping classes:

[WARNING]   - org.apache.commons.logging.impl.SimpleLog$1
[WARNING]   - org.apache.commons.logging.Log
[WARNING]   - org.apache.commons.logging.impl.SimpleLog
[WARNING]   - org.apache.commons.logging.LogConfigurationException
[WARNING]   - org.apache.commons.logging.impl.NoOpLog
[WARNING]   - org.apache.commons.logging.LogFactory
[WARNING] tika-parsers-1.15.jar, sentiment-analysis-parser-0.1.jar define 1 overlapping classes:

[WARNING]   - org.apache.tika.parser.sentiment.analysis.SentimentParser
[WARNING] maven-shade-plugin has detected that some class files are
[WARNING] present in two or more JARs. When this happens, only one
[WARNING] single version of the class is copied to the uber jar.
[WARNING] Usually this is not harmful and you can skip these warnings,
[WARNING] otherwise try to manually exclude artifacts based on
[WARNING] mvn dependency:tree -Ddetail=true and the above output.
[WARNING] See http://maven.apache.org/plugins/maven-shade-plugin/
[INFO] Replacing <https://builds.apache.org/job/Any23-trunk/ws/plugins/basic-crawler/target/apache-any23-basic-crawler-uber-2.2-SNAPSHOT.jar>
with <https://builds.apache.org/job/Any23-trunk/ws/plugins/basic-crawler/target/apache-any23-basic-crawler-2.2-SNAPSHOT-shaded.jar>
[INFO] 
[INFO] --- maven-install-plugin:2.5.2:install (default-install) @ apache-any23-basic-crawler
---
[INFO] Installing <https://builds.apache.org/job/Any23-trunk/ws/plugins/basic-crawler/target/apache-any23-basic-crawler-2.2-SNAPSHOT.jar>
to /home/jenkins/jenkins-slave/maven-repositories/1/org/apache/any23/plugins/apache-any23-basic-crawler/2.2-SNAPSHOT/apache-any23-basic-crawler-2.2-SNAPSHOT.jar
[INFO] Installing <https://builds.apache.org/job/Any23-trunk/ws/plugins/basic-crawler/pom.xml>
to /home/jenkins/jenkins-slave/maven-repositories/1/org/apache/any23/plugins/apache-any23-basic-crawler/2.2-SNAPSHOT/apache-any23-basic-crawler-2.2-SNAPSHOT.pom
[INFO] Installing <https://builds.apache.org/job/Any23-trunk/ws/plugins/basic-crawler/target/apache-any23-basic-crawler-2.2-SNAPSHOT.tar.gz>
to /home/jenkins/jenkins-slave/maven-repositories/1/org/apache/any23/plugins/apache-any23-basic-crawler/2.2-SNAPSHOT/apache-any23-basic-crawler-2.2-SNAPSHOT.tar.gz
[INFO] Installing <https://builds.apache.org/job/Any23-trunk/ws/plugins/basic-crawler/target/apache-any23-basic-crawler-2.2-SNAPSHOT.zip>
to /home/jenkins/jenkins-slave/maven-repositories/1/org/apache/any23/plugins/apache-any23-basic-crawler/2.2-SNAPSHOT/apache-any23-basic-crawler-2.2-SNAPSHOT.zip
[INFO] Installing <https://builds.apache.org/job/Any23-trunk/ws/plugins/basic-crawler/target/apache-any23-basic-crawler-2.2-SNAPSHOT-tests.jar>
to /home/jenkins/jenkins-slave/maven-repositories/1/org/apache/any23/plugins/apache-any23-basic-crawler/2.2-SNAPSHOT/apache-any23-basic-crawler-2.2-SNAPSHOT-tests.jar
[INFO] 
[INFO] --- maven-deploy-plugin:2.8.2:deploy (default-deploy) @ apache-any23-basic-crawler
---
[INFO] Downloading from apache.snapshots.https: https://repository.apache.org/content/repositories/snapshots/org/apache/any23/plugins/apache-any23-basic-crawler/2.2-SNAPSHOT/maven-metadata.xml
[INFO] Downloaded from apache.snapshots.https: https://repository.apache.org/content/repositories/snapshots/org/apache/any23/plugins/apache-any23-basic-crawler/2.2-SNAPSHOT/maven-metadata.xml
(1.4 kB at 2.4 kB/s)
[INFO] Uploading to apache.snapshots.https: https://repository.apache.org/content/repositories/snapshots/org/apache/any23/plugins/apache-any23-basic-crawler/2.2-SNAPSHOT/apache-any23-basic-crawler-2.2-20171230.172553-14.jar
[INFO] Uploaded to apache.snapshots.https: https://repository.apache.org/content/repositories/snapshots/org/apache/any23/plugins/apache-any23-basic-crawler/2.2-SNAPSHOT/apache-any23-basic-crawler-2.2-20171230.172553-14.jar
(16 kB at 14 kB/s)
[INFO] Uploading to apache.snapshots.https: https://repository.apache.org/content/repositories/snapshots/org/apache/any23/plugins/apache-any23-basic-crawler/2.2-SNAPSHOT/apache-any23-basic-crawler-2.2-20171230.172553-14.pom
[INFO] Uploaded to apache.snapshots.https: https://repository.apache.org/content/repositories/snapshots/org/apache/any23/plugins/apache-any23-basic-crawler/2.2-SNAPSHOT/apache-any23-basic-crawler-2.2-20171230.172553-14.pom
(6.2 kB at 5.7 kB/s)
[INFO] Downloading from apache.snapshots.https: https://repository.apache.org/content/repositories/snapshots/org/apache/any23/plugins/apache-any23-basic-crawler/maven-metadata.xml
[INFO] Downloaded from apache.snapshots.https: https://repository.apache.org/content/repositories/snapshots/org/apache/any23/plugins/apache-any23-basic-crawler/maven-metadata.xml
(497 B at 900 B/s)
[INFO] Uploading to apache.snapshots.https: https://repository.apache.org/content/repositories/snapshots/org/apache/any23/plugins/apache-any23-basic-crawler/2.2-SNAPSHOT/maven-metadata.xml
[INFO] Uploaded to apache.snapshots.https: https://repository.apache.org/content/repositories/snapshots/org/apache/any23/plugins/apache-any23-basic-crawler/2.2-SNAPSHOT/maven-metadata.xml
(1.4 kB at 1.2 kB/s)
[INFO] Uploading to apache.snapshots.https: https://repository.apache.org/content/repositories/snapshots/org/apache/any23/plugins/apache-any23-basic-crawler/maven-metadata.xml
[INFO] Uploaded to apache.snapshots.https: https://repository.apache.org/content/repositories/snapshots/org/apache/any23/plugins/apache-any23-basic-crawler/maven-metadata.xml
(497 B at 451 B/s)
[INFO] Uploading to apache.snapshots.https: https://repository.apache.org/content/repositories/snapshots/org/apache/any23/plugins/apache-any23-basic-crawler/2.2-SNAPSHOT/apache-any23-basic-crawler-2.2-20171230.172553-14.tar.gz
[INFO] Uploaded to apache.snapshots.https: https://repository.apache.org/content/repositories/snapshots/org/apache/any23/plugins/apache-any23-basic-crawler/2.2-SNAPSHOT/apache-any23-basic-crawler-2.2-20171230.172553-14.tar.gz
(3.1 MB at 1.7 MB/s)
[INFO] Uploading to apache.snapshots.https: https://repository.apache.org/content/repositories/snapshots/org/apache/any23/plugins/apache-any23-basic-crawler/2.2-SNAPSHOT/maven-metadata.xml
[INFO] Uploaded to apache.snapshots.https: https://repository.apache.org/content/repositories/snapshots/org/apache/any23/plugins/apache-any23-basic-crawler/2.2-SNAPSHOT/maven-metadata.xml
(1.4 kB at 1.2 kB/s)
[INFO] Uploading to apache.snapshots.https: https://repository.apache.org/content/repositories/snapshots/org/apache/any23/plugins/apache-any23-basic-crawler/2.2-SNAPSHOT/apache-any23-basic-crawler-2.2-20171230.172553-14.zip
[INFO] Uploaded to apache.snapshots.https: https://repository.apache.org/content/repositories/snapshots/org/apache/any23/plugins/apache-any23-basic-crawler/2.2-SNAPSHOT/apache-any23-basic-crawler-2.2-20171230.172553-14.zip
(3.1 MB at 1.7 MB/s)
[INFO] Uploading to apache.snapshots.https: https://repository.apache.org/content/repositories/snapshots/org/apache/any23/plugins/apache-any23-basic-crawler/2.2-SNAPSHOT/maven-metadata.xml
[INFO] Uploaded to apache.snapshots.https: https://repository.apache.org/content/repositories/snapshots/org/apache/any23/plugins/apache-any23-basic-crawler/2.2-SNAPSHOT/maven-metadata.xml
(1.4 kB at 1.2 kB/s)
[INFO] Uploading to apache.snapshots.https: https://repository.apache.org/content/repositories/snapshots/org/apache/any23/plugins/apache-any23-basic-crawler/2.2-SNAPSHOT/apache-any23-basic-crawler-2.2-20171230.172553-14-tests.jar
[INFO] Uploaded to apache.snapshots.https: https://repository.apache.org/content/repositories/snapshots/org/apache/any23/plugins/apache-any23-basic-crawler/2.2-SNAPSHOT/apache-any23-basic-crawler-2.2-20171230.172553-14-tests.jar
(10 kB at 9.2 kB/s)
[INFO] Uploading to apache.snapshots.https: https://repository.apache.org/content/repositories/snapshots/org/apache/any23/plugins/apache-any23-basic-crawler/2.2-SNAPSHOT/maven-metadata.xml
[INFO] Uploaded to apache.snapshots.https: https://repository.apache.org/content/repositories/snapshots/org/apache/any23/plugins/apache-any23-basic-crawler/2.2-SNAPSHOT/maven-metadata.xml
(1.4 kB at 1.2 kB/s)
[INFO] 
[INFO] ------------------------------------------------------------------------
[INFO] Building Apache Any23 :: Plugins :: Integration Test 2.2-SNAPSHOT
[INFO] ------------------------------------------------------------------------
[INFO] 
[INFO] --- maven-clean-plugin:3.0.0:clean (default-clean) @ apache-any23-integration-test
---
[INFO] Deleting <https://builds.apache.org/job/Any23-trunk/ws/plugins/integration-test/target>
[INFO] 
[INFO] --- buildnumber-maven-plugin:1.4:create (default) @ apache-any23-integration-test ---
[INFO] Executing: /bin/sh -c cd '<https://builds.apache.org/job/Any23-trunk/ws/plugins/integration-test'>
&& 'git' 'rev-parse' '--verify' 'HEAD'
[INFO] Working directory: <https://builds.apache.org/job/Any23-trunk/ws/plugins/integration-test>
[INFO] Storing buildNumber: ddda9bc395ebe082194eff4ceffbd72769d4eb36 at timestamp: 1514654768412
[WARNING] Cannot get the branch information from the git repository: 
Detecting the current branch failed: fatal: ref HEAD is not a symbolic ref

[INFO] Executing: /bin/sh -c cd '<https://builds.apache.org/job/Any23-trunk/ws/plugins/integration-test'>
&& 'git' 'rev-parse' '--verify' 'HEAD'
[INFO] Working directory: <https://builds.apache.org/job/Any23-trunk/ws/plugins/integration-test>
[INFO] Storing buildScmBranch: UNKNOWN
[INFO] 
[INFO] --- jacoco-maven-plugin:0.7.9:prepare-agent (prepare-agent) @ apache-any23-integration-test
---
[INFO] argLine set to -javaagent:/home/jenkins/jenkins-slave/maven-repositories/1/org/jacoco/org.jacoco.agent/0.7.9/org.jacoco.agent-0.7.9-runtime.jar=destfile=<https://builds.apache.org/job/Any23-trunk/ws/plugins/integration-test/target/jacoco.exec>
[INFO] 
[INFO] --- maven-resources-plugin:3.0.2:resources (default-resources) @ apache-any23-integration-test
---
[INFO] Using 'UTF-8' encoding to copy filtered resources.
[INFO] skip non existing resourceDirectory <https://builds.apache.org/job/Any23-trunk/ws/plugins/integration-test/src/main/resources>
[INFO] 
[INFO] --- maven-compiler-plugin:3.6.1:compile (default-compile) @ apache-any23-integration-test
---
[INFO] No sources to compile
[INFO] 
[INFO] --- maven-resources-plugin:3.0.2:testResources (default-testResources) @ apache-any23-integration-test
---
[INFO] Using 'UTF-8' encoding to copy filtered resources.
[INFO] Copying 1 resource
[INFO] 
[INFO] --- maven-compiler-plugin:3.6.1:testCompile (default-testCompile) @ apache-any23-integration-test
---
[INFO] Changes detected - recompiling the module!
[INFO] Compiling 1 source file to <https://builds.apache.org/job/Any23-trunk/ws/plugins/integration-test/target/test-classes>
[INFO] 
[INFO] --- maven-surefire-plugin:2.20:test (default-test) @ apache-any23-integration-test
---
[JENKINS] Recording test results
[INFO] 
[INFO] --- maven-jar-plugin:3.0.2:jar (default-jar) @ apache-any23-integration-test ---
[WARNING] JAR will be empty - no content was marked for inclusion!
[INFO] Building jar: <https://builds.apache.org/job/Any23-trunk/ws/plugins/integration-test/target/apache-any23-integration-test-2.2-SNAPSHOT.jar>
[INFO] 
[INFO] --- maven-site-plugin:3.0:attach-descriptor (attach-descriptor) @ apache-any23-integration-test
---
[INFO] 
[INFO] --- maven-assembly-plugin:3.0.0:single (assembly) @ apache-any23-integration-test ---
[INFO] Assemblies have been skipped per configuration of the skipAssembly parameter.
[INFO] 
[INFO] --- maven-invoker-plugin:1.5:run (default) @ apache-any23-integration-test ---
[INFO] Building: html-scraper/pom.xml
[INFO] ..SUCCESS (7.6 s)
[INFO] Building: basic-crawler/pom.xml
[INFO] ..FAILED (33.6 s)
[INFO]   The build exited with code 1. See <https://builds.apache.org/job/Any23-trunk/ws/plugins/integration-test/target/plugins-build/basic-crawler/build.log>
for details.
[INFO] Building: office-scraper/pom.xml
[INFO] ..SUCCESS (8.1 s)
[INFO] -------------------------------------------------
[INFO] Build Summary:
[INFO]   Passed: 2, Failed: 1, Errors: 0, Skipped: 0
[INFO] -------------------------------------------------
[ERROR] The following builds failed:
[ERROR] *  basic-crawler/pom.xml
[INFO] -------------------------------------------------
MavenInvokerArchiver
found reports:[<https://builds.apache.org/job/Any23-trunk/ws/plugins/integration-test/target/invoker-reports/BUILD-office-scraper.xml,>
<https://builds.apache.org/job/Any23-trunk/ws/plugins/integration-test/target/invoker-reports/BUILD-html-scraper.xml,>
<https://builds.apache.org/job/Any23-trunk/ws/plugins/integration-test/target/invoker-reports/BUILD-basic-crawler.xml]>
Finished parsing Maven Invoker results
[INFO] 
[INFO] ------------------------------------------------------------------------
[INFO] Skipping Apache Any23
[INFO] This project has been banned from the build due to previous failures.
[INFO] ------------------------------------------------------------------------
[INFO] ------------------------------------------------------------------------
[INFO] Reactor Summary:
[INFO] 
[INFO] Apache Any23 ....................................... SUCCESS [ 16.316 s]
[INFO] Apache Any23 :: Base API ........................... SUCCESS [  8.432 s]
[INFO] Apache Any23 :: Test Resources ..................... SUCCESS [  9.423 s]
[INFO] Apache Any23 :: CSV Utilities ...................... SUCCESS [  6.484 s]
[INFO] Apache Any23 :: Mime Type Detection ................ SUCCESS [ 16.469 s]
[INFO] Apache Any23 :: Encoding Detection ................. SUCCESS [  7.665 s]
[INFO] Apache Any23 :: Core ............................... SUCCESS [ 26.477 s]
[INFO] Apache Any23 :: Plugins :: Office Scraper .......... SUCCESS [ 17.109 s]
[INFO] Apache Any23 :: Plugins :: HTML Scraper ............ SUCCESS [ 14.031 s]
[INFO] Apache Any23 :: CLI ................................ SUCCESS [ 36.107 s]
[INFO] Apache Any23 :: OpenIE ............................. SUCCESS [ 13.997 s]
[INFO] Apache Any23 :: Plugins :: Basic Crawler ........... SUCCESS [ 53.801 s]
[INFO] Apache Any23 :: Plugins :: Integration Test ........ FAILURE [ 51.900 s]
[INFO] Apache Any23 :: Service ............................ SKIPPED
[INFO] ------------------------------------------------------------------------
[INFO] BUILD FAILURE
[INFO] ------------------------------------------------------------------------
[INFO] Total time: 04:53 min
[INFO] Finished at: 2017-12-30T17:27:05Z
[INFO] Final Memory: 85M/835M
[INFO] ------------------------------------------------------------------------
Waiting for Jenkins to finish collecting data
[ERROR] Failed to execute goal org.apache.maven.plugins:maven-invoker-plugin:1.5:run (default)
on project apache-any23-integration-test: 1 build failed. -> [Help 1]
[ERROR] 
[ERROR] To see the full stack trace of the errors, re-run Maven with the -e switch.
[ERROR] Re-run Maven using the -X switch to enable full debug logging.
[ERROR] 
[ERROR] For more information about the errors and possible solutions, please read the following
articles:
[ERROR] [Help 1] http://cwiki.apache.org/confluence/display/MAVEN/MojoFailureException
[ERROR] 
[ERROR] After correcting the problems, you can resume the build with the command
[ERROR]   mvn <goals> -rf :apache-any23-integration-test
[JENKINS] Archiving <https://builds.apache.org/job/Any23-trunk/ws/core/pom.xml> to org.apache.any23/apache-any23-core/2.2-SNAPSHOT/apache-any23-core-2.2-SNAPSHOT.pom
[JENKINS] Archiving <https://builds.apache.org/job/Any23-trunk/ws/core/target/apache-any23-core-2.2-SNAPSHOT.jar>
to org.apache.any23/apache-any23-core/2.2-20171230.172340-14/apache-any23-core-2.2-20171230.172340-14.jar
[JENKINS] Archiving <https://builds.apache.org/job/Any23-trunk/ws/core/target/apache-any23-core-2.2-SNAPSHOT-tests.jar>
to org.apache.any23/apache-any23-core/2.2-20171230.172340-14/apache-any23-core-2.2-20171230.172340-14-tests.jar
[JENKINS] Archiving <https://builds.apache.org/job/Any23-trunk/ws/openie/pom.xml> to
org.apache.any23/apache-any23-openie/2.2-SNAPSHOT/apache-any23-openie-2.2-SNAPSHOT.pom
[JENKINS] Archiving <https://builds.apache.org/job/Any23-trunk/ws/openie/target/apache-any23-openie-2.2-SNAPSHOT.jar>
to org.apache.any23/apache-any23-openie/2.2-20171230.172507-14/apache-any23-openie-2.2-20171230.172507-14.jar
[JENKINS] Archiving <https://builds.apache.org/job/Any23-trunk/ws/plugins/html-scraper/pom.xml>
to org.apache.any23.plugins/apache-any23-html-scraper/2.2-SNAPSHOT/apache-any23-html-scraper-2.2-SNAPSHOT.pom
[JENKINS] Archiving <https://builds.apache.org/job/Any23-trunk/ws/plugins/html-scraper/target/apache-any23-html-scraper-2.2-SNAPSHOT.jar>
to org.apache.any23.plugins/apache-any23-html-scraper/2.2-20171230.172410-14/apache-any23-html-scraper-2.2-20171230.172410-14.jar
[JENKINS] Archiving <https://builds.apache.org/job/Any23-trunk/ws/plugins/html-scraper/target/apache-any23-html-scraper-2.2-SNAPSHOT.tar.gz>
to org.apache.any23.plugins/apache-any23-html-scraper/2.2-20171230.172410-14/apache-any23-html-scraper-2.2-20171230.172410-14.tar.gz
[JENKINS] Archiving <https://builds.apache.org/job/Any23-trunk/ws/plugins/html-scraper/target/apache-any23-html-scraper-2.2-SNAPSHOT.zip>
to org.apache.any23.plugins/apache-any23-html-scraper/2.2-20171230.172410-14/apache-any23-html-scraper-2.2-20171230.172410-14.zip
[Fast Archiver] Compressed 209.14 KB of artifacts by 15.3% relative to #1515
[JENKINS] Archiving <https://builds.apache.org/job/Any23-trunk/ws/test-resources/pom.xml>
to org.apache.any23/apache-any23-test-resources/2.2-SNAPSHOT/apache-any23-test-resources-2.2-SNAPSHOT.pom
[JENKINS] Archiving <https://builds.apache.org/job/Any23-trunk/ws/test-resources/target/apache-any23-test-resources-2.2-SNAPSHOT.jar>
to org.apache.any23/apache-any23-test-resources/2.2-20171230.172240-14/apache-any23-test-resources-2.2-20171230.172240-14.jar
[JENKINS] Archiving <https://builds.apache.org/job/Any23-trunk/ws/test-resources/target/apache-any23-test-resources-2.2-SNAPSHOT-tests.jar>
to org.apache.any23/apache-any23-test-resources/2.2-20171230.172240-14/apache-any23-test-resources-2.2-20171230.172240-14-tests.jar
[Fast Archiver] Compressed 883.20 KB of artifacts by 14.5% relative to #1515
[JENKINS] Archiving <https://builds.apache.org/job/Any23-trunk/ws/csvutils/pom.xml>
to org.apache.any23/apache-any23-csvutils/2.2-SNAPSHOT/apache-any23-csvutils-2.2-SNAPSHOT.pom
[JENKINS] Archiving <https://builds.apache.org/job/Any23-trunk/ws/csvutils/target/apache-any23-csvutils-2.2-SNAPSHOT.jar>
to org.apache.any23/apache-any23-csvutils/2.2-20171230.172250-14/apache-any23-csvutils-2.2-20171230.172250-14.jar
[JENKINS] Archiving <https://builds.apache.org/job/Any23-trunk/ws/plugins/office-scraper/pom.xml>
to org.apache.any23.plugins/apache-any23-office-scraper/2.2-SNAPSHOT/apache-any23-office-scraper-2.2-SNAPSHOT.pom
[JENKINS] Archiving <https://builds.apache.org/job/Any23-trunk/ws/plugins/office-scraper/target/apache-any23-office-scraper-2.2-SNAPSHOT.jar>
to org.apache.any23.plugins/apache-any23-office-scraper/2.2-20171230.172354-14/apache-any23-office-scraper-2.2-20171230.172354-14.jar
[JENKINS] Archiving <https://builds.apache.org/job/Any23-trunk/ws/plugins/office-scraper/target/apache-any23-office-scraper-2.2-SNAPSHOT.tar.gz>
to org.apache.any23.plugins/apache-any23-office-scraper/2.2-20171230.172354-14/apache-any23-office-scraper-2.2-20171230.172354-14.tar.gz
[JENKINS] Archiving <https://builds.apache.org/job/Any23-trunk/ws/plugins/office-scraper/target/apache-any23-office-scraper-2.2-SNAPSHOT.zip>
to org.apache.any23.plugins/apache-any23-office-scraper/2.2-20171230.172354-14/apache-any23-office-scraper-2.2-20171230.172354-14.zip
[Fast Archiver] Compressed 4.71 MB of artifacts by 49.1% relative to #1515
[JENKINS] Archiving <https://builds.apache.org/job/Any23-trunk/ws/encoding/pom.xml>
to org.apache.any23/apache-any23-encoding/2.2-SNAPSHOT/apache-any23-encoding-2.2-SNAPSHOT.pom
[JENKINS] Archiving <https://builds.apache.org/job/Any23-trunk/ws/encoding/target/apache-any23-encoding-2.2-SNAPSHOT.jar>
to org.apache.any23/apache-any23-encoding/2.2-20171230.172315-14/apache-any23-encoding-2.2-20171230.172315-14.jar
[JENKINS] Archiving <https://builds.apache.org/job/Any23-trunk/ws/plugins/basic-crawler/pom.xml>
to org.apache.any23.plugins/apache-any23-basic-crawler/2.2-SNAPSHOT/apache-any23-basic-crawler-2.2-SNAPSHOT.pom
[JENKINS] Archiving <https://builds.apache.org/job/Any23-trunk/ws/plugins/basic-crawler/target/apache-any23-basic-crawler-2.2-SNAPSHOT.jar>
to org.apache.any23.plugins/apache-any23-basic-crawler/2.2-20171230.172553-14/apache-any23-basic-crawler-2.2-20171230.172553-14.jar
[JENKINS] Archiving <https://builds.apache.org/job/Any23-trunk/ws/plugins/basic-crawler/target/apache-any23-basic-crawler-2.2-SNAPSHOT.tar.gz>
to org.apache.any23.plugins/apache-any23-basic-crawler/2.2-20171230.172553-14/apache-any23-basic-crawler-2.2-20171230.172553-14.tar.gz
[JENKINS] Archiving <https://builds.apache.org/job/Any23-trunk/ws/plugins/basic-crawler/target/apache-any23-basic-crawler-2.2-SNAPSHOT.zip>
to org.apache.any23.plugins/apache-any23-basic-crawler/2.2-20171230.172553-14/apache-any23-basic-crawler-2.2-20171230.172553-14.zip
[JENKINS] Archiving <https://builds.apache.org/job/Any23-trunk/ws/plugins/basic-crawler/target/apache-any23-basic-crawler-2.2-SNAPSHOT-tests.jar>
to org.apache.any23.plugins/apache-any23-basic-crawler/2.2-20171230.172553-14/apache-any23-basic-crawler-2.2-20171230.172553-14-tests.jar
[Fast Archiver] Compressed 5.99 MB of artifacts by 86.1% relative to #1515
[JENKINS] Archiving <https://builds.apache.org/job/Any23-trunk/ws/pom.xml> to org.apache.any23/apache-any23/2.2-SNAPSHOT/apache-any23-2.2-SNAPSHOT.pom
[JENKINS] Archiving <https://builds.apache.org/job/Any23-trunk/ws/target/apache-any23-2.2-SNAPSHOT-site.xml>
to org.apache.any23/apache-any23/2.2-20171230.172216-19/apache-any23-2.2-20171230.172216-19-site.xml
[JENKINS] Archiving <https://builds.apache.org/job/Any23-trunk/ws/target/apache-any23-2.2-SNAPSHOT-src.tar.gz>
to org.apache.any23/apache-any23/2.2-20171230.172216-19/apache-any23-2.2-20171230.172216-19-src.tar.gz
[JENKINS] Archiving <https://builds.apache.org/job/Any23-trunk/ws/target/apache-any23-2.2-SNAPSHOT-src.zip>
to org.apache.any23/apache-any23/2.2-20171230.172216-19/apache-any23-2.2-20171230.172216-19-src.zip
[Fast Archiver] Compressed 3.69 MB of artifacts by 14.4% relative to #1515
[JENKINS] Archiving <https://builds.apache.org/job/Any23-trunk/ws/cli/pom.xml> to org.apache.any23/apache-any23-cli/2.2-SNAPSHOT/apache-any23-cli-2.2-SNAPSHOT.pom
[JENKINS] Archiving <https://builds.apache.org/job/Any23-trunk/ws/cli/target/apache-any23-cli-2.2-SNAPSHOT.jar>
to org.apache.any23/apache-any23-cli/2.2-20171230.172438-14/apache-any23-cli-2.2-20171230.172438-14.jar
[JENKINS] Archiving <https://builds.apache.org/job/Any23-trunk/ws/cli/target/apache-any23-cli-2.2-SNAPSHOT.tar.gz>
to org.apache.any23/apache-any23-cli/2.2-20171230.172438-14/apache-any23-cli-2.2-20171230.172438-14.tar.gz
[JENKINS] Archiving <https://builds.apache.org/job/Any23-trunk/ws/cli/target/apache-any23-cli-2.2-SNAPSHOT.zip>
to org.apache.any23/apache-any23-cli/2.2-20171230.172438-14/apache-any23-cli-2.2-20171230.172438-14.zip
[JENKINS] Archiving <https://builds.apache.org/job/Any23-trunk/ws/cli/target/apache-any23-cli-2.2-SNAPSHOT-tests.jar>
to org.apache.any23/apache-any23-cli/2.2-20171230.172438-14/apache-any23-cli-2.2-20171230.172438-14-tests.jar
ERROR: Failed to archive {org.apache.any23/apache-any23-cli/2.2-SNAPSHOT/apache-any23-cli-2.2-SNAPSHOT.pom=pom.xml,
org.apache.any23/apache-any23-cli/2.2-20171230.172438-14/apache-any23-cli-2.2-20171230.172438-14.jar=target/apache-any23-cli-2.2-SNAPSHOT.jar,
org.apache.any23/apache-any23-cli/2.2-20171230.172438-14/apache-any23-cli-2.2-20171230.172438-14.tar.gz=target/apache-any23-cli-2.2-SNAPSHOT.tar.gz,
org.apache.any23/apache-any23-cli/2.2-20171230.172438-14/apache-any23-cli-2.2-20171230.172438-14.zip=target/apache-any23-cli-2.2-SNAPSHOT.zip,
org.apache.any23/apache-any23-cli/2.2-20171230.172438-14/apache-any23-cli-2.2-20171230.172438-14-tests.jar=target/apache-any23-cli-2.2-SNAPSHOT-tests.jar}
due to internal error; falling back to full archiving
java.lang.IllegalStateException: checksum mismatch after transfer (1877334881 vs. 4016429921);
/x1/jenkins/jenkins-home/jobs/Any23-trunk/modules/org.apache.any23$apache-any23-cli/builds/1516/archive/org.apache.any23/apache-any23-cli/2.2-20171230.172438-14/apache-any23-cli-2.2-20171230.172438-14.tar.gz
may be corrupted
	at jsync.protocol.FileSequenceReader.read(FileSequenceReader.java:45)
	at com.cloudbees.jenkins.plugins.jsync.archiver.JSyncArtifactManager.remoteSync(JSyncArtifactManager.java:158)
	at com.cloudbees.jenkins.plugins.jsync.archiver.JSyncArtifactManager.archive(JSyncArtifactManager.java:76)
	at hudson.maven.MavenBuild$ProxyImpl.performArchiving(MavenBuild.java:512)
	at hudson.maven.MavenModuleSetBuild$MavenModuleSetBuildExecution.doRun(MavenModuleSetBuild.java:881)
	at hudson.model.AbstractBuild$AbstractBuildExecution.run(AbstractBuild.java:504)
	at hudson.model.Run.execute(Run.java:1724)
	at hudson.maven.MavenModuleSetBuild.run(MavenModuleSetBuild.java:543)
	at hudson.model.ResourceController.execute(ResourceController.java:97)
	at hudson.model.Executor.run(Executor.java:421)
[JENKINS] Archiving <https://builds.apache.org/job/Any23-trunk/ws/mime/pom.xml> to org.apache.any23/apache-any23-mime/2.2-SNAPSHOT/apache-any23-mime-2.2-SNAPSHOT.pom
[JENKINS] Archiving <https://builds.apache.org/job/Any23-trunk/ws/mime/target/apache-any23-mime-2.2-SNAPSHOT.jar>
to org.apache.any23/apache-any23-mime/2.2-20171230.172307-14/apache-any23-mime-2.2-20171230.172307-14.jar
[JENKINS] Archiving <https://builds.apache.org/job/Any23-trunk/ws/plugins/integration-test/pom.xml>
to org.apache.any23.plugins/apache-any23-integration-test/2.2-SNAPSHOT/apache-any23-integration-test-2.2-SNAPSHOT.pom
[JENKINS] Archiving <https://builds.apache.org/job/Any23-trunk/ws/plugins/integration-test/target/apache-any23-integration-test-2.2-SNAPSHOT.jar>
to org.apache.any23.plugins/apache-any23-integration-test/2.2-SNAPSHOT/apache-any23-integration-test-2.2-SNAPSHOT.jar
[JENKINS] Archiving <https://builds.apache.org/job/Any23-trunk/ws/api/pom.xml> to org.apache.any23/apache-any23-api/2.2-SNAPSHOT/apache-any23-api-2.2-SNAPSHOT.pom
[JENKINS] Archiving <https://builds.apache.org/job/Any23-trunk/ws/api/target/apache-any23-api-2.2-SNAPSHOT.jar>
to org.apache.any23/apache-any23-api/2.2-20171230.172233-14/apache-any23-api-2.2-20171230.172233-14.jar
[JENKINS] Archiving <https://builds.apache.org/job/Any23-trunk/ws/service/pom.xml> to
org.apache.any23/apache-any23-service/2.2-SNAPSHOT/apache-any23-service-2.2-SNAPSHOT.pom
channel stopped
[JIRA] Updating issue ANY23-140
Not sending mail to unregistered user lewis.mcgibbney@gmail.com

Mime
View raw message