any23-dev mailing list archives

Site index · List index
Message view « Date » · « Thread »
Top « Date » · « Thread »
From Apache Jenkins Server <jenk...@builds.apache.org>
Subject Build failed in Jenkins: Any23-trunk #1499
Date Wed, 13 Sep 2017 11:07:26 GMT
See <https://builds.apache.org/job/Any23-trunk/1499/display/redirect?page=changes>

Changes:

[grzebyta.dev] Simplify rdf graph structure

[grzebyta.dev] Update values in RDFSchemaUtilsTest.java

[grzebyta.dev] Fix testing issue

------------------------------------------
[...truncated 1.02 MB...]
Generating <https://builds.apache.org/job/Any23-trunk/ws/target/site/apidocs/org/apache/any23/plugin/crawler/class-use/SharedData.html...>
Generating <https://builds.apache.org/job/Any23-trunk/ws/target/site/apidocs/org/apache/any23/plugin/crawler/class-use/CrawlerListener.html...>
Generating <https://builds.apache.org/job/Any23-trunk/ws/target/site/apidocs/org/apache/any23/plugin/crawler/class-use/SiteCrawler.html...>
Generating <https://builds.apache.org/job/Any23-trunk/ws/target/site/apidocs/org/apache/any23/servlet/class-use/RedirectServlet.html...>
Generating <https://builds.apache.org/job/Any23-trunk/ws/target/site/apidocs/org/apache/any23/servlet/class-use/Servlet.html...>
Generating <https://builds.apache.org/job/Any23-trunk/ws/target/site/apidocs/org/apache/any23/servlet/conneg/class-use/Any23Negotiator.html...>
Generating <https://builds.apache.org/job/Any23-trunk/ws/target/site/apidocs/org/apache/any23/servlet/conneg/class-use/ContentTypeNegotiator.html...>
Generating <https://builds.apache.org/job/Any23-trunk/ws/target/site/apidocs/org/apache/any23/servlet/conneg/class-use/ContentTypeNegotiator.VariantSpec.html...>
Generating <https://builds.apache.org/job/Any23-trunk/ws/target/site/apidocs/org/apache/any23/servlet/conneg/class-use/MediaRangeSpec.html...>
Generating <https://builds.apache.org/job/Any23-trunk/ws/target/site/apidocs/org/apache/any23/package-use.html...>
Generating <https://builds.apache.org/job/Any23-trunk/ws/target/site/apidocs/org/apache/any23/cli/package-use.html...>
Generating <https://builds.apache.org/job/Any23-trunk/ws/target/site/apidocs/org/apache/any23/configuration/package-use.html...>
Generating <https://builds.apache.org/job/Any23-trunk/ws/target/site/apidocs/org/apache/any23/encoding/package-use.html...>
Generating <https://builds.apache.org/job/Any23-trunk/ws/target/site/apidocs/org/apache/any23/extractor/package-use.html...>
Generating <https://builds.apache.org/job/Any23-trunk/ws/target/site/apidocs/org/apache/any23/extractor/csv/package-use.html...>
Generating <https://builds.apache.org/job/Any23-trunk/ws/target/site/apidocs/org/apache/any23/extractor/html/package-use.html...>
Generating <https://builds.apache.org/job/Any23-trunk/ws/target/site/apidocs/org/apache/any23/extractor/html/annotations/package-use.html...>
Generating <https://builds.apache.org/job/Any23-trunk/ws/target/site/apidocs/org/apache/any23/extractor/html/microformats2/package-use.html...>
Generating <https://builds.apache.org/job/Any23-trunk/ws/target/site/apidocs/org/apache/any23/extractor/html/microformats2/annotations/package-use.html...>
Generating <https://builds.apache.org/job/Any23-trunk/ws/target/site/apidocs/org/apache/any23/extractor/microdata/package-use.html...>
Generating <https://builds.apache.org/job/Any23-trunk/ws/target/site/apidocs/org/apache/any23/extractor/openie/package-use.html...>
Generating <https://builds.apache.org/job/Any23-trunk/ws/target/site/apidocs/org/apache/any23/extractor/rdf/package-use.html...>
Generating <https://builds.apache.org/job/Any23-trunk/ws/target/site/apidocs/org/apache/any23/extractor/rdfa/package-use.html...>
Generating <https://builds.apache.org/job/Any23-trunk/ws/target/site/apidocs/org/apache/any23/extractor/xpath/package-use.html...>
Generating <https://builds.apache.org/job/Any23-trunk/ws/target/site/apidocs/org/apache/any23/extractor/yaml/package-use.html...>
Generating <https://builds.apache.org/job/Any23-trunk/ws/target/site/apidocs/org/apache/any23/filter/package-use.html...>
Generating <https://builds.apache.org/job/Any23-trunk/ws/target/site/apidocs/org/apache/any23/http/package-use.html...>
Generating <https://builds.apache.org/job/Any23-trunk/ws/target/site/apidocs/org/apache/any23/mime/package-use.html...>
Generating <https://builds.apache.org/job/Any23-trunk/ws/target/site/apidocs/org/apache/any23/mime/purifier/package-use.html...>
Generating <https://builds.apache.org/job/Any23-trunk/ws/target/site/apidocs/org/apache/any23/plugin/package-use.html...>
Generating <https://builds.apache.org/job/Any23-trunk/ws/target/site/apidocs/org/apache/any23/plugin/crawler/package-use.html...>
Generating <https://builds.apache.org/job/Any23-trunk/ws/target/site/apidocs/org/apache/any23/plugin/htmlscraper/package-use.html...>
Generating <https://builds.apache.org/job/Any23-trunk/ws/target/site/apidocs/org/apache/any23/plugin/officescraper/package-use.html...>
Generating <https://builds.apache.org/job/Any23-trunk/ws/target/site/apidocs/org/apache/any23/rdf/package-use.html...>
Generating <https://builds.apache.org/job/Any23-trunk/ws/target/site/apidocs/org/apache/any23/servlet/package-use.html...>
Generating <https://builds.apache.org/job/Any23-trunk/ws/target/site/apidocs/org/apache/any23/servlet/conneg/package-use.html...>
Generating <https://builds.apache.org/job/Any23-trunk/ws/target/site/apidocs/org/apache/any23/source/package-use.html...>
Generating <https://builds.apache.org/job/Any23-trunk/ws/target/site/apidocs/org/apache/any23/util/package-use.html...>
Generating <https://builds.apache.org/job/Any23-trunk/ws/target/site/apidocs/org/apache/any23/validator/package-use.html...>
Generating <https://builds.apache.org/job/Any23-trunk/ws/target/site/apidocs/org/apache/any23/validator/rule/package-use.html...>
Generating <https://builds.apache.org/job/Any23-trunk/ws/target/site/apidocs/org/apache/any23/vocab/package-use.html...>
Generating <https://builds.apache.org/job/Any23-trunk/ws/target/site/apidocs/org/apache/any23/writer/package-use.html...>
Building index for all the packages and classes...
Generating <https://builds.apache.org/job/Any23-trunk/ws/target/site/apidocs/overview-tree.html...>
Generating <https://builds.apache.org/job/Any23-trunk/ws/target/site/apidocs/index-all.html...>
Generating <https://builds.apache.org/job/Any23-trunk/ws/target/site/apidocs/deprecated-list.html...>
Building index for all classes...
Generating <https://builds.apache.org/job/Any23-trunk/ws/target/site/apidocs/allclasses-frame.html...>
Generating <https://builds.apache.org/job/Any23-trunk/ws/target/site/apidocs/allclasses-noframe.html...>
Generating <https://builds.apache.org/job/Any23-trunk/ws/target/site/apidocs/index.html...>
Generating <https://builds.apache.org/job/Any23-trunk/ws/target/site/apidocs/overview-summary.html...>
Generating <https://builds.apache.org/job/Any23-trunk/ws/target/site/apidocs/help-doc.html...>
12 errors
26 warnings
[JENKINS] Archiving aggregated javadoc
[INFO] ------------------------------------------------------------------------
[INFO] Reactor Summary:
[INFO] 
[INFO] Apache Any23 ....................................... FAILURE [ 23.507 s]
[INFO] Apache Any23 :: Base API ........................... SUCCESS [  9.553 s]
[INFO] Apache Any23 :: Test Resources ..................... SUCCESS [  9.543 s]
[INFO] Apache Any23 :: CSV Utilities ...................... SUCCESS [  6.702 s]
[INFO] Apache Any23 :: Mime Type Detection ................ SUCCESS [ 13.967 s]
[INFO] Apache Any23 :: Encoding Detection ................. SUCCESS [  7.997 s]
[INFO] Apache Any23 :: Core ............................... SUCCESS [ 36.714 s]
[INFO] Apache Any23 :: Plugins :: Office Scraper .......... SUCCESS [ 17.508 s]
[INFO] Apache Any23 :: Plugins :: HTML Scraper ............ SUCCESS [ 14.278 s]
[INFO] Apache Any23 :: CLI ................................ SUCCESS [ 39.111 s]
[INFO] Apache Any23 :: OpenIE ............................. SUCCESS [01:22 min]
[INFO] Apache Any23 :: Plugins :: Basic Crawler ........... SUCCESS [ 43.516 s]
[INFO] Apache Any23 :: Plugins :: Integration Test ........ SUCCESS [01:02 min]
[INFO] Apache Any23 :: Service ............................ SUCCESS [01:15 min]
[INFO] ------------------------------------------------------------------------
[INFO] BUILD FAILURE
[INFO] ------------------------------------------------------------------------
[INFO] Total time: 08:02 min
[INFO] Finished at: 2017-09-13T11:04:32Z
[INFO] Final Memory: 99M/903M
[INFO] ------------------------------------------------------------------------
[ERROR] Failed to execute goal org.apache.maven.plugins:maven-javadoc-plugin:2.8:aggregate
(default-cli) on project apache-any23: An error has occurred in JavaDocs report generation:
[ERROR] Exit code: 1 - <https://builds.apache.org/job/Any23-trunk/ws/core/src/main/java/org/apache/any23/rdf/RDFUtils.java>:578:
warning: no description for @param
[ERROR] * @param docUri
[ERROR] ^
[ERROR] <https://builds.apache.org/job/Any23-trunk/ws/core/src/main/java/org/apache/any23/rdf/RDFUtils.java>:579:
warning: no description for @return
[ERROR] * @return
[ERROR] ^
[ERROR] <https://builds.apache.org/job/Any23-trunk/ws/core/src/main/java/org/apache/any23/rdf/RDFUtils.java>:587:
warning: no description for @param
[ERROR] * @param type
[ERROR] ^
[ERROR] <https://builds.apache.org/job/Any23-trunk/ws/core/src/main/java/org/apache/any23/rdf/RDFUtils.java>:588:
warning: no description for @param
[ERROR] * @param docIRI
[ERROR] ^
[ERROR] <https://builds.apache.org/job/Any23-trunk/ws/core/src/main/java/org/apache/any23/rdf/RDFUtils.java>:589:
warning: no description for @return
[ERROR] * @return
[ERROR] ^
[ERROR] <https://builds.apache.org/job/Any23-trunk/ws/core/src/main/java/org/apache/any23/rdf/RDFUtils.java>:596:
error: unknown tag: it
[ERROR] * Creates implementation of {@link Resource} from given arguments: <it>type</it>
and
[ERROR] ^
[ERROR] <https://builds.apache.org/job/Any23-trunk/ws/core/src/main/java/org/apache/any23/rdf/RDFUtils.java>:596:
error: unknown tag: it
[ERROR] * Creates implementation of {@link Resource} from given arguments: <it>type</it>
and
[ERROR] ^
[ERROR] <https://builds.apache.org/job/Any23-trunk/ws/core/src/main/java/org/apache/any23/rdf/RDFUtils.java>:597:
error: unknown tag: it
[ERROR] * <it>docIRI</it>.
[ERROR] ^
[ERROR] <https://builds.apache.org/job/Any23-trunk/ws/core/src/main/java/org/apache/any23/rdf/RDFUtils.java>:597:
error: unknown tag: it
[ERROR] * <it>docIRI</it>.
[ERROR] ^
[ERROR] <https://builds.apache.org/job/Any23-trunk/ws/core/src/main/java/org/apache/any23/rdf/RDFUtils.java>:599:
error: unknown tag: it
[ERROR] * <li>The <it>type</type> argument is converted following Java naming
conventions with
[ERROR] ^
[ERROR] <https://builds.apache.org/job/Any23-trunk/ws/core/src/main/java/org/apache/any23/rdf/RDFUtils.java>:599:
error: unknown tag: type
[ERROR] * <li>The <it>type</type> argument is converted following Java naming
conventions with
[ERROR] ^
[ERROR] <https://builds.apache.org/job/Any23-trunk/ws/core/src/main/java/org/apache/any23/rdf/RDFUtils.java>:602:
error: unknown tag: it
[ERROR] * <li>The <it>docIRI</it> is treated as a namespace. If it ends
with '/' character than
[ERROR] ^
[ERROR] <https://builds.apache.org/job/Any23-trunk/ws/core/src/main/java/org/apache/any23/rdf/RDFUtils.java>:602:
error: unknown tag: it
[ERROR] * <li>The <it>docIRI</it> is treated as a namespace. If it ends
with '/' character than
[ERROR] ^
[ERROR] <https://builds.apache.org/job/Any23-trunk/ws/core/src/main/java/org/apache/any23/rdf/RDFUtils.java>:605:
error: unknown tag: it
[ERROR] * <li>If <it>addId</it> is TRUE than combination of underscore and
the node identifier is added to
[ERROR] ^
[ERROR] <https://builds.apache.org/job/Any23-trunk/ws/core/src/main/java/org/apache/any23/rdf/RDFUtils.java>:605:
error: unknown tag: it
[ERROR] * <li>If <it>addId</it> is TRUE than combination of underscore and
the node identifier is added to
[ERROR] ^
[ERROR] <https://builds.apache.org/job/Any23-trunk/ws/core/src/main/java/org/apache/any23/rdf/RDFUtils.java>:606:
error: unknown tag: code_
[ERROR] * the end ('{@code_<int>'}).
[ERROR] ^
[ERROR] <https://builds.apache.org/job/Any23-trunk/ws/core/src/main/java/org/apache/any23/rdf/RDFUtils.java>:609:
warning: no description for @param
[ERROR] * @param type
[ERROR] ^
[ERROR] <https://builds.apache.org/job/Any23-trunk/ws/core/src/main/java/org/apache/any23/rdf/RDFUtils.java>:610:
warning: no description for @param
[ERROR] * @param docIRI
[ERROR] ^
[ERROR] <https://builds.apache.org/job/Any23-trunk/ws/core/src/main/java/org/apache/any23/rdf/RDFUtils.java>:611:
warning: no description for @param
[ERROR] * @param addId
[ERROR] ^
[ERROR] <https://builds.apache.org/job/Any23-trunk/ws/core/src/main/java/org/apache/any23/rdf/RDFUtils.java>:613:
error: unexpected text
[ERROR] * @see http://www.geeksforgeeks.org/java-naming-conventions/
[ERROR] ^
[ERROR] <https://builds.apache.org/job/Any23-trunk/ws/core/src/main/java/org/apache/any23/rdf/RDFUtils.java>:615:
warning - Tag @see:illegal character: "58" in "http://www.geeksforgeeks.org/java-naming-conventions/"
[ERROR] <https://builds.apache.org/job/Any23-trunk/ws/core/src/main/java/org/apache/any23/rdf/RDFUtils.java>:615:
warning - Tag @see:illegal character: "47" in "http://www.geeksforgeeks.org/java-naming-conventions/"
[ERROR] <https://builds.apache.org/job/Any23-trunk/ws/core/src/main/java/org/apache/any23/rdf/RDFUtils.java>:615:
warning - Tag @see:illegal character: "47" in "http://www.geeksforgeeks.org/java-naming-conventions/"
[ERROR] <https://builds.apache.org/job/Any23-trunk/ws/core/src/main/java/org/apache/any23/rdf/RDFUtils.java>:615:
warning - Tag @see:illegal character: "47" in "http://www.geeksforgeeks.org/java-naming-conventions/"
[ERROR] <https://builds.apache.org/job/Any23-trunk/ws/core/src/main/java/org/apache/any23/rdf/RDFUtils.java>:615:
warning - Tag @see:illegal character: "45" in "http://www.geeksforgeeks.org/java-naming-conventions/"
[ERROR] <https://builds.apache.org/job/Any23-trunk/ws/core/src/main/java/org/apache/any23/rdf/RDFUtils.java>:615:
warning - Tag @see:illegal character: "45" in "http://www.geeksforgeeks.org/java-naming-conventions/"
[ERROR] <https://builds.apache.org/job/Any23-trunk/ws/core/src/main/java/org/apache/any23/rdf/RDFUtils.java>:615:
warning - Tag @see:illegal character: "47" in "http://www.geeksforgeeks.org/java-naming-conventions/"
[ERROR] <https://builds.apache.org/job/Any23-trunk/ws/plugins/office-scraper/src/main/java/org/apache/any23/vocab/Excel.java>:127:
warning: no description for @param
[ERROR] * @param localName
[ERROR] ^
[ERROR] <https://builds.apache.org/job/Any23-trunk/ws/csvutils/src/main/java/org/apache/any23/extractor/csv/CSVReaderBuilder.java>:65:
warning: no description for @throws
[ERROR] * @throws java.io.IOException
[ERROR] ^
[ERROR] <https://builds.apache.org/job/Any23-trunk/ws/csvutils/src/main/java/org/apache/any23/extractor/csv/CSVReaderBuilder.java>:79:
warning: no description for @throws
[ERROR] * @throws IOException
[ERROR] ^
[ERROR] <https://builds.apache.org/job/Any23-trunk/ws/core/src/main/java/org/apache/any23/util/StreamUtils.java>:137:
warning: no description for @throws
[ERROR] * @throws TransformerFactoryConfigurationError
[ERROR] ^
[ERROR] <https://builds.apache.org/job/Any23-trunk/ws/core/src/main/java/org/apache/any23/util/StreamUtils.java>:138:
warning: no description for @throws
[ERROR] * @throws TransformerConfigurationException
[ERROR] ^
[ERROR] <https://builds.apache.org/job/Any23-trunk/ws/core/src/main/java/org/apache/any23/util/StreamUtils.java>:140:
warning: no @param for doc
[ERROR] public static InputStream documentToInputStream(Document doc)
[ERROR] ^
[ERROR] <https://builds.apache.org/job/Any23-trunk/ws/core/src/main/java/org/apache/any23/util/StreamUtils.java>:140:
warning: no @return
[ERROR] public static InputStream documentToInputStream(Document doc)
[ERROR] ^
[ERROR] <https://builds.apache.org/job/Any23-trunk/ws/plugins/basic-crawler/src/main/java/org/apache/any23/plugin/crawler/SiteCrawler.java>:207:
warning: no description for @param
[ERROR] * @param listener
[ERROR] ^
[ERROR] <https://builds.apache.org/job/Any23-trunk/ws/plugins/basic-crawler/src/main/java/org/apache/any23/plugin/crawler/SiteCrawler.java>:216:
warning: no description for @param
[ERROR] * @param listener
[ERROR] ^
[ERROR] <https://builds.apache.org/job/Any23-trunk/ws/plugins/basic-crawler/src/main/java/org/apache/any23/plugin/crawler/SiteCrawler.java>:228:
warning: no description for @throws
[ERROR] * @throws Exception
[ERROR] ^
[ERROR] <https://builds.apache.org/job/Any23-trunk/ws/plugins/basic-crawler/src/main/java/org/apache/any23/plugin/crawler/SiteCrawler.java>:255:
warning: no description for @throws
[ERROR] * @throws Exception
[ERROR] ^
[ERROR] 
[ERROR] Command line was: /usr/local/asfpackages/java/jdk1.8.0_102/jre/../bin/javadoc @options
@packages
[ERROR] 
[ERROR] Refer to the generated Javadoc files in '<https://builds.apache.org/job/Any23-trunk/ws/target/site/apidocs'>
dir.
[ERROR] -> [Help 1]
[ERROR] 
[ERROR] To see the full stack trace of the errors, re-run Maven with the -e switch.
[ERROR] Re-run Maven using the -X switch to enable full debug logging.
[ERROR] 
[ERROR] For more information about the errors and possible solutions, please read the following
articles:
[ERROR] [Help 1] http://cwiki.apache.org/confluence/display/MAVEN/MojoExecutionException
[JENKINS] Archiving <https://builds.apache.org/job/Any23-trunk/ws/core/pom.xml> to org.apache.any23/apache-any23-core/2.1-SNAPSHOT/apache-any23-core-2.1-SNAPSHOT.pom
[JENKINS] Archiving <https://builds.apache.org/job/Any23-trunk/ws/core/target/apache-any23-core-2.1-SNAPSHOT.jar>
to org.apache.any23/apache-any23-core/2.1-20170913.105812-26/apache-any23-core-2.1-20170913.105812-26.jar
[JENKINS] Archiving <https://builds.apache.org/job/Any23-trunk/ws/core/target/apache-any23-core-2.1-SNAPSHOT-tests.jar>
to org.apache.any23/apache-any23-core/2.1-20170913.105812-26/apache-any23-core-2.1-20170913.105812-26-tests.jar
[JENKINS] Archiving <https://builds.apache.org/job/Any23-trunk/ws/openie/pom.xml> to
org.apache.any23/apache-any23-openie/2.1-SNAPSHOT/apache-any23-openie-2.1-SNAPSHOT.pom
[JENKINS] Archiving <https://builds.apache.org/job/Any23-trunk/ws/openie/target/apache-any23-openie-2.1-SNAPSHOT.jar>
to org.apache.any23/apache-any23-openie/2.1-20170913.110052-2/apache-any23-openie-2.1-20170913.110052-2.jar
[JENKINS] Archiving <https://builds.apache.org/job/Any23-trunk/ws/plugins/html-scraper/pom.xml>
to org.apache.any23.plugins/apache-any23-html-scraper/2.1-SNAPSHOT/apache-any23-html-scraper-2.1-SNAPSHOT.pom
[JENKINS] Archiving <https://builds.apache.org/job/Any23-trunk/ws/plugins/html-scraper/target/apache-any23-html-scraper-2.1-SNAPSHOT.jar>
to org.apache.any23.plugins/apache-any23-html-scraper/2.1-20170913.105843-26/apache-any23-html-scraper-2.1-20170913.105843-26.jar
[JENKINS] Archiving <https://builds.apache.org/job/Any23-trunk/ws/plugins/html-scraper/target/apache-any23-html-scraper-2.1-SNAPSHOT.tar.gz>
to org.apache.any23.plugins/apache-any23-html-scraper/2.1-20170913.105843-26/apache-any23-html-scraper-2.1-20170913.105843-26.tar.gz
[JENKINS] Archiving <https://builds.apache.org/job/Any23-trunk/ws/plugins/html-scraper/target/apache-any23-html-scraper-2.1-SNAPSHOT.zip>
to org.apache.any23.plugins/apache-any23-html-scraper/2.1-20170913.105843-26/apache-any23-html-scraper-2.1-20170913.105843-26.zip
[Fast Archiver] Compressed 208.75 KB of artifacts by 15.3% relative to #1498
[JENKINS] Archiving <https://builds.apache.org/job/Any23-trunk/ws/test-resources/pom.xml>
to org.apache.any23/apache-any23-test-resources/2.1-SNAPSHOT/apache-any23-test-resources-2.1-SNAPSHOT.pom
[JENKINS] Archiving <https://builds.apache.org/job/Any23-trunk/ws/test-resources/target/apache-any23-test-resources-2.1-SNAPSHOT.jar>
to org.apache.any23/apache-any23-test-resources/2.1-20170913.105705-26/apache-any23-test-resources-2.1-20170913.105705-26.jar
[JENKINS] Archiving <https://builds.apache.org/job/Any23-trunk/ws/test-resources/target/apache-any23-test-resources-2.1-SNAPSHOT-tests.jar>
to org.apache.any23/apache-any23-test-resources/2.1-20170913.105705-26/apache-any23-test-resources-2.1-20170913.105705-26-tests.jar
[Fast Archiver] Compressed 881.27 KB of artifacts by 21.8% relative to #1498
[JENKINS] Archiving <https://builds.apache.org/job/Any23-trunk/ws/csvutils/pom.xml>
to org.apache.any23/apache-any23-csvutils/2.1-SNAPSHOT/apache-any23-csvutils-2.1-SNAPSHOT.pom
[JENKINS] Archiving <https://builds.apache.org/job/Any23-trunk/ws/csvutils/target/apache-any23-csvutils-2.1-SNAPSHOT.jar>
to org.apache.any23/apache-any23-csvutils/2.1-20170913.105715-26/apache-any23-csvutils-2.1-20170913.105715-26.jar
[JENKINS] Archiving <https://builds.apache.org/job/Any23-trunk/ws/plugins/office-scraper/pom.xml>
to org.apache.any23.plugins/apache-any23-office-scraper/2.1-SNAPSHOT/apache-any23-office-scraper-2.1-SNAPSHOT.pom
[JENKINS] Archiving <https://builds.apache.org/job/Any23-trunk/ws/plugins/office-scraper/target/apache-any23-office-scraper-2.1-SNAPSHOT.jar>
to org.apache.any23.plugins/apache-any23-office-scraper/2.1-20170913.105827-26/apache-any23-office-scraper-2.1-20170913.105827-26.jar
[JENKINS] Archiving <https://builds.apache.org/job/Any23-trunk/ws/plugins/office-scraper/target/apache-any23-office-scraper-2.1-SNAPSHOT.tar.gz>
to org.apache.any23.plugins/apache-any23-office-scraper/2.1-20170913.105827-26/apache-any23-office-scraper-2.1-20170913.105827-26.tar.gz
[JENKINS] Archiving <https://builds.apache.org/job/Any23-trunk/ws/plugins/office-scraper/target/apache-any23-office-scraper-2.1-SNAPSHOT.zip>
to org.apache.any23.plugins/apache-any23-office-scraper/2.1-20170913.105827-26/apache-any23-office-scraper-2.1-20170913.105827-26.zip
[Fast Archiver] Compressed 4.71 MB of artifacts by 48.5% relative to #1498
[JENKINS] Archiving <https://builds.apache.org/job/Any23-trunk/ws/encoding/pom.xml>
to org.apache.any23/apache-any23-encoding/2.1-SNAPSHOT/apache-any23-encoding-2.1-SNAPSHOT.pom
[JENKINS] Archiving <https://builds.apache.org/job/Any23-trunk/ws/encoding/target/apache-any23-encoding-2.1-SNAPSHOT.jar>
to org.apache.any23/apache-any23-encoding/2.1-20170913.105738-26/apache-any23-encoding-2.1-20170913.105738-26.jar
[JENKINS] Archiving <https://builds.apache.org/job/Any23-trunk/ws/plugins/basic-crawler/pom.xml>
to org.apache.any23.plugins/apache-any23-basic-crawler/2.1-SNAPSHOT/apache-any23-basic-crawler-2.1-SNAPSHOT.pom
[JENKINS] Archiving <https://builds.apache.org/job/Any23-trunk/ws/plugins/basic-crawler/target/apache-any23-basic-crawler-2.1-SNAPSHOT.jar>
to org.apache.any23.plugins/apache-any23-basic-crawler/2.1-20170913.110128-26/apache-any23-basic-crawler-2.1-20170913.110128-26.jar
[JENKINS] Archiving <https://builds.apache.org/job/Any23-trunk/ws/plugins/basic-crawler/target/apache-any23-basic-crawler-2.1-SNAPSHOT.tar.gz>
to org.apache.any23.plugins/apache-any23-basic-crawler/2.1-20170913.110128-26/apache-any23-basic-crawler-2.1-20170913.110128-26.tar.gz
[JENKINS] Archiving <https://builds.apache.org/job/Any23-trunk/ws/plugins/basic-crawler/target/apache-any23-basic-crawler-2.1-SNAPSHOT.zip>
to org.apache.any23.plugins/apache-any23-basic-crawler/2.1-20170913.110128-26/apache-any23-basic-crawler-2.1-20170913.110128-26.zip
[JENKINS] Archiving <https://builds.apache.org/job/Any23-trunk/ws/plugins/basic-crawler/target/apache-any23-basic-crawler-2.1-SNAPSHOT-tests.jar>
to org.apache.any23.plugins/apache-any23-basic-crawler/2.1-20170913.110128-26/apache-any23-basic-crawler-2.1-20170913.110128-26-tests.jar
[Fast Archiver] Compressed 5.99 MB of artifacts by 46.4% relative to #1498
[JENKINS] Archiving <https://builds.apache.org/job/Any23-trunk/ws/pom.xml> to org.apache.any23/apache-any23/2.1-SNAPSHOT/apache-any23-2.1-SNAPSHOT.pom
[JENKINS] Archiving <https://builds.apache.org/job/Any23-trunk/ws/target/apache-any23-2.1-SNAPSHOT-site.xml>
to org.apache.any23/apache-any23/2.1-20170913.105640-33/apache-any23-2.1-20170913.105640-33-site.xml
[JENKINS] Archiving <https://builds.apache.org/job/Any23-trunk/ws/target/apache-any23-2.1-SNAPSHOT-src.tar.gz>
to org.apache.any23/apache-any23/2.1-20170913.105640-33/apache-any23-2.1-20170913.105640-33-src.tar.gz
[JENKINS] Archiving <https://builds.apache.org/job/Any23-trunk/ws/target/apache-any23-2.1-SNAPSHOT-src.zip>
to org.apache.any23/apache-any23/2.1-20170913.105640-33/apache-any23-2.1-20170913.105640-33-src.zip
[Fast Archiver] Compressed 3.66 MB of artifacts by 11.1% relative to #1498
[JENKINS] Archiving <https://builds.apache.org/job/Any23-trunk/ws/cli/pom.xml> to org.apache.any23/apache-any23-cli/2.1-SNAPSHOT/apache-any23-cli-2.1-SNAPSHOT.pom
[JENKINS] Archiving <https://builds.apache.org/job/Any23-trunk/ws/cli/target/apache-any23-cli-2.1-SNAPSHOT.jar>
to org.apache.any23/apache-any23-cli/2.1-20170913.105909-26/apache-any23-cli-2.1-20170913.105909-26.jar
[JENKINS] Archiving <https://builds.apache.org/job/Any23-trunk/ws/cli/target/apache-any23-cli-2.1-SNAPSHOT.tar.gz>
to org.apache.any23/apache-any23-cli/2.1-20170913.105909-26/apache-any23-cli-2.1-20170913.105909-26.tar.gz
[JENKINS] Archiving <https://builds.apache.org/job/Any23-trunk/ws/cli/target/apache-any23-cli-2.1-SNAPSHOT.zip>
to org.apache.any23/apache-any23-cli/2.1-20170913.105909-26/apache-any23-cli-2.1-20170913.105909-26.zip
[JENKINS] Archiving <https://builds.apache.org/job/Any23-trunk/ws/cli/target/apache-any23-cli-2.1-SNAPSHOT-tests.jar>
to org.apache.any23/apache-any23-cli/2.1-20170913.105909-26/apache-any23-cli-2.1-20170913.105909-26-tests.jar
[Fast Archiver] Compressed 132.56 MB of artifacts by 46.0% relative to #1498
[JENKINS] Archiving <https://builds.apache.org/job/Any23-trunk/ws/mime/pom.xml> to org.apache.any23/apache-any23-mime/2.1-SNAPSHOT/apache-any23-mime-2.1-SNAPSHOT.pom
[JENKINS] Archiving <https://builds.apache.org/job/Any23-trunk/ws/mime/target/apache-any23-mime-2.1-SNAPSHOT.jar>
to org.apache.any23/apache-any23-mime/2.1-20170913.105729-26/apache-any23-mime-2.1-20170913.105729-26.jar
[JENKINS] Archiving <https://builds.apache.org/job/Any23-trunk/ws/plugins/integration-test/pom.xml>
to org.apache.any23.plugins/apache-any23-integration-test/2.1-SNAPSHOT/apache-any23-integration-test-2.1-SNAPSHOT.pom
[JENKINS] Archiving <https://builds.apache.org/job/Any23-trunk/ws/plugins/integration-test/target/apache-any23-integration-test-2.1-SNAPSHOT.jar>
to org.apache.any23.plugins/apache-any23-integration-test/2.1-20170913.110239-26/apache-any23-integration-test-2.1-20170913.110239-26.jar
[JENKINS] Archiving <https://builds.apache.org/job/Any23-trunk/ws/api/pom.xml> to org.apache.any23/apache-any23-api/2.1-SNAPSHOT/apache-any23-api-2.1-SNAPSHOT.pom
[JENKINS] Archiving <https://builds.apache.org/job/Any23-trunk/ws/api/target/apache-any23-api-2.1-SNAPSHOT.jar>
to org.apache.any23/apache-any23-api/2.1-20170913.105657-26/apache-any23-api-2.1-20170913.105657-26.jar
[JENKINS] Archiving <https://builds.apache.org/job/Any23-trunk/ws/service/pom.xml> to
org.apache.any23/apache-any23-service/2.1-SNAPSHOT/apache-any23-service-2.1-SNAPSHOT.pom
[JENKINS] Archiving <https://builds.apache.org/job/Any23-trunk/ws/service/target/apache-any23-service-2.1-SNAPSHOT.war>
to org.apache.any23/apache-any23-service/2.1-20170913.110314-26/apache-any23-service-2.1-20170913.110314-26.war
[JENKINS] Archiving <https://builds.apache.org/job/Any23-trunk/ws/service/target/apache-any23-service-2.1-SNAPSHOT-without-deps.war>
to org.apache.any23/apache-any23-service/2.1-20170913.110314-26/apache-any23-service-2.1-20170913.110314-26-without-deps.war
[JENKINS] Archiving <https://builds.apache.org/job/Any23-trunk/ws/service/target/apache-any23-service-2.1-SNAPSHOT-with-deps.tar.gz>
to org.apache.any23/apache-any23-service/2.1-20170913.110314-26/apache-any23-service-2.1-20170913.110314-26-with-deps.tar.gz
[JENKINS] Archiving <https://builds.apache.org/job/Any23-trunk/ws/service/target/apache-any23-service-2.1-SNAPSHOT-with-deps.zip>
to org.apache.any23/apache-any23-service/2.1-20170913.110314-26/apache-any23-service-2.1-20170913.110314-26-with-deps.zip
[JENKINS] Archiving <https://builds.apache.org/job/Any23-trunk/ws/service/target/apache-any23-service-2.1-SNAPSHOT-without-deps.tar.gz>
to org.apache.any23/apache-any23-service/2.1-20170913.110314-26/apache-any23-service-2.1-20170913.110314-26-without-deps.tar.gz
[JENKINS] Archiving <https://builds.apache.org/job/Any23-trunk/ws/service/target/apache-any23-service-2.1-SNAPSHOT-without-deps.zip>
to org.apache.any23/apache-any23-service/2.1-20170913.110314-26/apache-any23-service-2.1-20170913.110314-26-without-deps.zip
[JENKINS] Archiving <https://builds.apache.org/job/Any23-trunk/ws/service/target/apache-any23-service-2.1-SNAPSHOT-server-embedded.tar.gz>
to org.apache.any23/apache-any23-service/2.1-20170913.110314-26/apache-any23-service-2.1-20170913.110314-26-server-embedded.tar.gz
[JENKINS] Archiving <https://builds.apache.org/job/Any23-trunk/ws/service/target/apache-any23-service-2.1-SNAPSHOT-server-embedded.zip>
to org.apache.any23/apache-any23-service/2.1-20170913.110314-26/apache-any23-service-2.1-20170913.110314-26-server-embedded.zip
[Fast Archiver] Compressed 339.15 MB of artifacts by 19.2% relative to #1498
channel stopped
Not sending mail to unregistered user grzebyta.dev@gmail.com

Mime
View raw message