any23-dev mailing list archives

Site index · List index
Message view « Date » · « Thread »
Top « Date » · « Thread »
From Apache Jenkins Server <jenk...@builds.apache.org>
Subject Build failed in Jenkins: Nutch-2292 #1
Date Sat, 16 Jul 2016 20:23:21 GMT
See <https://builds.apache.org/job/Nutch-2292/1/>

------------------------------------------
[...truncated 478 lines...]
[INFO] ------------------------------------------------------------------------
[INFO] 
[INFO] --- maven-clean-plugin:3.0.0:clean (default-clean) @ nutch-parent ---
[INFO] 
[INFO] --- maven-dependency-plugin:2.10:copy-dependencies (copy-dependencies) @ nutch-parent
---
[INFO] 
[INFO] --- maven-resources-plugin:3.0.1:copy-resources (copy-scripts) @ nutch-parent ---
[WARNING] Using platform encoding (ISO-8859-1 actually) to copy filtered resources, i.e. build
is platform dependent!
[INFO] Copying 2 resources
[INFO] 
[INFO] --- maven-resources-plugin:3.0.1:copy-resources (copy-conf) @ nutch-parent ---
[WARNING] Using platform encoding (ISO-8859-1 actually) to copy filtered resources, i.e. build
is platform dependent!
[INFO] Copying 31 resources
[INFO] 
[INFO] --- maven-install-plugin:2.3.1:install (default-install) @ nutch-parent ---
[INFO] Installing <https://builds.apache.org/job/Nutch-2292/ws/pom.xml> to /home/jenkins/jenkins-slave/maven-repositories/1/org/apache/nutch/nutch-parent/1.13-SNAPSHOT/nutch-parent-1.13-SNAPSHOT.pom
[INFO] 
[INFO] --- maven-deploy-plugin:2.7:deploy (default-deploy) @ nutch-parent ---
[INFO]                                                                         
[INFO] ------------------------------------------------------------------------
[INFO] Skipping nutch-parent
[INFO] This project has been banned from the build due to previous failures.
[INFO] ------------------------------------------------------------------------
[INFO] ------------------------------------------------------------------------
[INFO] Reactor Summary:
[INFO] 
[INFO] nutch-parent ...................................... FAILURE [16.092s]
[INFO] Apache Nutch ...................................... SKIPPED
[INFO] nutch-plugins ..................................... SKIPPED
[INFO] creativecommons ................................... SKIPPED
[INFO] feed .............................................. SKIPPED
[INFO] headings .......................................... SKIPPED
[INFO] index-anchor ...................................... SKIPPED
[INFO] index-basic ....................................... SKIPPED
[INFO] index-geoip ....................................... SKIPPED
[INFO] index-links ....................................... SKIPPED
[INFO] index-metadata .................................... SKIPPED
[INFO] index-more ........................................ SKIPPED
[INFO] index-replace ..................................... SKIPPED
[INFO] index-static ...................................... SKIPPED
[INFO] indexer-cloudsearch ............................... SKIPPED
[INFO] indexer-dummy ..................................... SKIPPED
[INFO] indexer-elastic ................................... SKIPPED
[INFO] indexer-solr ...................................... SKIPPED
[INFO] language-identifier ............................... SKIPPED
[INFO] lib-htmlunit ...................................... SKIPPED
[INFO] lib-http .......................................... SKIPPED
[INFO] lib-nekohtml ...................................... SKIPPED
[INFO] lib-regex-filter .................................. SKIPPED
[INFO] lib-selenium ...................................... SKIPPED
[INFO] lib-xml ........................................... SKIPPED
[INFO] microformats-reltag ............................... SKIPPED
[INFO] mimetype-filter ................................... SKIPPED
[INFO] nutch-extensionpoints ............................. SKIPPED
[INFO] parse-ext ......................................... SKIPPED
[INFO] parse-html ........................................ SKIPPED
[INFO] parse-js .......................................... SKIPPED
[INFO] parse-metatags .................................... SKIPPED
[INFO] parse-replace ..................................... SKIPPED
[INFO] parse-swf ......................................... SKIPPED
[INFO] parse-tika ........................................ SKIPPED
[INFO] parse-zip ......................................... SKIPPED
[INFO] parsefilter-naivebayes ............................ SKIPPED
[INFO] parsefilter-regex ................................. SKIPPED
[INFO] plugin ............................................ SKIPPED
[INFO] protocol-file ..................................... SKIPPED
[INFO] protocol-ftp ...................................... SKIPPED
[INFO] protocol-htmlunit ................................. SKIPPED
[INFO] protocol-http ..................................... SKIPPED
[INFO] protocol-httpclient ............................... SKIPPED
[INFO] protocol-interactiveselenium ...................... SKIPPED
[INFO] protocol-selenium ................................. SKIPPED
[INFO] scoring-depth ..................................... SKIPPED
[INFO] scoring-link ...................................... SKIPPED
[INFO] scoring-opic ...................................... SKIPPED
[INFO] scoring-similarity ................................ SKIPPED
[INFO] subcollection ..................................... SKIPPED
[INFO] tld ............................................... SKIPPED
[INFO] urlfilter-automaton ............................... SKIPPED
[INFO] urlfilter-domain .................................. SKIPPED
[INFO] urlfilter-domainblacklist ......................... SKIPPED
[INFO] urlfilter-regex ................................... SKIPPED
[INFO] urlfilter-ignoreexempt ............................ SKIPPED
[INFO] urlfilter-prefix .................................. SKIPPED
[INFO] urlfilter-suffix .................................. SKIPPED
[INFO] urlfilter-validator ............................... SKIPPED
[INFO] urlmeta ........................................... SKIPPED
[INFO] urlnormalizer-ajax ................................ SKIPPED
[INFO] urlnormalizer-basic ............................... SKIPPED
[INFO] urlnormalizer-host ................................ SKIPPED
[INFO] urlnormalizer-pass ................................ SKIPPED
[INFO] urlnormalizer-protocol ............................ SKIPPED
[INFO] urlnormalizer-querystring ......................... SKIPPED
[INFO] urlnormalizer-regex ............................... SKIPPED
[INFO] urlnormalizer-slash ............................... SKIPPED
[INFO] ------------------------------------------------------------------------
[INFO] BUILD FAILURE
[INFO] ------------------------------------------------------------------------
[INFO] Total time: 26.125s
[INFO] Finished at: Sat Jul 16 20:22:47 UTC 2016
[INFO] Final Memory: 22M/251M
[INFO] ------------------------------------------------------------------------
Waiting for Jenkins to finish collecting data[ERROR] Failed to execute goal org.apache.maven.plugins:maven-deploy-plugin:2.7:deploy
(default-deploy) on project nutch-parent: Deployment failed: repository element was not specified
in the POM inside distributionManagement element or in -DaltDeploymentRepository=id::layout::url
parameter -> [Help 1]
[ERROR] 
[ERROR] To see the full stack trace of the errors, re-run Maven with the -e switch.
[ERROR] Re-run Maven using the -X switch to enable full debug logging.
[ERROR] 
[ERROR] For more information about the errors and possible solutions, please read the following
articles:
[ERROR] [Help 1] http://cwiki.apache.org/confluence/display/MAVEN/MojoExecutionException

[JENKINS] Archiving <https://builds.apache.org/job/Nutch-2292/ws/nutch-plugins/feed/pom.xml>
to org.apache.nutch/feed/1.13-SNAPSHOT/feed-1.13-SNAPSHOT.pom
No prior successful build to compare, so performing full copy of artifacts
[JENKINS] Archiving <https://builds.apache.org/job/Nutch-2292/ws/nutch-plugins/parse-metatags/pom.xml>
to org.apache.nutch/parse-metatags/1.13-SNAPSHOT/parse-metatags-1.13-SNAPSHOT.pom
No prior successful build to compare, so performing full copy of artifacts
[JENKINS] Archiving <https://builds.apache.org/job/Nutch-2292/ws/nutch-plugins/parse-swf/pom.xml>
to org.apache.nutch/parse-swf/1.13-SNAPSHOT/parse-swf-1.13-SNAPSHOT.pom
No prior successful build to compare, so performing full copy of artifacts
[JENKINS] Archiving <https://builds.apache.org/job/Nutch-2292/ws/nutch-plugins/protocol-httpclient/pom.xml>
to org.apache.nutch/protocol-httpclient/1.13-SNAPSHOT/protocol-httpclient-1.13-SNAPSHOT.pom
No prior successful build to compare, so performing full copy of artifacts
[JENKINS] Archiving <https://builds.apache.org/job/Nutch-2292/ws/nutch-plugins/urlfilter-domainblacklist/pom.xml>
to org.apache.nutch/urlfilter-domainblacklist/1.13-SNAPSHOT/urlfilter-domainblacklist-1.13-SNAPSHOT.pom
No prior successful build to compare, so performing full copy of artifacts
[JENKINS] Archiving <https://builds.apache.org/job/Nutch-2292/ws/nutch-plugins/urlfilter-regex/pom.xml>
to org.apache.nutch/urlfilter-regex/1.13-SNAPSHOT/urlfilter-regex-1.13-SNAPSHOT.pom
No prior successful build to compare, so performing full copy of artifacts
[JENKINS] Archiving <https://builds.apache.org/job/Nutch-2292/ws/nutch-plugins/lib-xml/pom.xml>
to org.apache.nutch/lib-xml/1.13-SNAPSHOT/lib-xml-1.13-SNAPSHOT.pom
No prior successful build to compare, so performing full copy of artifacts
[JENKINS] Archiving <https://builds.apache.org/job/Nutch-2292/ws/nutch-plugins/urlnormalizer-protocol/pom.xml>
to org.apache.nutch/urlnormalizer-protocol/1.13-SNAPSHOT/urlnormalizer-protocol-1.13-SNAPSHOT.pom
No prior successful build to compare, so performing full copy of artifacts
[JENKINS] Archiving <https://builds.apache.org/job/Nutch-2292/ws/nutch-plugins/microformats-reltag/pom.xml>
to org.apache.nutch/microformats-reltag/1.13-SNAPSHOT/microformats-reltag-1.13-SNAPSHOT.pom
No prior successful build to compare, so performing full copy of artifacts
[JENKINS] Archiving <https://builds.apache.org/job/Nutch-2292/ws/nutch-plugins/parse-replace/pom.xml>
to org.apache.nutch/parse-replace/1.13-SNAPSHOT/parse-replace-1.13-SNAPSHOT.pom
No prior successful build to compare, so performing full copy of artifacts
[JENKINS] Archiving <https://builds.apache.org/job/Nutch-2292/ws/nutch-plugins/language-identifier/pom.xml>
to org.apache.nutch/language-identifier/1.13-SNAPSHOT/language-identifier-1.13-SNAPSHOT.pom
No prior successful build to compare, so performing full copy of artifacts
[JENKINS] Archiving <https://builds.apache.org/job/Nutch-2292/ws/nutch-plugins/urlnormalizer-basic/pom.xml>
to org.apache.nutch/urlnormalizer-basic/1.13-SNAPSHOT/urlnormalizer-basic-1.13-SNAPSHOT.pom
No prior successful build to compare, so performing full copy of artifacts
[JENKINS] Archiving <https://builds.apache.org/job/Nutch-2292/ws/nutch-plugins/urlfilter-validator/pom.xml>
to org.apache.nutch/urlfilter-validator/1.13-SNAPSHOT/urlfilter-validator-1.13-SNAPSHOT.pom
No prior successful build to compare, so performing full copy of artifacts
[JENKINS] Archiving <https://builds.apache.org/job/Nutch-2292/ws/nutch-plugins/urlfilter-ignoreexempt/pom.xml>
to org.apache.nutch/urlfilter-ignoreexempt/1.13-SNAPSHOT/urlfilter-ignoreexempt-1.13-SNAPSHOT.pom
No prior successful build to compare, so performing full copy of artifacts
[JENKINS] Archiving <https://builds.apache.org/job/Nutch-2292/ws/nutch-plugins/lib-htmlunit/pom.xml>
to org.apache.nutch/lib-htmlunit/1.13-SNAPSHOT/lib-htmlunit-1.13-SNAPSHOT.pom
No prior successful build to compare, so performing full copy of artifacts
[JENKINS] Archiving <https://builds.apache.org/job/Nutch-2292/ws/nutch-plugins/parse-html/pom.xml>
to org.apache.nutch/parse-html/1.13-SNAPSHOT/parse-html-1.13-SNAPSHOT.pom
No prior successful build to compare, so performing full copy of artifacts
[JENKINS] Archiving <https://builds.apache.org/job/Nutch-2292/ws/nutch-plugins/urlnormalizer-querystring/pom.xml>
to org.apache.nutch/urlnormalizer-querystring/1.13-SNAPSHOT/urlnormalizer-querystring-1.13-SNAPSHOT.pom
No prior successful build to compare, so performing full copy of artifacts
[JENKINS] Archiving <https://builds.apache.org/job/Nutch-2292/ws/nutch-plugins/lib-regex-filter/pom.xml>
to org.apache.nutch/lib-regex-filter/1.13-SNAPSHOT/lib-regex-filter-1.13-SNAPSHOT.pom
No prior successful build to compare, so performing full copy of artifacts
[JENKINS] Archiving <https://builds.apache.org/job/Nutch-2292/ws/nutch-plugins/parsefilter-regex/pom.xml>
to org.apache.nutch/parsefilter-regex/1.13-SNAPSHOT/parsefilter-regex-1.13-SNAPSHOT.pom
No prior successful build to compare, so performing full copy of artifacts
[JENKINS] Archiving <https://builds.apache.org/job/Nutch-2292/ws/nutch-core/pom.xml>
to org.apache.nutch/nutch-core/1.13-SNAPSHOT/nutch-core-1.13-SNAPSHOT.pom
No prior successful build to compare, so performing full copy of artifacts
[JENKINS] Archiving <https://builds.apache.org/job/Nutch-2292/ws/nutch-plugins/urlmeta/pom.xml>
to org.apache.nutch/urlmeta/1.13-SNAPSHOT/urlmeta-1.13-SNAPSHOT.pom
No prior successful build to compare, so performing full copy of artifacts
[JENKINS] Archiving <https://builds.apache.org/job/Nutch-2292/ws/nutch-plugins/index-geoip/pom.xml>
to org.apache.nutch/index-geoip/1.13-SNAPSHOT/index-geoip-1.13-SNAPSHOT.pom
No prior successful build to compare, so performing full copy of artifacts
[JENKINS] Archiving <https://builds.apache.org/job/Nutch-2292/ws/nutch-plugins/scoring-depth/pom.xml>
to org.apache.nutch/scoring-depth/1.13-SNAPSHOT/scoring-depth-1.13-SNAPSHOT.pom
No prior successful build to compare, so performing full copy of artifacts
[JENKINS] Archiving <https://builds.apache.org/job/Nutch-2292/ws/nutch-plugins/protocol-ftp/pom.xml>
to org.apache.nutch/protocol-ftp/1.13-SNAPSHOT/protocol-ftp-1.13-SNAPSHOT.pom
No prior successful build to compare, so performing full copy of artifacts
[JENKINS] Archiving <https://builds.apache.org/job/Nutch-2292/ws/nutch-plugins/parse-tika/pom.xml>
to org.apache.nutch/parse-tika/1.13-SNAPSHOT/parse-tika-1.13-SNAPSHOT.pom
No prior successful build to compare, so performing full copy of artifacts
[JENKINS] Archiving <https://builds.apache.org/job/Nutch-2292/ws/nutch-plugins/protocol-htmlunit/pom.xml>
to org.apache.nutch/protocol-htmlunit/1.13-SNAPSHOT/protocol-htmlunit-1.13-SNAPSHOT.pom
No prior successful build to compare, so performing full copy of artifacts
[JENKINS] Archiving <https://builds.apache.org/job/Nutch-2292/ws/nutch-plugins/lib-nekohtml/pom.xml>
to org.apache.nutch/lib-nekohtml/1.13-SNAPSHOT/lib-nekohtml-1.13-SNAPSHOT.pom
No prior successful build to compare, so performing full copy of artifacts
[JENKINS] Archiving <https://builds.apache.org/job/Nutch-2292/ws/nutch-plugins/urlnormalizer-regex/pom.xml>
to org.apache.nutch/urlnormalizer-regex/1.13-SNAPSHOT/urlnormalizer-regex-1.13-SNAPSHOT.pom
No prior successful build to compare, so performing full copy of artifacts
[JENKINS] Archiving <https://builds.apache.org/job/Nutch-2292/ws/nutch-plugins/index-basic/pom.xml>
to org.apache.nutch/index-basic/1.13-SNAPSHOT/index-basic-1.13-SNAPSHOT.pom
No prior successful build to compare, so performing full copy of artifacts
[JENKINS] Archiving <https://builds.apache.org/job/Nutch-2292/ws/nutch-plugins/index-more/pom.xml>
to org.apache.nutch/index-more/1.13-SNAPSHOT/index-more-1.13-SNAPSHOT.pom
No prior successful build to compare, so performing full copy of artifacts
[JENKINS] Archiving <https://builds.apache.org/job/Nutch-2292/ws/nutch-plugins/plugin/pom.xml>
to org.apache.nutch/plugin/1.13-SNAPSHOT/plugin-1.13-SNAPSHOT.pom
No prior successful build to compare, so performing full copy of artifacts
[JENKINS] Archiving <https://builds.apache.org/job/Nutch-2292/ws/nutch-plugins/protocol-http/pom.xml>
to org.apache.nutch/protocol-http/1.13-SNAPSHOT/protocol-http-1.13-SNAPSHOT.pom
No prior successful build to compare, so performing full copy of artifacts
[JENKINS] Archiving <https://builds.apache.org/job/Nutch-2292/ws/nutch-plugins/scoring-similarity/pom.xml>
to org.apache.nutch/scoring-similarity/1.13-SNAPSHOT/scoring-similarity-1.13-SNAPSHOT.pom
No prior successful build to compare, so performing full copy of artifacts
[JENKINS] Archiving <https://builds.apache.org/job/Nutch-2292/ws/nutch-plugins/parsefilter-naivebayes/pom.xml>
to org.apache.nutch/parsefilter-naivebayes/1.13-SNAPSHOT/parsefilter-naivebayes-1.13-SNAPSHOT.pom
No prior successful build to compare, so performing full copy of artifacts
[JENKINS] Archiving <https://builds.apache.org/job/Nutch-2292/ws/nutch-plugins/index-links/pom.xml>
to org.apache.nutch/index-links/1.13-SNAPSHOT/index-links-1.13-SNAPSHOT.pom
No prior successful build to compare, so performing full copy of artifacts
[JENKINS] Archiving <https://builds.apache.org/job/Nutch-2292/ws/nutch-plugins/urlnormalizer-host/pom.xml>
to org.apache.nutch/urlnormalizer-host/1.13-SNAPSHOT/urlnormalizer-host-1.13-SNAPSHOT.pom
No prior successful build to compare, so performing full copy of artifacts
[JENKINS] Archiving <https://builds.apache.org/job/Nutch-2292/ws/nutch-plugins/indexer-solr/pom.xml>
to org.apache.nutch/indexer-solr/1.13-SNAPSHOT/indexer-solr-1.13-SNAPSHOT.pom
No prior successful build to compare, so performing full copy of artifacts
[JENKINS] Archiving <https://builds.apache.org/job/Nutch-2292/ws/nutch-plugins/nutch-extensionpoints/pom.xml>
to org.apache.nutch/nutch-extensionpoints/1.13-SNAPSHOT/nutch-extensionpoints-1.13-SNAPSHOT.pom
No prior successful build to compare, so performing full copy of artifacts
[JENKINS] Archiving <https://builds.apache.org/job/Nutch-2292/ws/nutch-plugins/protocol-file/pom.xml>
to org.apache.nutch/protocol-file/1.13-SNAPSHOT/protocol-file-1.13-SNAPSHOT.pom
No prior successful build to compare, so performing full copy of artifacts
[JENKINS] Archiving <https://builds.apache.org/job/Nutch-2292/ws/nutch-plugins/creativecommons/pom.xml>
to org.apache.nutch/creativecommons/1.13-SNAPSHOT/creativecommons-1.13-SNAPSHOT.pom
No prior successful build to compare, so performing full copy of artifacts
[JENKINS] Archiving <https://builds.apache.org/job/Nutch-2292/ws/nutch-plugins/urlfilter-suffix/pom.xml>
to org.apache.nutch/urlfilter-suffix/1.13-SNAPSHOT/urlfilter-suffix-1.13-SNAPSHOT.pom
No prior successful build to compare, so performing full copy of artifacts
[JENKINS] Archiving <https://builds.apache.org/job/Nutch-2292/ws/nutch-plugins/urlfilter-domain/pom.xml>
to org.apache.nutch/urlfilter-domain/1.13-SNAPSHOT/urlfilter-domain-1.13-SNAPSHOT.pom
No prior successful build to compare, so performing full copy of artifacts
[JENKINS] Archiving <https://builds.apache.org/job/Nutch-2292/ws/nutch-plugins/protocol-interactiveselenium/pom.xml>
to org.apache.nutch/protocol-interactiveselenium/1.13-SNAPSHOT/protocol-interactiveselenium-1.13-SNAPSHOT.pom
No prior successful build to compare, so performing full copy of artifacts
[JENKINS] Archiving <https://builds.apache.org/job/Nutch-2292/ws/nutch-plugins/mimetype-filter/pom.xml>
to org.apache.nutch/mimetype-filter/1.13-SNAPSHOT/mimetype-filter-1.13-SNAPSHOT.pom
No prior successful build to compare, so performing full copy of artifacts
[JENKINS] Archiving <https://builds.apache.org/job/Nutch-2292/ws/nutch-plugins/parse-zip/pom.xml>
to org.apache.nutch/parse-zip/1.13-SNAPSHOT/parse-zip-1.13-SNAPSHOT.pom
No prior successful build to compare, so performing full copy of artifacts
[JENKINS] Archiving <https://builds.apache.org/job/Nutch-2292/ws/nutch-plugins/urlfilter-prefix/pom.xml>
to org.apache.nutch/urlfilter-prefix/1.13-SNAPSHOT/urlfilter-prefix-1.13-SNAPSHOT.pom
No prior successful build to compare, so performing full copy of artifacts
[JENKINS] Archiving <https://builds.apache.org/job/Nutch-2292/ws/nutch-plugins/index-replace/pom.xml>
to org.apache.nutch/index-replace/1.13-SNAPSHOT/index-replace-1.13-SNAPSHOT.pom
No prior successful build to compare, so performing full copy of artifacts
[JENKINS] Archiving <https://builds.apache.org/job/Nutch-2292/ws/nutch-plugins/headings/pom.xml>
to org.apache.nutch/headings/1.13-SNAPSHOT/headings-1.13-SNAPSHOT.pom
No prior successful build to compare, so performing full copy of artifacts
[JENKINS] Archiving <https://builds.apache.org/job/Nutch-2292/ws/nutch-plugins/urlnormalizer-pass/pom.xml>
to org.apache.nutch/urlnormalizer-pass/1.13-SNAPSHOT/urlnormalizer-pass-1.13-SNAPSHOT.pom
No prior successful build to compare, so performing full copy of artifacts
[JENKINS] Archiving <https://builds.apache.org/job/Nutch-2292/ws/nutch-plugins/scoring-link/pom.xml>
to org.apache.nutch/scoring-link/1.13-SNAPSHOT/scoring-link-1.13-SNAPSHOT.pom
No prior successful build to compare, so performing full copy of artifacts
[JENKINS] Archiving <https://builds.apache.org/job/Nutch-2292/ws/nutch-plugins/subcollection/pom.xml>
to org.apache.nutch/subcollection/1.13-SNAPSHOT/subcollection-1.13-SNAPSHOT.pom
No prior successful build to compare, so performing full copy of artifacts
[JENKINS] Archiving <https://builds.apache.org/job/Nutch-2292/ws/nutch-plugins/indexer-cloudsearch/pom.xml>
to org.apache.nutch/indexer-cloudsearch/1.13-SNAPSHOT/indexer-cloudsearch-1.13-SNAPSHOT.pom
No prior successful build to compare, so performing full copy of artifacts
[JENKINS] Archiving <https://builds.apache.org/job/Nutch-2292/ws/nutch-plugins/parse-js/pom.xml>
to org.apache.nutch/parse-js/1.13-SNAPSHOT/parse-js-1.13-SNAPSHOT.pom
No prior successful build to compare, so performing full copy of artifacts
[JENKINS] Archiving <https://builds.apache.org/job/Nutch-2292/ws/nutch-plugins/protocol-selenium/pom.xml>
to org.apache.nutch/protocol-selenium/1.13-SNAPSHOT/protocol-selenium-1.13-SNAPSHOT.pom
No prior successful build to compare, so performing full copy of artifacts
[JENKINS] Archiving <https://builds.apache.org/job/Nutch-2292/ws/nutch-plugins/tld/pom.xml>
to org.apache.nutch/tld/1.13-SNAPSHOT/tld-1.13-SNAPSHOT.pom
No prior successful build to compare, so performing full copy of artifacts
[JENKINS] Archiving <https://builds.apache.org/job/Nutch-2292/ws/pom.xml> to org.apache.nutch/nutch-parent/1.13-SNAPSHOT/nutch-parent-1.13-SNAPSHOT.pom
No prior successful build to compare, so performing full copy of artifacts
[JENKINS] Archiving <https://builds.apache.org/job/Nutch-2292/ws/nutch-plugins/urlnormalizer-ajax/pom.xml>
to org.apache.nutch/urlnormalizer-ajax/1.13-SNAPSHOT/urlnormalizer-ajax-1.13-SNAPSHOT.pom
No prior successful build to compare, so performing full copy of artifacts
[JENKINS] Archiving <https://builds.apache.org/job/Nutch-2292/ws/nutch-plugins/urlfilter-automaton/pom.xml>
to org.apache.nutch/urlfilter-automaton/1.13-SNAPSHOT/urlfilter-automaton-1.13-SNAPSHOT.pom
No prior successful build to compare, so performing full copy of artifacts
[JENKINS] Archiving <https://builds.apache.org/job/Nutch-2292/ws/nutch-plugins/indexer-dummy/pom.xml>
to org.apache.nutch/indexer-dummy/1.13-SNAPSHOT/indexer-dummy-1.13-SNAPSHOT.pom
No prior successful build to compare, so performing full copy of artifacts
[JENKINS] Archiving <https://builds.apache.org/job/Nutch-2292/ws/nutch-plugins/lib-selenium/pom.xml>
to org.apache.nutch/lib-selenium/1.13-SNAPSHOT/lib-selenium-1.13-SNAPSHOT.pom
No prior successful build to compare, so performing full copy of artifacts
[JENKINS] Archiving <https://builds.apache.org/job/Nutch-2292/ws/nutch-plugins/index-static/pom.xml>
to org.apache.nutch/index-static/1.13-SNAPSHOT/index-static-1.13-SNAPSHOT.pom
No prior successful build to compare, so performing full copy of artifacts
[JENKINS] Archiving <https://builds.apache.org/job/Nutch-2292/ws/nutch-plugins/scoring-opic/pom.xml>
to org.apache.nutch/scoring-opic/1.13-SNAPSHOT/scoring-opic-1.13-SNAPSHOT.pom
No prior successful build to compare, so performing full copy of artifacts
[JENKINS] Archiving <https://builds.apache.org/job/Nutch-2292/ws/nutch-plugins/parse-ext/pom.xml>
to org.apache.nutch/parse-ext/1.13-SNAPSHOT/parse-ext-1.13-SNAPSHOT.pom
No prior successful build to compare, so performing full copy of artifacts
[JENKINS] Archiving <https://builds.apache.org/job/Nutch-2292/ws/nutch-plugins/index-anchor/pom.xml>
to org.apache.nutch/index-anchor/1.13-SNAPSHOT/index-anchor-1.13-SNAPSHOT.pom
No prior successful build to compare, so performing full copy of artifacts
[JENKINS] Archiving <https://builds.apache.org/job/Nutch-2292/ws/nutch-plugins/index-metadata/pom.xml>
to org.apache.nutch/index-metadata/1.13-SNAPSHOT/index-metadata-1.13-SNAPSHOT.pom
No prior successful build to compare, so performing full copy of artifacts
[JENKINS] Archiving <https://builds.apache.org/job/Nutch-2292/ws/nutch-plugins/indexer-elastic/pom.xml>
to org.apache.nutch/indexer-elastic/1.13-SNAPSHOT/indexer-elastic-1.13-SNAPSHOT.pom
No prior successful build to compare, so performing full copy of artifacts
[JENKINS] Archiving <https://builds.apache.org/job/Nutch-2292/ws/nutch-plugins/urlnormalizer-slash/pom.xml>
to org.apache.nutch/urlnormalizer-slash/1.13-SNAPSHOT/urlnormalizer-slash-1.13-SNAPSHOT.pom
No prior successful build to compare, so performing full copy of artifacts
[JENKINS] Archiving <https://builds.apache.org/job/Nutch-2292/ws/nutch-plugins/lib-http/pom.xml>
to org.apache.nutch/lib-http/1.13-SNAPSHOT/lib-http-1.13-SNAPSHOT.pom
No prior successful build to compare, so performing full copy of artifacts
[JENKINS] Archiving <https://builds.apache.org/job/Nutch-2292/ws/nutch-plugins/pom.xml>
to org.apache.nutch/nutch-plugins/1.13-SNAPSHOT/nutch-plugins-1.13-SNAPSHOT.pom
No prior successful build to compare, so performing full copy of artifacts
channel stopped

Mime
View raw message