any23-dev mailing list archives

Site index · List index
Message view « Date » · « Thread »
Top « Date » · « Thread »
From Apache Jenkins Server <jenk...@builds.apache.org>
Subject Build failed in Jenkins: Any23-trunk #1279
Date Mon, 23 Feb 2015 02:02:52 GMT
See <https://builds.apache.org/job/Any23-trunk/1279/>

------------------------------------------
Started by timer
Building remotely on ubuntu-4 (docker Ubuntu ubuntu4 ubuntu) in workspace <https://builds.apache.org/job/Any23-trunk/ws/>
 > git rev-parse --is-inside-work-tree # timeout=10
Fetching changes from the remote Git repository
 > git config remote.origin.url https://git-wip-us.apache.org/repos/asf/any23.git # timeout=10
Fetching upstream changes from https://git-wip-us.apache.org/repos/asf/any23.git
 > git --version # timeout=10
 > git fetch --tags --progress https://git-wip-us.apache.org/repos/asf/any23.git +refs/heads/*:refs/remotes/origin/*
 > git rev-parse origin/master^{commit} # timeout=10
Checking out Revision cab71ae64a6b3fa0ce01ff8c11464ed1f802f43d (origin/master)
 > git config core.sparsecheckout # timeout=10
 > git checkout -f cab71ae64a6b3fa0ce01ff8c11464ed1f802f43d
 > git rev-list cab71ae64a6b3fa0ce01ff8c11464ed1f802f43d # timeout=10
Parsing POMs
maven3-agent.jar already up to date
maven3-interceptor.jar already up to date
maven3-interceptor-commons.jar already up to date
[Any23-trunk] $ /home/jenkins/tools/java/latest1.7/bin/java -Xmx2g -Xms256m -XX:MaxPermSize=512m
-cp /home/jenkins/jenkins-slave/maven3-agent.jar:/home/jenkins/tools/maven/apache-maven-3.0.4/boot/plexus-classworlds-2.4.jar
org.jvnet.hudson.maven3.agent.Maven3Main /home/jenkins/tools/maven/apache-maven-3.0.4 /home/jenkins/jenkins-slave/slave.jar
/home/jenkins/jenkins-slave/maven3-interceptor.jar /home/jenkins/jenkins-slave/maven3-interceptor-commons.jar
46185
<===[JENKINS REMOTING CAPACITY]===>   channel started
Executing Maven:  -B -f <https://builds.apache.org/job/Any23-trunk/ws/pom.xml> -Dmaven.repo.local=/home/jenkins/jenkins-slave/maven-repositories/0
clean deploy javadoc:aggregate
[INFO] Scanning for projects...
[INFO] ------------------------------------------------------------------------
[INFO] Reactor Build Order:
[INFO] 
[INFO] Apache Any23
[INFO] Apache Any23 :: Base API
[INFO] Apache Any23 :: Test Resources
[INFO] Apache Any23 :: NQuads Parser and Writer
[INFO] Apache Any23 :: CSV Utilities
[INFO] Apache Any23 :: Mime Type Detection
[INFO] Apache Any23 :: Encoding Detection
[INFO] Apache Any23 :: Core
[INFO] Apache Any23 :: Plugins :: Basic Crawler
[INFO] Apache Any23 :: Plugins :: HTML Scraper
[INFO] Apache Any23 :: Plugins :: Office Scraper
[INFO] Apache Any23 :: Plugins :: Integration Test
[INFO] Apache Any23 :: Service
[INFO]                                                                         
[INFO] ------------------------------------------------------------------------
[INFO] Building Apache Any23 1.2-SNAPSHOT
[INFO] ------------------------------------------------------------------------
[INFO] 
[INFO] --- maven-clean-plugin:2.4.1:clean (default-clean) @ apache-any23 ---
[INFO] Deleting <https://builds.apache.org/job/Any23-trunk/ws/target>
[INFO] 
[INFO] --- cobertura-maven-plugin:2.5.1:clean (default) @ apache-any23 ---
[INFO] Skipping cobertura mojo for project with packaging type 'pom'
[INFO] 
[INFO] --- buildnumber-maven-plugin:1.0:create (default) @ apache-any23 ---
[INFO] Checking for local modifications: skipped.
[INFO] Updating project files from SCM: skipped.
[INFO] Executing: /bin/sh -c cd <https://builds.apache.org/job/Any23-trunk/ws/> &&
git show
[INFO] Working directory: <https://builds.apache.org/job/Any23-trunk/ws/>
[INFO] Storing buildNumber: null at timestamp: 1424656820014
[INFO] Executing: /bin/sh -c cd <https://builds.apache.org/job/Any23-trunk/ws/> &&
git show
[INFO] Working directory: <https://builds.apache.org/job/Any23-trunk/ws/>
[INFO] Storing buildScmBranch: UNKNOWN
[INFO] 
[INFO] --- maven-site-plugin:3.0:attach-descriptor (attach-descriptor) @ apache-any23 ---
[INFO] 
[INFO] --- maven-assembly-plugin:2.3:single (assembly) @ apache-any23 ---
[INFO] Reading assembly descriptor: <https://builds.apache.org/job/Any23-trunk/ws/src/main/assembly/src.xml>
[INFO] Building tar: <https://builds.apache.org/job/Any23-trunk/ws/target/apache-any23-1.2-SNAPSHOT-src.tar.gz>
[INFO] Building zip: <https://builds.apache.org/job/Any23-trunk/ws/target/apache-any23-1.2-SNAPSHOT-src.zip>
[INFO] 
[INFO] --- maven-install-plugin:2.3.1:install (default-install) @ apache-any23 ---
[INFO] Installing <https://builds.apache.org/job/Any23-trunk/ws/pom.xml> to /home/jenkins/jenkins-slave/maven-repositories/0/org/apache/any23/apache-any23/1.2-SNAPSHOT/apache-any23-1.2-SNAPSHOT.pom
[INFO] Installing <https://builds.apache.org/job/Any23-trunk/ws/target/apache-any23-1.2-SNAPSHOT-site.xml>
to /home/jenkins/jenkins-slave/maven-repositories/0/org/apache/any23/apache-any23/1.2-SNAPSHOT/apache-any23-1.2-SNAPSHOT-site.xml
[INFO] Installing <https://builds.apache.org/job/Any23-trunk/ws/target/apache-any23-1.2-SNAPSHOT-src.tar.gz>
to /home/jenkins/jenkins-slave/maven-repositories/0/org/apache/any23/apache-any23/1.2-SNAPSHOT/apache-any23-1.2-SNAPSHOT-src.tar.gz
[INFO] Installing <https://builds.apache.org/job/Any23-trunk/ws/target/apache-any23-1.2-SNAPSHOT-src.zip>
to /home/jenkins/jenkins-slave/maven-repositories/0/org/apache/any23/apache-any23/1.2-SNAPSHOT/apache-any23-1.2-SNAPSHOT-src.zip
[INFO] 
[INFO] --- maven-deploy-plugin:2.7:deploy (default-deploy) @ apache-any23 ---
Downloading: https://repository.apache.org/content/repositories/snapshots/org/apache/any23/apache-any23/1.2-SNAPSHOT/maven-metadata.xml
[WARNING] Checksum validation failed, could not read expected checksum: Failed to transfer
file: https://repository.apache.org/content/repositories/snapshots/org/apache/any23/apache-any23/1.2-SNAPSHOT/maven-metadata.xml.sha1.
Return code is: 502, ReasonPhrase:Proxy Error. for https://repository.apache.org/content/repositories/snapshots/org/apache/any23/apache-any23/1.2-SNAPSHOT/maven-metadata.xml
[WARNING] Could not transfer metadata org.apache.any23:apache-any23:1.2-SNAPSHOT/maven-metadata.xml
from/to apache.snapshots.https (https://repository.apache.org/content/repositories/snapshots):
Failed to transfer file: https://repository.apache.org/content/repositories/snapshots/org/apache/any23/apache-any23/1.2-SNAPSHOT/maven-metadata.xml.
Return code is: 502, ReasonPhrase:Proxy Error.
[INFO]                                                                         
[INFO] ------------------------------------------------------------------------
[INFO] Skipping Apache Any23
[INFO] This project has been banned from the build due to previous failures.
[INFO] ------------------------------------------------------------------------
[INFO] ------------------------------------------------------------------------
[INFO] Reactor Summary:
[INFO] 
[INFO] Apache Any23 ...................................... FAILURE [2:20.530s]
[INFO] Apache Any23 :: Base API .......................... SKIPPED
[INFO] Apache Any23 :: Test Resources .................... SKIPPED
[INFO] Apache Any23 :: NQuads Parser and Writer .......... SKIPPED
[INFO] Apache Any23 :: CSV Utilities ..................... SKIPPED
[INFO] Apache Any23 :: Mime Type Detection ............... SKIPPED
[INFO] Apache Any23 :: Encoding Detection ................ SKIPPED
[INFO] Apache Any23 :: Core .............................. SKIPPED
[INFO] Apache Any23 :: Plugins :: Basic Crawler .......... SKIPPED
[INFO] Apache Any23 :: Plugins :: HTML Scraper ........... SKIPPED
[INFO] Apache Any23 :: Plugins :: Office Scraper ......... SKIPPED
[INFO] Apache Any23 :: Plugins :: Integration Test ....... SKIPPED
[INFO] Apache Any23 :: Service ........................... SKIPPED
[INFO] ------------------------------------------------------------------------
[INFO] BUILD FAILURE
[INFO] ------------------------------------------------------------------------
[INFO] Total time: 2:23.683s
[INFO] Finished at: Mon Feb 23 02:02:38 UTC 2015
[INFO] Final Memory: 24M/313M
[INFO] ------------------------------------------------------------------------
Waiting for Jenkins to finish collecting data[ERROR] Failed to execute goal org.apache.maven.plugins:maven-deploy-plugin:2.7:deploy
(default-deploy) on project apache-any23: Failed to retrieve remote metadata org.apache.any23:apache-any23:1.2-SNAPSHOT/maven-metadata.xml:
Could not transfer metadata org.apache.any23:apache-any23:1.2-SNAPSHOT/maven-metadata.xml
from/to apache.snapshots.https (https://repository.apache.org/content/repositories/snapshots):
Failed to transfer file: https://repository.apache.org/content/repositories/snapshots/org/apache/any23/apache-any23/1.2-SNAPSHOT/maven-metadata.xml.
Return code is: 502, ReasonPhrase:Proxy Error. -> [Help 1]
[ERROR] 
[ERROR] To see the full stack trace of the errors, re-run Maven with the -e switch.
[ERROR] Re-run Maven using the -X switch to enable full debug logging.
[ERROR] 
[ERROR] For more information about the errors and possible solutions, please read the following
articles:
[ERROR] [Help 1] http://cwiki.apache.org/confluence/display/MAVEN/MojoExecutionException

[JENKINS] Archiving <https://builds.apache.org/job/Any23-trunk/ws/core/pom.xml> to org.apache.any23/apache-any23-core/1.2-SNAPSHOT/apache-any23-core-1.2-SNAPSHOT.pom
Sending artifact delta relative to Any23-trunk » Apache Any23 :: Core #1278
Archived 1 artifacts
Archive block size is 32768
Received 0 blocks and 8335 bytes
Compression is 0.0%
Took 1.3 sec
[JENKINS] Archiving <https://builds.apache.org/job/Any23-trunk/ws/test-resources/pom.xml>
to org.apache.any23/apache-any23-test-resources/1.2-SNAPSHOT/apache-any23-test-resources-1.2-SNAPSHOT.pom
Sending artifact delta relative to Any23-trunk » Apache Any23 :: Test Resources #1278
Archived 1 artifacts
Archive block size is 32768
Received 0 blocks and 1824 bytes
Compression is 0.0%
Took 0.19 sec
[JENKINS] Archiving <https://builds.apache.org/job/Any23-trunk/ws/plugins/office-scraper/pom.xml>
to org.apache.any23.plugins/apache-any23-office-scraper/1.0.6-SNAPSHOT/apache-any23-office-scraper-1.0.6-SNAPSHOT.pom
Sending artifact delta relative to Any23-trunk » Apache Any23 :: Plugins :: Office Scraper
#1278
Archived 1 artifacts
Archive block size is 32768
Received 0 blocks and 4276 bytes
Compression is 0.0%
Took 0.26 sec
[JENKINS] Archiving <https://builds.apache.org/job/Any23-trunk/ws/plugins/html-scraper/pom.xml>
to org.apache.any23.plugins/apache-any23-html-scraper/1.0.7-SNAPSHOT/apache-any23-html-scraper-1.0.7-SNAPSHOT.pom
Sending artifact delta relative to Any23-trunk » Apache Any23 :: Plugins :: HTML Scraper
#1278
Archived 1 artifacts
Archive block size is 32768
Received 0 blocks and 4766 bytes
Compression is 0.0%
Took 77 ms
[JENKINS] Archiving <https://builds.apache.org/job/Any23-trunk/ws/service/pom.xml> to
org.apache.any23/apache-any23-service/1.2-SNAPSHOT/apache-any23-service-1.2-SNAPSHOT.pom
Sending artifact delta relative to Any23-trunk » Apache Any23 :: Service #1278
Archived 1 artifacts
Archive block size is 32768
Received 0 blocks and 7071 bytes
Compression is 0.0%
Took 3.6 sec
[JENKINS] Archiving <https://builds.apache.org/job/Any23-trunk/ws/api/pom.xml> to org.apache.any23/apache-any23-api/1.2-SNAPSHOT/apache-any23-api-1.2-SNAPSHOT.pom
Sending artifact delta relative to Any23-trunk » Apache Any23 :: Base API #1278
Archived 1 artifacts
Archive block size is 32768
Received 0 blocks and 2780 bytes
Compression is 0.0%
Took 0.1 sec
[JENKINS] Archiving <https://builds.apache.org/job/Any23-trunk/ws/csvutils/pom.xml>
to org.apache.any23/apache-any23-csvutils/1.2-SNAPSHOT/apache-any23-csvutils-1.2-SNAPSHOT.pom
Sending artifact delta relative to Any23-trunk » Apache Any23 :: CSV Utilities #1278
Archived 1 artifacts
Archive block size is 32768
Received 0 blocks and 2804 bytes
Compression is 0.0%
Took 0.13 sec
[JENKINS] Archiving <https://builds.apache.org/job/Any23-trunk/ws/plugins/integration-test/pom.xml>
to org.apache.any23.plugins/apache-any23-integration-test/1.2-SNAPSHOT/apache-any23-integration-test-1.2-SNAPSHOT.pom
Sending artifact delta relative to Any23-trunk » Apache Any23 :: Plugins :: Integration Test
#1278
Archived 1 artifacts
Archive block size is 32768
Received 0 blocks and 5779 bytes
Compression is 0.0%
Took 0.12 sec
[JENKINS] Archiving <https://builds.apache.org/job/Any23-trunk/ws/pom.xml> to org.apache.any23/apache-any23/1.2-SNAPSHOT/apache-any23-1.2-SNAPSHOT.pom
[JENKINS] Archiving <https://builds.apache.org/job/Any23-trunk/ws/target/apache-any23-1.2-SNAPSHOT-site.xml>
to org.apache.any23/apache-any23/1.2-SNAPSHOT/apache-any23-1.2-SNAPSHOT-site.xml
[JENKINS] Archiving <https://builds.apache.org/job/Any23-trunk/ws/target/apache-any23-1.2-SNAPSHOT-src.tar.gz>
to org.apache.any23/apache-any23/1.2-SNAPSHOT/apache-any23-1.2-SNAPSHOT-src.tar.gz
[JENKINS] Archiving <https://builds.apache.org/job/Any23-trunk/ws/target/apache-any23-1.2-SNAPSHOT-src.zip>
to org.apache.any23/apache-any23/1.2-SNAPSHOT/apache-any23-1.2-SNAPSHOT-src.zip
Sending artifact delta relative to Any23-trunk » Apache Any23 #1278
Archived 4 artifacts
Archive block size is 32768
Received 11 blocks and 3264545 bytes
Compression is 9.9%
Took 1.2 sec
[JENKINS] Archiving <https://builds.apache.org/job/Any23-trunk/ws/plugins/basic-crawler/pom.xml>
to org.apache.any23.plugins/apache-any23-basic-crawler/1.0.6-SNAPSHOT/apache-any23-basic-crawler-1.0.6-SNAPSHOT.pom
Sending artifact delta relative to Any23-trunk » Apache Any23 :: Plugins :: Basic Crawler
#1278
Archived 1 artifacts
Archive block size is 32768
Received 0 blocks and 5170 bytes
Compression is 0.0%
Took 0.24 sec
[JENKINS] Archiving <https://builds.apache.org/job/Any23-trunk/ws/encoding/pom.xml>
to org.apache.any23/apache-any23-encoding/1.2-SNAPSHOT/apache-any23-encoding-1.2-SNAPSHOT.pom
Sending artifact delta relative to Any23-trunk » Apache Any23 :: Encoding Detection #1278
Archived 1 artifacts
Archive block size is 32768
Received 0 blocks and 3108 bytes
Compression is 0.0%
Took 72 ms
[JENKINS] Archiving <https://builds.apache.org/job/Any23-trunk/ws/nquads/pom.xml> to
org.apache.any23/apache-any23-nquads/1.2-SNAPSHOT/apache-any23-nquads-1.2-SNAPSHOT.pom
Sending artifact delta relative to Any23-trunk » Apache Any23 :: NQuads Parser and Writer
#1278
Archived 1 artifacts
Archive block size is 32768
Received 0 blocks and 3605 bytes
Compression is 0.0%
Took 70 ms
[JENKINS] Archiving <https://builds.apache.org/job/Any23-trunk/ws/mime/pom.xml> to org.apache.any23/apache-any23-mime/1.2-SNAPSHOT/apache-any23-mime-1.2-SNAPSHOT.pom
Sending artifact delta relative to Any23-trunk » Apache Any23 :: Mime Type Detection #1278
Archived 1 artifacts
Archive block size is 32768
Received 0 blocks and 4344 bytes
Compression is 0.0%
Took 70 ms
channel stopped

Mime
View raw message