any23-dev mailing list archives

Site index · List index
Message view « Date » · « Thread »
Top « Date » · « Thread »
From Apache Jenkins Server <jenk...@builds.apache.org>
Subject Build failed in Jenkins: Any23-trunk #1241
Date Sun, 18 Jan 2015 02:08:09 GMT
See <https://builds.apache.org/job/Any23-trunk/1241/>

------------------------------------------
[...truncated 6110 lines...]
  [2015-01-18 02:05:11,462] INFO  4821[main] - sun.reflect.GeneratedMethodAccessor8.invoke(?:?)
- jetty-7.0.0.pre5
  [2015-01-18 02:05:11,463] INFO  4822[main] - sun.reflect.GeneratedMethodAccessor8.invoke(?:?)
- Started LocalConnector@0.0.0.0:1
  [2015-01-18 02:05:11,465] INFO  4824[qtp30-1 - Acceptor0 LocalConnector@0.0.0.0:1] - sun.reflect.GeneratedMethodAccessor8.invoke(?:?)
- org.apache.any23.servlet.ServletTest$TestableServlet-24645131: Attempting conversion to
'nt' from POST body
  [2015-01-18 02:05:11,466] INFO  4825[qtp30-1 - Acceptor0 LocalConnector@0.0.0.0:1] - org.apache.any23.extractor.SingleDocumentExtraction.run(SingleDocumentExtraction.java:221)
- Processing http://any23.org/tmp/
  [2015-01-18 02:05:11,471] INFO  4830[qtp30-1 - Acceptor0 LocalConnector@0.0.0.0:1] - sun.reflect.GeneratedMethodAccessor8.invoke(?:?)
- org.apache.any23.servlet.ServletTest$TestableServlet-24645131: Extraction complete, 1 triples
  [2015-01-18 02:05:11,573] INFO  4932[main] - sun.reflect.GeneratedMethodAccessor8.invoke(?:?)
- jetty-7.0.0.pre5
  [2015-01-18 02:05:11,575] INFO  4934[main] - sun.reflect.GeneratedMethodAccessor8.invoke(?:?)
- Started LocalConnector@0.0.0.0:1
  [2015-01-18 02:05:11,576] INFO  4935[qtp31-1 - Acceptor0 LocalConnector@0.0.0.0:1] - sun.reflect.GeneratedMethodAccessor8.invoke(?:?)
- org.apache.any23.servlet.ServletTest$TestableServlet-160737: Attempting conversion to 'turtle'
from POST body
  [2015-01-18 02:05:11,577] INFO  4936[qtp31-1 - Acceptor0 LocalConnector@0.0.0.0:1] - org.apache.any23.extractor.SingleDocumentExtraction.run(SingleDocumentExtraction.java:221)
- Processing http://any23.org/tmp/
  [2015-01-18 02:05:11,600] INFO  4959[qtp31-1 - Acceptor0 LocalConnector@0.0.0.0:1] - sun.reflect.GeneratedMethodAccessor8.invoke(?:?)
- org.apache.any23.servlet.ServletTest$TestableServlet-160737: Extraction complete, 6 triples
  Tests run: 35, Failures: 0, Errors: 0, Skipped: 3, Time elapsed: 5.277 sec - in org.apache.any23.servlet.ServletTest

Results :

Tests run: 35, Failures: 0, Errors: 0, Skipped: 3

[JENKINS] Recording test results
[INFO] 
[INFO] --- maven-assembly-plugin:2.3:single (prepare-package) @ apache-any23-service ---
[INFO] Reading assembly descriptor: <https://builds.apache.org/job/Any23-trunk/ws/service/src/main/assembly/prepare-war-legals.xml>
[INFO] Copying files to <https://builds.apache.org/job/Any23-trunk/ws/service/target/war-legals>
[INFO] 
[INFO] --- maven-war-plugin:2.2:war (default-war) @ apache-any23-service ---
[INFO] Packaging webapp
[INFO] Assembling webapp [apache-any23-service] in [<https://builds.apache.org/job/Any23-trunk/ws/service/target/apache-any23-service-1.2-SNAPSHOT]>
[INFO] Processing war project
[INFO] Copying webapp webResources [<https://builds.apache.org/job/Any23-trunk/ws/service/src/main/resources/]>
to [<https://builds.apache.org/job/Any23-trunk/ws/service/target/apache-any23-service-1.2-SNAPSHOT]>
[INFO] Copying webapp resources [<https://builds.apache.org/job/Any23-trunk/ws/service/src/main/webapp]>
[INFO] Webapp assembled in [178 msecs]
[INFO] Building war: <https://builds.apache.org/job/Any23-trunk/ws/service/target/apache-any23-service-1.2-SNAPSHOT.war>
[INFO] WEB-INF/web.xml already added, skipping
[INFO] 
[INFO] --- maven-site-plugin:3.0:attach-descriptor (attach-descriptor) @ apache-any23-service
---
[INFO] 
[INFO] --- maven-war-plugin:2.2:war (self-contained-war) @ apache-any23-service ---
[INFO] Packaging webapp
[INFO] Assembling webapp [apache-any23-service] in [<https://builds.apache.org/job/Any23-trunk/ws/service/target/apache-any23-service-1.2-SNAPSHOT]>
[INFO] Processing war project
[INFO] Copying webapp webResources [<https://builds.apache.org/job/Any23-trunk/ws/service/target/war-legals/with-deps/]>
to [<https://builds.apache.org/job/Any23-trunk/ws/service/target/apache-any23-service-1.2-SNAPSHOT]>
[INFO] Copying webapp resources [<https://builds.apache.org/job/Any23-trunk/ws/service/src/main/webapp]>
[INFO] Webapp assembled in [111 msecs]
[INFO] Building war: <https://builds.apache.org/job/Any23-trunk/ws/service/target/apache-any23-service-1.2-SNAPSHOT.war>
[INFO] WEB-INF/web.xml already added, skipping
[INFO] 
[INFO] --- maven-war-plugin:2.2:war (war-without-deps) @ apache-any23-service ---
[INFO] Packaging webapp
[INFO] Assembling webapp [apache-any23-service] in [<https://builds.apache.org/job/Any23-trunk/ws/service/target/apache-any23-service-1.2-SNAPSHOT]>
[INFO] Processing war project
[INFO] Copying webapp webResources [<https://builds.apache.org/job/Any23-trunk/ws/service/target/war-legals/without-deps/]>
to [<https://builds.apache.org/job/Any23-trunk/ws/service/target/apache-any23-service-1.2-SNAPSHOT]>
[INFO] Copying webapp resources [<https://builds.apache.org/job/Any23-trunk/ws/service/src/main/webapp]>
[INFO] Webapp assembled in [112 msecs]
[INFO] Building war: <https://builds.apache.org/job/Any23-trunk/ws/service/target/apache-any23-service-1.2-SNAPSHOT-without-deps.war>
[INFO] WEB-INF/web.xml already added, skipping
[INFO] 
[INFO] --- maven-assembly-plugin:2.3:single (assembly) @ apache-any23-service ---
[INFO] Reading assembly descriptor: <https://builds.apache.org/job/Any23-trunk/ws/service/src/main/assembly/with-deps.xml>
[INFO] Reading assembly descriptor: <https://builds.apache.org/job/Any23-trunk/ws/service/src/main/assembly/without-deps.xml>
[INFO] Reading assembly descriptor: <https://builds.apache.org/job/Any23-trunk/ws/service/src/main/assembly/server-embedded.xml>
[INFO] Building tar: <https://builds.apache.org/job/Any23-trunk/ws/service/target/apache-any23-service-1.2-SNAPSHOT-with-deps.tar.gz>
[INFO] Building zip: <https://builds.apache.org/job/Any23-trunk/ws/service/target/apache-any23-service-1.2-SNAPSHOT-with-deps.zip>
[INFO] Building tar: <https://builds.apache.org/job/Any23-trunk/ws/service/target/apache-any23-service-1.2-SNAPSHOT-without-deps.tar.gz>
[INFO] Building zip: <https://builds.apache.org/job/Any23-trunk/ws/service/target/apache-any23-service-1.2-SNAPSHOT-without-deps.zip>
[INFO] Building tar: <https://builds.apache.org/job/Any23-trunk/ws/service/target/apache-any23-service-1.2-SNAPSHOT-server-embedded.tar.gz>
[INFO] Building zip: <https://builds.apache.org/job/Any23-trunk/ws/service/target/apache-any23-service-1.2-SNAPSHOT-server-embedded.zip>
[INFO] 
[INFO] --- maven-install-plugin:2.3.1:install (default-install) @ apache-any23-service ---
[INFO] Installing <https://builds.apache.org/job/Any23-trunk/ws/service/target/apache-any23-service-1.2-SNAPSHOT.war>
to /home/jenkins/jenkins-slave/maven-repositories/1/org/apache/any23/apache-any23-service/1.2-SNAPSHOT/apache-any23-service-1.2-SNAPSHOT.war
[INFO] Installing <https://builds.apache.org/job/Any23-trunk/ws/service/pom.xml> to
/home/jenkins/jenkins-slave/maven-repositories/1/org/apache/any23/apache-any23-service/1.2-SNAPSHOT/apache-any23-service-1.2-SNAPSHOT.pom
[INFO] Installing <https://builds.apache.org/job/Any23-trunk/ws/service/target/apache-any23-service-1.2-SNAPSHOT-without-deps.war>
to /home/jenkins/jenkins-slave/maven-repositories/1/org/apache/any23/apache-any23-service/1.2-SNAPSHOT/apache-any23-service-1.2-SNAPSHOT-without-deps.war
[INFO] Installing <https://builds.apache.org/job/Any23-trunk/ws/service/target/apache-any23-service-1.2-SNAPSHOT-with-deps.tar.gz>
to /home/jenkins/jenkins-slave/maven-repositories/1/org/apache/any23/apache-any23-service/1.2-SNAPSHOT/apache-any23-service-1.2-SNAPSHOT-with-deps.tar.gz
[INFO] Installing <https://builds.apache.org/job/Any23-trunk/ws/service/target/apache-any23-service-1.2-SNAPSHOT-with-deps.zip>
to /home/jenkins/jenkins-slave/maven-repositories/1/org/apache/any23/apache-any23-service/1.2-SNAPSHOT/apache-any23-service-1.2-SNAPSHOT-with-deps.zip
[INFO] Installing <https://builds.apache.org/job/Any23-trunk/ws/service/target/apache-any23-service-1.2-SNAPSHOT-without-deps.tar.gz>
to /home/jenkins/jenkins-slave/maven-repositories/1/org/apache/any23/apache-any23-service/1.2-SNAPSHOT/apache-any23-service-1.2-SNAPSHOT-without-deps.tar.gz
[INFO] Installing <https://builds.apache.org/job/Any23-trunk/ws/service/target/apache-any23-service-1.2-SNAPSHOT-without-deps.zip>
to /home/jenkins/jenkins-slave/maven-repositories/1/org/apache/any23/apache-any23-service/1.2-SNAPSHOT/apache-any23-service-1.2-SNAPSHOT-without-deps.zip
[INFO] Installing <https://builds.apache.org/job/Any23-trunk/ws/service/target/apache-any23-service-1.2-SNAPSHOT-server-embedded.tar.gz>
to /home/jenkins/jenkins-slave/maven-repositories/1/org/apache/any23/apache-any23-service/1.2-SNAPSHOT/apache-any23-service-1.2-SNAPSHOT-server-embedded.tar.gz
[INFO] Installing <https://builds.apache.org/job/Any23-trunk/ws/service/target/apache-any23-service-1.2-SNAPSHOT-server-embedded.zip>
to /home/jenkins/jenkins-slave/maven-repositories/1/org/apache/any23/apache-any23-service/1.2-SNAPSHOT/apache-any23-service-1.2-SNAPSHOT-server-embedded.zip
[INFO] 
[INFO] --- maven-deploy-plugin:2.7:deploy (default-deploy) @ apache-any23-service ---
Downloading: https://repository.apache.org/content/repositories/snapshots/org/apache/any23/apache-any23-service/1.2-SNAPSHOT/maven-metadata.xml
Downloaded: https://repository.apache.org/content/repositories/snapshots/org/apache/any23/apache-any23-service/1.2-SNAPSHOT/maven-metadata.xml
(3 KB at 0.8 KB/sec)
Uploading: https://repository.apache.org/content/repositories/snapshots/org/apache/any23/apache-any23-service/1.2-SNAPSHOT/apache-any23-service-1.2-20150118.020532-170.war
Uploaded: https://repository.apache.org/content/repositories/snapshots/org/apache/any23/apache-any23-service/1.2-SNAPSHOT/apache-any23-service-1.2-20150118.020532-170.war
(29224 KB at 874.5 KB/sec)
Uploading: https://repository.apache.org/content/repositories/snapshots/org/apache/any23/apache-any23-service/1.2-SNAPSHOT/apache-any23-service-1.2-20150118.020532-170.pom
Uploaded: https://repository.apache.org/content/repositories/snapshots/org/apache/any23/apache-any23-service/1.2-SNAPSHOT/apache-any23-service-1.2-20150118.020532-170.pom
(7 KB at 14.7 KB/sec)
Downloading: https://repository.apache.org/content/repositories/snapshots/org/apache/any23/apache-any23-service/maven-metadata.xml
[WARNING] Could not transfer metadata org.apache.any23:apache-any23-service/maven-metadata.xml
from/to apache.snapshots.https (https://repository.apache.org/content/repositories/snapshots):
Failed to transfer file: https://repository.apache.org/content/repositories/snapshots/org/apache/any23/apache-any23-service/maven-metadata.xml.
Return code is: 502, ReasonPhrase:Proxy Error.
[INFO]                                                                         
[INFO] ------------------------------------------------------------------------
[INFO] Skipping Apache Any23
[INFO] This project has been banned from the build due to previous failures.
[INFO] ------------------------------------------------------------------------
[INFO] ------------------------------------------------------------------------
[INFO] Reactor Summary:
[INFO] 
[INFO] Apache Any23 ...................................... SUCCESS [25.330s]
[INFO] Apache Any23 :: Base API .......................... SUCCESS [6.725s]
[INFO] Apache Any23 :: Test Resources .................... SUCCESS [7.317s]
[INFO] Apache Any23 :: NQuads Parser and Writer .......... SUCCESS [20.900s]
[INFO] Apache Any23 :: CSV Utilities ..................... SUCCESS [5.130s]
[INFO] Apache Any23 :: Mime Type Detection ............... SUCCESS [6.965s]
[INFO] Apache Any23 :: Encoding Detection ................ SUCCESS [8.412s]
[INFO] Apache Any23 :: Core .............................. SUCCESS [58.034s]
[INFO] Apache Any23 :: Plugins :: Basic Crawler .......... SUCCESS [45.201s]
[INFO] Apache Any23 :: Plugins :: HTML Scraper ........... SUCCESS [25.404s]
[INFO] Apache Any23 :: Plugins :: Office Scraper ......... SUCCESS [16.579s]
[INFO] Apache Any23 :: Plugins :: Integration Test ....... SUCCESS [45.737s]
[INFO] Apache Any23 :: Service ........................... FAILURE [2:02.093s]
[INFO] ------------------------------------------------------------------------
[INFO] BUILD FAILURE
[INFO] ------------------------------------------------------------------------
[INFO] Total time: 6:46.739s
[INFO] Finished at: Sun Jan 18 02:07:08 UTC 2015
[INFO] Final Memory: 54M/358M
[INFO] ------------------------------------------------------------------------
Waiting for Jenkins to finish collecting data[ERROR] Failed to execute goal org.apache.maven.plugins:maven-deploy-plugin:2.7:deploy
(default-deploy) on project apache-any23-service: Failed to retrieve remote metadata org.apache.any23:apache-any23-service/maven-metadata.xml:
Could not transfer metadata org.apache.any23:apache-any23-service/maven-metadata.xml from/to
apache.snapshots.https (https://repository.apache.org/content/repositories/snapshots): Failed
to transfer file: https://repository.apache.org/content/repositories/snapshots/org/apache/any23/apache-any23-service/maven-metadata.xml.
Return code is: 502, ReasonPhrase:Proxy Error. -> [Help 1]
[ERROR] 
[ERROR] To see the full stack trace of the errors, re-run Maven with the -e switch.
[ERROR] Re-run Maven using the -X switch to enable full debug logging.
[ERROR] 
[ERROR] For more information about the errors and possible solutions, please read the following
articles:
[ERROR] [Help 1] http://cwiki.apache.org/confluence/display/MAVEN/MojoExecutionException
[ERROR] 
[ERROR] After correcting the problems, you can resume the build with the command
[ERROR]   mvn <goals> -rf :apache-any23-service

[JENKINS] Archiving <https://builds.apache.org/job/Any23-trunk/ws/core/pom.xml> to org.apache.any23/apache-any23-core/1.2-SNAPSHOT/apache-any23-core-1.2-SNAPSHOT.pom
[JENKINS] Archiving <https://builds.apache.org/job/Any23-trunk/ws/core/target/apache-any23-core-1.2-SNAPSHOT.jar>
to org.apache.any23/apache-any23-core/1.2-20150118.020219-173/apache-any23-core-1.2-20150118.020219-173.jar
[JENKINS] Archiving <https://builds.apache.org/job/Any23-trunk/ws/core/target/apache-any23-core-1.2-SNAPSHOT.tar.gz>
to org.apache.any23/apache-any23-core/1.2-20150118.020219-173/apache-any23-core-1.2-20150118.020219-173.tar.gz
[JENKINS] Archiving <https://builds.apache.org/job/Any23-trunk/ws/core/target/apache-any23-core-1.2-SNAPSHOT.zip>
to org.apache.any23/apache-any23-core/1.2-20150118.020219-173/apache-any23-core-1.2-20150118.020219-173.zip
[JENKINS] Archiving <https://builds.apache.org/job/Any23-trunk/ws/core/target/apache-any23-core-1.2-SNAPSHOT-tests.jar>
to org.apache.any23/apache-any23-core/1.2-20150118.020219-173/apache-any23-core-1.2-20150118.020219-173-tests.jar
Sending artifact delta relative to Any23-trunk » Apache Any23 :: Core #1240
Archived 5 artifacts
Archive block size is 32768
Received 823 blocks and 33158320 bytes
Compression is 44.9%
Took 10 sec
[JENKINS] Archiving <https://builds.apache.org/job/Any23-trunk/ws/test-resources/pom.xml>
to org.apache.any23/apache-any23-test-resources/1.2-SNAPSHOT/apache-any23-test-resources-1.2-SNAPSHOT.pom
[JENKINS] Archiving <https://builds.apache.org/job/Any23-trunk/ws/test-resources/target/apache-any23-test-resources-1.2-SNAPSHOT.jar>
to org.apache.any23/apache-any23-test-resources/1.2-20150118.020100-174/apache-any23-test-resources-1.2-20150118.020100-174.jar
[JENKINS] Archiving <https://builds.apache.org/job/Any23-trunk/ws/test-resources/target/apache-any23-test-resources-1.2-SNAPSHOT-tests.jar>
to org.apache.any23/apache-any23-test-resources/1.2-20150118.020100-174/apache-any23-test-resources-1.2-20150118.020100-174-tests.jar
Sending artifact delta relative to Any23-trunk » Apache Any23 :: Test Resources #1240
Archived 3 artifacts
Archive block size is 32768
Received 4 blocks and 734969 bytes
Compression is 15.1%
Took 0.32 sec
[JENKINS] Archiving <https://builds.apache.org/job/Any23-trunk/ws/plugins/office-scraper/pom.xml>
to org.apache.any23.plugins/apache-any23-office-scraper/1.0.6-SNAPSHOT/apache-any23-office-scraper-1.0.6-SNAPSHOT.pom
[JENKINS] Archiving <https://builds.apache.org/job/Any23-trunk/ws/plugins/office-scraper/target/apache-any23-office-scraper-1.0.6-SNAPSHOT.jar>
to org.apache.any23.plugins/apache-any23-office-scraper/1.0.6-20150118.020407-173/apache-any23-office-scraper-1.0.6-20150118.020407-173.jar
[JENKINS] Archiving <https://builds.apache.org/job/Any23-trunk/ws/plugins/office-scraper/target/apache-any23-office-scraper-1.0.6-SNAPSHOT.tar.gz>
to org.apache.any23.plugins/apache-any23-office-scraper/1.0.6-20150118.020407-173/apache-any23-office-scraper-1.0.6-20150118.020407-173.tar.gz
[JENKINS] Archiving <https://builds.apache.org/job/Any23-trunk/ws/plugins/office-scraper/target/apache-any23-office-scraper-1.0.6-SNAPSHOT.zip>
to org.apache.any23.plugins/apache-any23-office-scraper/1.0.6-20150118.020407-173/apache-any23-office-scraper-1.0.6-20150118.020407-173.zip
Sending artifact delta relative to Any23-trunk » Apache Any23 :: Plugins :: Office Scraper
#1240
Archived 4 artifacts
Archive block size is 32768
Received 50 blocks and 1739327 bytes
Compression is 48.5%
Took 0.64 sec
[JENKINS] Archiving <https://builds.apache.org/job/Any23-trunk/ws/plugins/html-scraper/pom.xml>
to org.apache.any23.plugins/apache-any23-html-scraper/1.0.7-SNAPSHOT/apache-any23-html-scraper-1.0.7-SNAPSHOT.pom
[JENKINS] Archiving <https://builds.apache.org/job/Any23-trunk/ws/plugins/html-scraper/target/apache-any23-html-scraper-1.0.7-SNAPSHOT.jar>
to org.apache.any23.plugins/apache-any23-html-scraper/1.0.7-20150118.020337-173/apache-any23-html-scraper-1.0.7-20150118.020337-173.jar
[JENKINS] Archiving <https://builds.apache.org/job/Any23-trunk/ws/plugins/html-scraper/target/apache-any23-html-scraper-1.0.7-SNAPSHOT.tar.gz>
to org.apache.any23.plugins/apache-any23-html-scraper/1.0.7-20150118.020337-173/apache-any23-html-scraper-1.0.7-20150118.020337-173.tar.gz
[JENKINS] Archiving <https://builds.apache.org/job/Any23-trunk/ws/plugins/html-scraper/target/apache-any23-html-scraper-1.0.7-SNAPSHOT.zip>
to org.apache.any23.plugins/apache-any23-html-scraper/1.0.7-20150118.020337-173/apache-any23-html-scraper-1.0.7-20150118.020337-173.zip
Sending artifact delta relative to Any23-trunk » Apache Any23 :: Plugins :: HTML Scraper
#1240
Archived 4 artifacts
Archive block size is 32768
Received 2 blocks and 164054 bytes
Compression is 28.5%
Took 0.12 sec
[JENKINS] Archiving <https://builds.apache.org/job/Any23-trunk/ws/service/pom.xml> to
org.apache.any23/apache-any23-service/1.2-SNAPSHOT/apache-any23-service-1.2-SNAPSHOT.pom
[JENKINS] Archiving <https://builds.apache.org/job/Any23-trunk/ws/service/target/apache-any23-service-1.2-SNAPSHOT.war>
to org.apache.any23/apache-any23-service/1.2-SNAPSHOT/apache-any23-service-1.2-SNAPSHOT.war
[JENKINS] Archiving <https://builds.apache.org/job/Any23-trunk/ws/service/target/apache-any23-service-1.2-SNAPSHOT-without-deps.war>
to org.apache.any23/apache-any23-service/1.2-SNAPSHOT/apache-any23-service-1.2-SNAPSHOT-without-deps.war
[JENKINS] Archiving <https://builds.apache.org/job/Any23-trunk/ws/service/target/apache-any23-service-1.2-SNAPSHOT-with-deps.tar.gz>
to org.apache.any23/apache-any23-service/1.2-SNAPSHOT/apache-any23-service-1.2-SNAPSHOT-with-deps.tar.gz
[JENKINS] Archiving <https://builds.apache.org/job/Any23-trunk/ws/service/target/apache-any23-service-1.2-SNAPSHOT-with-deps.zip>
to org.apache.any23/apache-any23-service/1.2-SNAPSHOT/apache-any23-service-1.2-SNAPSHOT-with-deps.zip
[JENKINS] Archiving <https://builds.apache.org/job/Any23-trunk/ws/service/target/apache-any23-service-1.2-SNAPSHOT-without-deps.tar.gz>
to org.apache.any23/apache-any23-service/1.2-SNAPSHOT/apache-any23-service-1.2-SNAPSHOT-without-deps.tar.gz
[JENKINS] Archiving <https://builds.apache.org/job/Any23-trunk/ws/service/target/apache-any23-service-1.2-SNAPSHOT-without-deps.zip>
to org.apache.any23/apache-any23-service/1.2-SNAPSHOT/apache-any23-service-1.2-SNAPSHOT-without-deps.zip
[JENKINS] Archiving <https://builds.apache.org/job/Any23-trunk/ws/service/target/apache-any23-service-1.2-SNAPSHOT-server-embedded.tar.gz>
to org.apache.any23/apache-any23-service/1.2-SNAPSHOT/apache-any23-service-1.2-SNAPSHOT-server-embedded.tar.gz
[JENKINS] Archiving <https://builds.apache.org/job/Any23-trunk/ws/service/target/apache-any23-service-1.2-SNAPSHOT-server-embedded.zip>
to org.apache.any23/apache-any23-service/1.2-SNAPSHOT/apache-any23-service-1.2-SNAPSHOT-server-embedded.zip
Sending artifact delta relative to Any23-trunk » Apache Any23 :: Service #1240
Archived 9 artifacts
Archive block size is 32768
Received 959 blocks and 127628375 bytes
Compression is 19.8%
Took 37 sec
[JENKINS] Archiving <https://builds.apache.org/job/Any23-trunk/ws/api/pom.xml> to org.apache.any23/apache-any23-api/1.2-SNAPSHOT/apache-any23-api-1.2-SNAPSHOT.pom
[JENKINS] Archiving <https://builds.apache.org/job/Any23-trunk/ws/api/target/apache-any23-api-1.2-SNAPSHOT.jar>
to org.apache.any23/apache-any23-api/1.2-20150118.020054-174/apache-any23-api-1.2-20150118.020054-174.jar
Sending artifact delta relative to Any23-trunk » Apache Any23 :: Base API #1240
Archived 2 artifacts
Archive block size is 32768
Received 0 blocks and 99256 bytes
Compression is 0.0%
Took 0.11 sec
[JENKINS] Archiving <https://builds.apache.org/job/Any23-trunk/ws/csvutils/pom.xml>
to org.apache.any23/apache-any23-csvutils/1.2-SNAPSHOT/apache-any23-csvutils-1.2-SNAPSHOT.pom
[JENKINS] Archiving <https://builds.apache.org/job/Any23-trunk/ws/csvutils/target/apache-any23-csvutils-1.2-SNAPSHOT.jar>
to org.apache.any23/apache-any23-csvutils/1.2-20150118.020129-173/apache-any23-csvutils-1.2-20150118.020129-173.jar
Sending artifact delta relative to Any23-trunk » Apache Any23 :: CSV Utilities #1240
Archived 2 artifacts
Archive block size is 32768
Received 0 blocks and 14037 bytes
Compression is 0.0%
Took 91 ms
[JENKINS] Archiving <https://builds.apache.org/job/Any23-trunk/ws/plugins/integration-test/pom.xml>
to org.apache.any23.plugins/apache-any23-integration-test/1.2-SNAPSHOT/apache-any23-integration-test-1.2-SNAPSHOT.pom
[JENKINS] Archiving <https://builds.apache.org/job/Any23-trunk/ws/plugins/integration-test/target/apache-any23-integration-test-1.2-SNAPSHOT.jar>
to org.apache.any23.plugins/apache-any23-integration-test/1.2-20150118.020501-172/apache-any23-integration-test-1.2-20150118.020501-172.jar
Sending artifact delta relative to Any23-trunk » Apache Any23 :: Plugins :: Integration Test
#1240
Archived 2 artifacts
Archive block size is 32768
Received 0 blocks and 14905 bytes
Compression is 0.0%
Took 99 ms
[JENKINS] Archiving <https://builds.apache.org/job/Any23-trunk/ws/pom.xml> to org.apache.any23/apache-any23/1.2-SNAPSHOT/apache-any23-1.2-SNAPSHOT.pom
[JENKINS] Archiving <https://builds.apache.org/job/Any23-trunk/ws/target/apache-any23-1.2-SNAPSHOT-site.xml>
to org.apache.any23/apache-any23/1.2-20150118.020033-186/apache-any23-1.2-20150118.020033-186-site.xml
[JENKINS] Archiving <https://builds.apache.org/job/Any23-trunk/ws/target/apache-any23-1.2-SNAPSHOT-src.tar.gz>
to org.apache.any23/apache-any23/1.2-20150118.020033-186/apache-any23-1.2-20150118.020033-186-src.tar.gz
[JENKINS] Archiving <https://builds.apache.org/job/Any23-trunk/ws/target/apache-any23-1.2-SNAPSHOT-src.zip>
to org.apache.any23/apache-any23/1.2-20150118.020033-186/apache-any23-1.2-20150118.020033-186-src.zip
Sending artifact delta relative to Any23-trunk » Apache Any23 #1240
Archived 4 artifacts
Archive block size is 32768
Received 11 blocks and 3263953 bytes
Compression is 9.9%
Took 1 sec
[JENKINS] Archiving <https://builds.apache.org/job/Any23-trunk/ws/plugins/basic-crawler/pom.xml>
to org.apache.any23.plugins/apache-any23-basic-crawler/1.0.6-SNAPSHOT/apache-any23-basic-crawler-1.0.6-SNAPSHOT.pom
[JENKINS] Archiving <https://builds.apache.org/job/Any23-trunk/ws/plugins/basic-crawler/target/apache-any23-basic-crawler-1.0.6-SNAPSHOT.jar>
to org.apache.any23.plugins/apache-any23-basic-crawler/1.0.6-20150118.020326-173/apache-any23-basic-crawler-1.0.6-20150118.020326-173.jar
[JENKINS] Archiving <https://builds.apache.org/job/Any23-trunk/ws/plugins/basic-crawler/target/apache-any23-basic-crawler-1.0.6-SNAPSHOT.tar.gz>
to org.apache.any23.plugins/apache-any23-basic-crawler/1.0.6-20150118.020326-173/apache-any23-basic-crawler-1.0.6-20150118.020326-173.tar.gz
[JENKINS] Archiving <https://builds.apache.org/job/Any23-trunk/ws/plugins/basic-crawler/target/apache-any23-basic-crawler-1.0.6-SNAPSHOT.zip>
to org.apache.any23.plugins/apache-any23-basic-crawler/1.0.6-20150118.020326-173/apache-any23-basic-crawler-1.0.6-20150118.020326-173.zip
[JENKINS] Archiving <https://builds.apache.org/job/Any23-trunk/ws/plugins/basic-crawler/target/apache-any23-basic-crawler-1.0.6-SNAPSHOT-tests.jar>
to org.apache.any23.plugins/apache-any23-basic-crawler/1.0.6-20150118.020326-173/apache-any23-basic-crawler-1.0.6-20150118.020326-173-tests.jar
Sending artifact delta relative to Any23-trunk » Apache Any23 :: Plugins :: Basic Crawler
#1240
Archived 5 artifacts
Archive block size is 32768
Received 118 blocks and 1358776 bytes
Compression is 74.0%
Took 0.63 sec
[JENKINS] Archiving <https://builds.apache.org/job/Any23-trunk/ws/encoding/pom.xml>
to org.apache.any23/apache-any23-encoding/1.2-SNAPSHOT/apache-any23-encoding-1.2-SNAPSHOT.pom
[JENKINS] Archiving <https://builds.apache.org/job/Any23-trunk/ws/encoding/target/apache-any23-encoding-1.2-SNAPSHOT.jar>
to org.apache.any23/apache-any23-encoding/1.2-20150118.020143-173/apache-any23-encoding-1.2-20150118.020143-173.jar
Sending artifact delta relative to Any23-trunk » Apache Any23 :: Encoding Detection #1240
Archived 2 artifacts
Archive block size is 32768
Received 0 blocks and 12732 bytes
Compression is 0.0%
Took 92 ms
[JENKINS] Archiving <https://builds.apache.org/job/Any23-trunk/ws/nquads/pom.xml> to
org.apache.any23/apache-any23-nquads/1.2-SNAPSHOT/apache-any23-nquads-1.2-SNAPSHOT.pom
[JENKINS] Archiving <https://builds.apache.org/job/Any23-trunk/ws/nquads/target/apache-any23-nquads-1.2-SNAPSHOT.jar>
to org.apache.any23/apache-any23-nquads/1.2-20150118.020123-173/apache-any23-nquads-1.2-20150118.020123-173.jar
Sending artifact delta relative to Any23-trunk » Apache Any23 :: NQuads Parser and Writer
#1240
Archived 2 artifacts
Archive block size is 32768
Received 0 blocks and 15714 bytes
Compression is 0.0%
Took 78 ms
[JENKINS] Archiving <https://builds.apache.org/job/Any23-trunk/ws/mime/pom.xml> to org.apache.any23/apache-any23-mime/1.2-SNAPSHOT/apache-any23-mime-1.2-SNAPSHOT.pom
[JENKINS] Archiving <https://builds.apache.org/job/Any23-trunk/ws/mime/target/apache-any23-mime-1.2-SNAPSHOT.jar>
to org.apache.any23/apache-any23-mime/1.2-20150118.020137-173/apache-any23-mime-1.2-20150118.020137-173.jar
Sending artifact delta relative to Any23-trunk » Apache Any23 :: Mime Type Detection #1240
Archived 2 artifacts
Archive block size is 32768
Received 0 blocks and 47402 bytes
Compression is 0.0%
Took 93 ms
channel stopped

Mime
View raw message