any23-dev mailing list archives

Site index · List index
Message view « Date » · « Thread »
Top « Date » · « Thread »
From Apache Jenkins Server <jenk...@builds.apache.org>
Subject Build failed in Jenkins: Any23-trunk #1148
Date Mon, 20 Oct 2014 02:04:04 GMT
See <https://builds.apache.org/job/Any23-trunk/1148/>

------------------------------------------
[...truncated 190 lines...]
[INFO] Copying 239 resources
[INFO] 
[INFO] --- maven-compiler-plugin:2.5.1:testCompile (default-testCompile) @ apache-any23-test-resources
---
[INFO] No sources to compile
[INFO] 
[INFO] --- maven-surefire-plugin:2.16:test (default-test) @ apache-any23-test-resources ---
[JENKINS] Recording test results
[INFO] 
[INFO] --- maven-jar-plugin:2.3.1:jar (default-jar) @ apache-any23-test-resources ---
[WARNING] JAR will be empty - no content was marked for inclusion!
[INFO] Building jar: <https://builds.apache.org/job/Any23-trunk/ws/test-resources/target/apache-any23-test-resources-1.2-SNAPSHOT.jar>
[INFO] 
[INFO] --- maven-site-plugin:3.0:attach-descriptor (attach-descriptor) @ apache-any23-test-resources
---
[INFO] 
[INFO] --- maven-jar-plugin:2.3.1:test-jar (default) @ apache-any23-test-resources ---
[INFO] Building jar: <https://builds.apache.org/job/Any23-trunk/ws/test-resources/target/apache-any23-test-resources-1.2-SNAPSHOT-tests.jar>
[INFO] 
[INFO] --- maven-install-plugin:2.3.1:install (default-install) @ apache-any23-test-resources
---
[INFO] Installing <https://builds.apache.org/job/Any23-trunk/ws/test-resources/target/apache-any23-test-resources-1.2-SNAPSHOT.jar>
to /home/jenkins/jenkins-slave/maven-repositories/3/org/apache/any23/apache-any23-test-resources/1.2-SNAPSHOT/apache-any23-test-resources-1.2-SNAPSHOT.jar
[INFO] Installing <https://builds.apache.org/job/Any23-trunk/ws/test-resources/pom.xml>
to /home/jenkins/jenkins-slave/maven-repositories/3/org/apache/any23/apache-any23-test-resources/1.2-SNAPSHOT/apache-any23-test-resources-1.2-SNAPSHOT.pom
[INFO] Installing <https://builds.apache.org/job/Any23-trunk/ws/test-resources/target/apache-any23-test-resources-1.2-SNAPSHOT-tests.jar>
to /home/jenkins/jenkins-slave/maven-repositories/3/org/apache/any23/apache-any23-test-resources/1.2-SNAPSHOT/apache-any23-test-resources-1.2-SNAPSHOT-tests.jar
[INFO] 
[INFO] --- maven-deploy-plugin:2.7:deploy (default-deploy) @ apache-any23-test-resources ---
Downloading: https://repository.apache.org/content/repositories/snapshots/org/apache/any23/apache-any23-test-resources/1.2-SNAPSHOT/maven-metadata.xml
Downloaded: https://repository.apache.org/content/repositories/snapshots/org/apache/any23/apache-any23-test-resources/1.2-SNAPSHOT/maven-metadata.xml
(997 B at 0.6 KB/sec)
Uploading: https://repository.apache.org/content/repositories/snapshots/org/apache/any23/apache-any23-test-resources/1.2-SNAPSHOT/apache-any23-test-resources-1.2-20141020.020221-8.jar
Uploaded: https://repository.apache.org/content/repositories/snapshots/org/apache/any23/apache-any23-test-resources/1.2-SNAPSHOT/apache-any23-test-resources-1.2-20141020.020221-8.jar
(3 KB at 8.2 KB/sec)
Uploading: https://repository.apache.org/content/repositories/snapshots/org/apache/any23/apache-any23-test-resources/1.2-SNAPSHOT/apache-any23-test-resources-1.2-20141020.020221-8.pom
Uploaded: https://repository.apache.org/content/repositories/snapshots/org/apache/any23/apache-any23-test-resources/1.2-SNAPSHOT/apache-any23-test-resources-1.2-20141020.020221-8.pom
(2 KB at 4.9 KB/sec)
Downloading: https://repository.apache.org/content/repositories/snapshots/org/apache/any23/apache-any23-test-resources/maven-metadata.xml
Downloaded: https://repository.apache.org/content/repositories/snapshots/org/apache/any23/apache-any23-test-resources/maven-metadata.xml
(589 B at 2.7 KB/sec)
Uploading: https://repository.apache.org/content/repositories/snapshots/org/apache/any23/apache-any23-test-resources/1.2-SNAPSHOT/maven-metadata.xml
Uploaded: https://repository.apache.org/content/repositories/snapshots/org/apache/any23/apache-any23-test-resources/1.2-SNAPSHOT/maven-metadata.xml
(997 B at 3.1 KB/sec)
Uploading: https://repository.apache.org/content/repositories/snapshots/org/apache/any23/apache-any23-test-resources/maven-metadata.xml
Uploaded: https://repository.apache.org/content/repositories/snapshots/org/apache/any23/apache-any23-test-resources/maven-metadata.xml
(568 B at 1.6 KB/sec)
Uploading: https://repository.apache.org/content/repositories/snapshots/org/apache/any23/apache-any23-test-resources/1.2-SNAPSHOT/apache-any23-test-resources-1.2-20141020.020221-8-tests.jar
Uploaded: https://repository.apache.org/content/repositories/snapshots/org/apache/any23/apache-any23-test-resources/1.2-SNAPSHOT/apache-any23-test-resources-1.2-20141020.020221-8-tests.jar
(842 KB at 1097.0 KB/sec)
Uploading: https://repository.apache.org/content/repositories/snapshots/org/apache/any23/apache-any23-test-resources/1.2-SNAPSHOT/maven-metadata.xml
Uploaded: https://repository.apache.org/content/repositories/snapshots/org/apache/any23/apache-any23-test-resources/1.2-SNAPSHOT/maven-metadata.xml
(997 B at 2.9 KB/sec)
[INFO]                                                                         
[INFO] ------------------------------------------------------------------------
[INFO] Building Apache Any23 :: NQuads Parser and Writer 1.2-SNAPSHOT
[INFO] ------------------------------------------------------------------------
[INFO] 
[INFO] --- maven-clean-plugin:2.4.1:clean (default-clean) @ apache-any23-nquads ---
[INFO] Deleting <https://builds.apache.org/job/Any23-trunk/ws/nquads/target>
[INFO] 
[INFO] --- cobertura-maven-plugin:2.5.1:clean (default) @ apache-any23-nquads ---
[INFO] 
[INFO] --- buildnumber-maven-plugin:1.0:create (default) @ apache-any23-nquads ---
[INFO] Checking for local modifications: skipped.
[INFO] Updating project files from SCM: skipped.
[INFO] Executing: /bin/sh -c cd <https://builds.apache.org/job/Any23-trunk/ws/nquads>
&& git show
[INFO] Working directory: <https://builds.apache.org/job/Any23-trunk/ws/nquads>
[INFO] Storing buildNumber: null at timestamp: 1413770545490
[INFO] Executing: /bin/sh -c cd <https://builds.apache.org/job/Any23-trunk/ws/nquads>
&& git show
[INFO] Working directory: <https://builds.apache.org/job/Any23-trunk/ws/nquads>
[INFO] Storing buildScmBranch: UNKNOWN
[INFO] 
[INFO] --- maven-resources-plugin:2.5:resources (default-resources) @ apache-any23-nquads
---
[debug] execute contextualize
[INFO] Using 'UTF-8' encoding to copy filtered resources.
[INFO] Copying 2 resources to META-INF
[INFO] 
[INFO] --- maven-compiler-plugin:2.5.1:compile (default-compile) @ apache-any23-nquads ---
[INFO] Compiling 5 source files to <https://builds.apache.org/job/Any23-trunk/ws/nquads/target/classes>
[INFO] 
[INFO] --- maven-resources-plugin:2.5:testResources (default-testResources) @ apache-any23-nquads
---
[debug] execute contextualize
[INFO] Using 'UTF-8' encoding to copy filtered resources.
[INFO] Copying 1 resource
[INFO] 
[INFO] --- maven-compiler-plugin:2.5.1:testCompile (default-testCompile) @ apache-any23-nquads
---
[INFO] Compiling 2 source files to <https://builds.apache.org/job/Any23-trunk/ws/nquads/target/test-classes>
[INFO] 
[INFO] --- maven-surefire-plugin:2.16:test (default-test) @ apache-any23-nquads ---
[INFO] Surefire report directory: <https://builds.apache.org/job/Any23-trunk/ws/nquads/target/surefire-reports>

-------------------------------------------------------
 T E S T S
-------------------------------------------------------
Running org.apache.any23.io.nquads.NQuadsParserTest
Tests run: 24, Failures: 0, Errors: 0, Skipped: 0, Time elapsed: 0.27 sec - in org.apache.any23.io.nquads.NQuadsParserTest
Running org.apache.any23.io.nquads.NQuadsWriterTest
[2014-10-20 02:02:28,926] INFO     1[main] - org.apache.any23.io.nquads.NQuadsWriterTest.testWrite(NQuadsWriterTest.java:127)
- output=<http://sub> <http://pre> <http://obj> <http://gra1> .
_:genid311 <http://pre> _:genid322 <http://gra2> .
_:genid333 <http://pre> "Sample text 1" <http://gra2> .
_:genid344 <http://pre> "Sample text 2"@en <http://gra2> .
_:genid355 <http://pre> "12345"^^<http://www.w3.org/2001/XMLSchema#integer> <http://gra2>
.
<http://sub> <http://pre> "This is line 1.\nThis is line 2.\n" <http://gra3>
.

  Tests run: 2, Failures: 0, Errors: 0, Skipped: 0, Time elapsed: 0.076 sec - in org.apache.any23.io.nquads.NQuadsWriterTest

Results :

Tests run: 26, Failures: 0, Errors: 0, Skipped: 0

[JENKINS] Recording test results
[INFO] 
[INFO] --- maven-jar-plugin:2.3.1:jar (default-jar) @ apache-any23-nquads ---
[INFO] Building jar: <https://builds.apache.org/job/Any23-trunk/ws/nquads/target/apache-any23-nquads-1.2-SNAPSHOT.jar>
[INFO] 
[INFO] --- maven-site-plugin:3.0:attach-descriptor (attach-descriptor) @ apache-any23-nquads
---
[INFO] 
[INFO] --- maven-install-plugin:2.3.1:install (default-install) @ apache-any23-nquads ---
[INFO] Installing <https://builds.apache.org/job/Any23-trunk/ws/nquads/target/apache-any23-nquads-1.2-SNAPSHOT.jar>
to /home/jenkins/jenkins-slave/maven-repositories/3/org/apache/any23/apache-any23-nquads/1.2-SNAPSHOT/apache-any23-nquads-1.2-SNAPSHOT.jar
[INFO] Installing <https://builds.apache.org/job/Any23-trunk/ws/nquads/pom.xml> to /home/jenkins/jenkins-slave/maven-repositories/3/org/apache/any23/apache-any23-nquads/1.2-SNAPSHOT/apache-any23-nquads-1.2-SNAPSHOT.pom
[INFO] 
[INFO] --- maven-deploy-plugin:2.7:deploy (default-deploy) @ apache-any23-nquads ---
Downloading: https://repository.apache.org/content/repositories/snapshots/org/apache/any23/apache-any23-nquads/1.2-SNAPSHOT/maven-metadata.xml
[WARNING] Could not transfer metadata org.apache.any23:apache-any23-nquads:1.2-SNAPSHOT/maven-metadata.xml
from/to apache.snapshots.https (https://repository.apache.org/content/repositories/snapshots):
repository.apache.org: Name or service not known
[INFO]                                                                         
[INFO] ------------------------------------------------------------------------
[INFO] Skipping Apache Any23
[INFO] This project has been banned from the build due to previous failures.
[INFO] ------------------------------------------------------------------------
[INFO] ------------------------------------------------------------------------
[INFO] Reactor Summary:
[INFO] 
[INFO] Apache Any23 ...................................... SUCCESS [44.180s]
[INFO] Apache Any23 :: Base API .......................... SUCCESS [12.438s]
[INFO] Apache Any23 :: Test Resources .................... SUCCESS [7.925s]
[INFO] Apache Any23 :: NQuads Parser and Writer .......... FAILURE [57.774s]
[INFO] Apache Any23 :: CSV Utilities ..................... SKIPPED
[INFO] Apache Any23 :: Mime Type Detection ............... SKIPPED
[INFO] Apache Any23 :: Encoding Detection ................ SKIPPED
[INFO] Apache Any23 :: Core .............................. SKIPPED
[INFO] Apache Any23 :: Plugins :: Basic Crawler .......... SKIPPED
[INFO] Apache Any23 :: Plugins :: HTML Scraper ........... SKIPPED
[INFO] Apache Any23 :: Plugins :: Office Scraper ......... SKIPPED
[INFO] Apache Any23 :: Plugins :: Integration Test ....... SKIPPED
[INFO] Apache Any23 :: Service ........................... SKIPPED
[INFO] ------------------------------------------------------------------------
[INFO] BUILD FAILURE
[INFO] ------------------------------------------------------------------------
[INFO] Total time: 2:10.718s
[INFO] Finished at: Mon Oct 20 02:03:25 UTC 2014
[INFO] Final Memory: 30M/298M
[INFO] ------------------------------------------------------------------------
Waiting for Jenkins to finish collecting data[ERROR] Failed to execute goal org.apache.maven.plugins:maven-deploy-plugin:2.7:deploy
(default-deploy) on project apache-any23-nquads: Failed to retrieve remote metadata org.apache.any23:apache-any23-nquads:1.2-SNAPSHOT/maven-metadata.xml:
Could not transfer metadata org.apache.any23:apache-any23-nquads:1.2-SNAPSHOT/maven-metadata.xml
from/to apache.snapshots.https (https://repository.apache.org/content/repositories/snapshots):
repository.apache.org: Name or service not known: Unknown host repository.apache.org: Name
or service not known -> [Help 1]
[ERROR] 
[ERROR] To see the full stack trace of the errors, re-run Maven with the -e switch.
[ERROR] Re-run Maven using the -X switch to enable full debug logging.
[ERROR] 
[ERROR] For more information about the errors and possible solutions, please read the following
articles:
[ERROR] [Help 1] http://cwiki.apache.org/confluence/display/MAVEN/MojoExecutionException
[ERROR] 
[ERROR] After correcting the problems, you can resume the build with the command
[ERROR]   mvn <goals> -rf :apache-any23-nquads

[JENKINS] Archiving <https://builds.apache.org/job/Any23-trunk/ws/core/pom.xml> to org.apache.any23/apache-any23-core/1.2-SNAPSHOT/apache-any23-core-1.2-SNAPSHOT.pom
Sending artifact delta relative to Any23-trunk » Apache Any23 :: Core #1147
Archived 1 artifacts
Archive block size is 32768
Received 0 blocks and 8335 bytes
Compression is 0.0%
Took 5.4 sec
[JENKINS] Archiving <https://builds.apache.org/job/Any23-trunk/ws/test-resources/pom.xml>
to org.apache.any23/apache-any23-test-resources/1.2-SNAPSHOT/apache-any23-test-resources-1.2-SNAPSHOT.pom
[JENKINS] Archiving <https://builds.apache.org/job/Any23-trunk/ws/test-resources/target/apache-any23-test-resources-1.2-SNAPSHOT.jar>
to org.apache.any23/apache-any23-test-resources/1.2-20141020.020221-8/apache-any23-test-resources-1.2-20141020.020221-8.jar
[JENKINS] Archiving <https://builds.apache.org/job/Any23-trunk/ws/test-resources/target/apache-any23-test-resources-1.2-SNAPSHOT-tests.jar>
to org.apache.any23/apache-any23-test-resources/1.2-20141020.020221-8/apache-any23-test-resources-1.2-20141020.020221-8-tests.jar
Sending artifact delta relative to Any23-trunk » Apache Any23 :: Test Resources #1147
Archived 3 artifacts
Archive block size is 32768
Received 6 blocks and 669422 bytes
Compression is 22.7%
Took 0.29 sec
[JENKINS] Archiving <https://builds.apache.org/job/Any23-trunk/ws/plugins/office-scraper/pom.xml>
to org.apache.any23.plugins/apache-any23-office-scraper/1.0.6-SNAPSHOT/apache-any23-office-scraper-1.0.6-SNAPSHOT.pom
Sending artifact delta relative to Any23-trunk » Apache Any23 :: Plugins :: Office Scraper
#1147
Archived 1 artifacts
Archive block size is 32768
Received 0 blocks and 4276 bytes
Compression is 0.0%
Took 2.6 sec
[JENKINS] Archiving <https://builds.apache.org/job/Any23-trunk/ws/plugins/html-scraper/pom.xml>
to org.apache.any23.plugins/apache-any23-html-scraper/1.0.7-SNAPSHOT/apache-any23-html-scraper-1.0.7-SNAPSHOT.pom
Sending artifact delta relative to Any23-trunk » Apache Any23 :: Plugins :: HTML Scraper
#1147
Archived 1 artifacts
Archive block size is 32768
Received 0 blocks and 4766 bytes
Compression is 0.0%
Took 0.1 sec
[JENKINS] Archiving <https://builds.apache.org/job/Any23-trunk/ws/service/pom.xml> to
org.apache.any23/apache-any23-service/1.2-SNAPSHOT/apache-any23-service-1.2-SNAPSHOT.pom
Sending artifact delta relative to Any23-trunk » Apache Any23 :: Service #1147
Archived 1 artifacts
Archive block size is 32768
Received 0 blocks and 7071 bytes
Compression is 0.0%
Took 9.1 sec
[JENKINS] Archiving <https://builds.apache.org/job/Any23-trunk/ws/api/pom.xml> to org.apache.any23/apache-any23-api/1.2-SNAPSHOT/apache-any23-api-1.2-SNAPSHOT.pom
[JENKINS] Archiving <https://builds.apache.org/job/Any23-trunk/ws/api/target/apache-any23-api-1.2-SNAPSHOT.jar>
to org.apache.any23/apache-any23-api/1.2-20141020.020210-8/apache-any23-api-1.2-20141020.020210-8.jar
Sending artifact delta relative to Any23-trunk » Apache Any23 :: Base API #1147
Archived 2 artifacts
Archive block size is 32768
Received 0 blocks and 99248 bytes
Compression is 0.0%
Took 1.7 sec
[JENKINS] Archiving <https://builds.apache.org/job/Any23-trunk/ws/csvutils/pom.xml>
to org.apache.any23/apache-any23-csvutils/1.2-SNAPSHOT/apache-any23-csvutils-1.2-SNAPSHOT.pom
Sending artifact delta relative to Any23-trunk » Apache Any23 :: CSV Utilities #1147
Archived 1 artifacts
Archive block size is 32768
Received 0 blocks and 2804 bytes
Compression is 0.0%
Took 0.11 sec
[JENKINS] Archiving <https://builds.apache.org/job/Any23-trunk/ws/plugins/integration-test/pom.xml>
to org.apache.any23.plugins/apache-any23-integration-test/1.2-SNAPSHOT/apache-any23-integration-test-1.2-SNAPSHOT.pom
Sending artifact delta relative to Any23-trunk » Apache Any23 :: Plugins :: Integration Test
#1147
Archived 1 artifacts
Archive block size is 32768
Received 0 blocks and 5779 bytes
Compression is 0.0%
Took 0.1 sec
[JENKINS] Archiving <https://builds.apache.org/job/Any23-trunk/ws/pom.xml> to org.apache.any23/apache-any23/1.2-SNAPSHOT/apache-any23-1.2-SNAPSHOT.pom
[JENKINS] Archiving <https://builds.apache.org/job/Any23-trunk/ws/target/apache-any23-1.2-SNAPSHOT-site.xml>
to org.apache.any23/apache-any23/1.2-20141020.020156-9/apache-any23-1.2-20141020.020156-9-site.xml
[JENKINS] Archiving <https://builds.apache.org/job/Any23-trunk/ws/target/apache-any23-1.2-SNAPSHOT-src.tar.gz>
to org.apache.any23/apache-any23/1.2-20141020.020156-9/apache-any23-1.2-20141020.020156-9-src.tar.gz
[JENKINS] Archiving <https://builds.apache.org/job/Any23-trunk/ws/target/apache-any23-1.2-SNAPSHOT-src.zip>
to org.apache.any23/apache-any23/1.2-20141020.020156-9/apache-any23-1.2-20141020.020156-9-src.zip
Sending artifact delta relative to Any23-trunk » Apache Any23 #1147
Archived 4 artifacts
Archive block size is 32768
Received 9 blocks and 3324630 bytes
Compression is 8.1%
Took 2.5 sec
[JENKINS] Archiving <https://builds.apache.org/job/Any23-trunk/ws/plugins/basic-crawler/pom.xml>
to org.apache.any23.plugins/apache-any23-basic-crawler/1.0.6-SNAPSHOT/apache-any23-basic-crawler-1.0.6-SNAPSHOT.pom
Sending artifact delta relative to Any23-trunk » Apache Any23 :: Plugins :: Basic Crawler
#1147
Archived 1 artifacts
Archive block size is 32768
Received 0 blocks and 5170 bytes
Compression is 0.0%
Took 0.2 sec
[JENKINS] Archiving <https://builds.apache.org/job/Any23-trunk/ws/encoding/pom.xml>
to org.apache.any23/apache-any23-encoding/1.2-SNAPSHOT/apache-any23-encoding-1.2-SNAPSHOT.pom
Sending artifact delta relative to Any23-trunk » Apache Any23 :: Encoding Detection #1147
Archived 1 artifacts
Archive block size is 32768
Received 0 blocks and 3108 bytes
Compression is 0.0%
Took 72 ms
[JENKINS] Archiving <https://builds.apache.org/job/Any23-trunk/ws/nquads/pom.xml> to
org.apache.any23/apache-any23-nquads/1.2-SNAPSHOT/apache-any23-nquads-1.2-SNAPSHOT.pom
[JENKINS] Archiving <https://builds.apache.org/job/Any23-trunk/ws/nquads/target/apache-any23-nquads-1.2-SNAPSHOT.jar>
to org.apache.any23/apache-any23-nquads/1.2-SNAPSHOT/apache-any23-nquads-1.2-SNAPSHOT.jar
Sending artifact delta relative to Any23-trunk » Apache Any23 :: NQuads Parser and Writer
#1147
Archived 2 artifacts
Archive block size is 32768
Received 0 blocks and 15691 bytes
Compression is 0.0%
Took 75 ms
[JENKINS] Archiving <https://builds.apache.org/job/Any23-trunk/ws/mime/pom.xml> to org.apache.any23/apache-any23-mime/1.2-SNAPSHOT/apache-any23-mime-1.2-SNAPSHOT.pom
Sending artifact delta relative to Any23-trunk » Apache Any23 :: Mime Type Detection #1147
Archived 1 artifacts
Archive block size is 32768
Received 0 blocks and 4344 bytes
Compression is 0.0%
Took 72 ms
channel stopped

Mime
View raw message