any23-dev mailing list archives

Site index · List index
Message view « Date » · « Thread »
Top « Date » · « Thread »
From Apache Jenkins Server <jenk...@builds.apache.org>
Subject Build failed in Jenkins: Any23-trunk #1022
Date Sun, 22 Jun 2014 02:08:06 GMT
See <https://builds.apache.org/job/Any23-trunk/1022/>

------------------------------------------
[...truncated 5334 lines...]
[INFO] Building jar: <https://builds.apache.org/job/Any23-trunk/ws/plugins/office-scraper/target/apache-any23-office-scraper-1.0.5-SNAPSHOT.jar>
[INFO] 
[INFO] --- maven-site-plugin:3.0:attach-descriptor (attach-descriptor) @ apache-any23-office-scraper
---
[INFO] 
[INFO] --- maven-assembly-plugin:2.3:single (assembly) @ apache-any23-office-scraper ---
[INFO] Reading assembly descriptor: <https://builds.apache.org/job/Any23-trunk/ws/plugins/office-scraper/src/main/assembly/bin.xml>
[INFO] Building tar: <https://builds.apache.org/job/Any23-trunk/ws/plugins/office-scraper/target/apache-any23-office-scraper-1.0.5-SNAPSHOT.tar.gz>
[INFO] Building zip: <https://builds.apache.org/job/Any23-trunk/ws/plugins/office-scraper/target/apache-any23-office-scraper-1.0.5-SNAPSHOT.zip>
[INFO] 
[INFO] --- maven-install-plugin:2.3.1:install (default-install) @ apache-any23-office-scraper
---
[INFO] Installing <https://builds.apache.org/job/Any23-trunk/ws/plugins/office-scraper/target/apache-any23-office-scraper-1.0.5-SNAPSHOT.jar>
to /home/jenkins/jenkins-slave/maven-repositories/1/org/apache/any23/plugins/apache-any23-office-scraper/1.0.5-SNAPSHOT/apache-any23-office-scraper-1.0.5-SNAPSHOT.jar
[INFO] Installing <https://builds.apache.org/job/Any23-trunk/ws/plugins/office-scraper/pom.xml>
to /home/jenkins/jenkins-slave/maven-repositories/1/org/apache/any23/plugins/apache-any23-office-scraper/1.0.5-SNAPSHOT/apache-any23-office-scraper-1.0.5-SNAPSHOT.pom
[INFO] Installing <https://builds.apache.org/job/Any23-trunk/ws/plugins/office-scraper/target/apache-any23-office-scraper-1.0.5-SNAPSHOT.tar.gz>
to /home/jenkins/jenkins-slave/maven-repositories/1/org/apache/any23/plugins/apache-any23-office-scraper/1.0.5-SNAPSHOT/apache-any23-office-scraper-1.0.5-SNAPSHOT.tar.gz
[INFO] Installing <https://builds.apache.org/job/Any23-trunk/ws/plugins/office-scraper/target/apache-any23-office-scraper-1.0.5-SNAPSHOT.zip>
to /home/jenkins/jenkins-slave/maven-repositories/1/org/apache/any23/plugins/apache-any23-office-scraper/1.0.5-SNAPSHOT/apache-any23-office-scraper-1.0.5-SNAPSHOT.zip
[INFO] 
[INFO] --- maven-deploy-plugin:2.7:deploy (default-deploy) @ apache-any23-office-scraper ---
Downloading: https://repository.apache.org/content/repositories/snapshots/org/apache/any23/plugins/apache-any23-office-scraper/1.0.5-SNAPSHOT/maven-metadata.xml
Downloaded: https://repository.apache.org/content/repositories/snapshots/org/apache/any23/plugins/apache-any23-office-scraper/1.0.5-SNAPSHOT/maven-metadata.xml
(2 KB at 3.5 KB/sec)
Uploading: https://repository.apache.org/content/repositories/snapshots/org/apache/any23/plugins/apache-any23-office-scraper/1.0.5-SNAPSHOT/apache-any23-office-scraper-1.0.5-20140622.020537-35.jar
Uploaded: https://repository.apache.org/content/repositories/snapshots/org/apache/any23/plugins/apache-any23-office-scraper/1.0.5-SNAPSHOT/apache-any23-office-scraper-1.0.5-20140622.020537-35.jar
(16 KB at 46.8 KB/sec)
Uploading: https://repository.apache.org/content/repositories/snapshots/org/apache/any23/plugins/apache-any23-office-scraper/1.0.5-SNAPSHOT/apache-any23-office-scraper-1.0.5-20140622.020537-35.pom
Uploaded: https://repository.apache.org/content/repositories/snapshots/org/apache/any23/plugins/apache-any23-office-scraper/1.0.5-SNAPSHOT/apache-any23-office-scraper-1.0.5-20140622.020537-35.pom
(5 KB at 10.1 KB/sec)
Downloading: https://repository.apache.org/content/repositories/snapshots/org/apache/any23/plugins/apache-any23-office-scraper/maven-metadata.xml
Downloaded: https://repository.apache.org/content/repositories/snapshots/org/apache/any23/plugins/apache-any23-office-scraper/maven-metadata.xml
(462 B at 2.3 KB/sec)
Uploading: https://repository.apache.org/content/repositories/snapshots/org/apache/any23/plugins/apache-any23-office-scraper/1.0.5-SNAPSHOT/maven-metadata.xml
Uploaded: https://repository.apache.org/content/repositories/snapshots/org/apache/any23/plugins/apache-any23-office-scraper/1.0.5-SNAPSHOT/maven-metadata.xml
(2 KB at 4.0 KB/sec)
Uploading: https://repository.apache.org/content/repositories/snapshots/org/apache/any23/plugins/apache-any23-office-scraper/maven-metadata.xml
Uploaded: https://repository.apache.org/content/repositories/snapshots/org/apache/any23/plugins/apache-any23-office-scraper/maven-metadata.xml
(462 B at 1.3 KB/sec)
Uploading: https://repository.apache.org/content/repositories/snapshots/org/apache/any23/plugins/apache-any23-office-scraper/1.0.5-SNAPSHOT/apache-any23-office-scraper-1.0.5-20140622.020537-35.tar.gz
Uploaded: https://repository.apache.org/content/repositories/snapshots/org/apache/any23/plugins/apache-any23-office-scraper/1.0.5-SNAPSHOT/apache-any23-office-scraper-1.0.5-20140622.020537-35.tar.gz
(1639 KB at 1429.8 KB/sec)
Uploading: https://repository.apache.org/content/repositories/snapshots/org/apache/any23/plugins/apache-any23-office-scraper/1.0.5-SNAPSHOT/maven-metadata.xml
Uploaded: https://repository.apache.org/content/repositories/snapshots/org/apache/any23/plugins/apache-any23-office-scraper/1.0.5-SNAPSHOT/maven-metadata.xml
(2 KB at 3.4 KB/sec)
Uploading: https://repository.apache.org/content/repositories/snapshots/org/apache/any23/plugins/apache-any23-office-scraper/1.0.5-SNAPSHOT/apache-any23-office-scraper-1.0.5-20140622.020537-35.zip
Uploaded: https://repository.apache.org/content/repositories/snapshots/org/apache/any23/plugins/apache-any23-office-scraper/1.0.5-SNAPSHOT/apache-any23-office-scraper-1.0.5-20140622.020537-35.zip
(1640 KB at 1443.0 KB/sec)
Uploading: https://repository.apache.org/content/repositories/snapshots/org/apache/any23/plugins/apache-any23-office-scraper/1.0.5-SNAPSHOT/maven-metadata.xml
Uploaded: https://repository.apache.org/content/repositories/snapshots/org/apache/any23/plugins/apache-any23-office-scraper/1.0.5-SNAPSHOT/maven-metadata.xml
(2 KB at 3.3 KB/sec)
[INFO]                                                                         
[INFO] ------------------------------------------------------------------------
[INFO] Building Apache Any23 :: Plugins :: Integration Test 1.1-SNAPSHOT
[INFO] ------------------------------------------------------------------------
[INFO] 
[INFO] --- maven-clean-plugin:2.4.1:clean (default-clean) @ apache-any23-integration-test
---
[INFO] Deleting <https://builds.apache.org/job/Any23-trunk/ws/plugins/integration-test/target>
[INFO] 
[INFO] --- cobertura-maven-plugin:2.5.1:clean (default) @ apache-any23-integration-test ---
[INFO] 
[INFO] --- buildnumber-maven-plugin:1.0:create (default) @ apache-any23-integration-test ---
[INFO] Checking for local modifications: skipped.
[INFO] Updating project files from SCM: skipped.
[INFO] Executing: /bin/sh -c cd <https://builds.apache.org/job/Any23-trunk/ws/plugins/integration-test>
&& git show
[INFO] Working directory: <https://builds.apache.org/job/Any23-trunk/ws/plugins/integration-test>
[INFO] Storing buildNumber: null at timestamp: 1403402745787
[INFO] Executing: /bin/sh -c cd <https://builds.apache.org/job/Any23-trunk/ws/plugins/integration-test>
&& git show
[INFO] Working directory: <https://builds.apache.org/job/Any23-trunk/ws/plugins/integration-test>
[INFO] Storing buildScmBranch: UNKNOWN
[INFO] 
[INFO] --- maven-resources-plugin:2.5:resources (default-resources) @ apache-any23-integration-test
---
[debug] execute contextualize
[INFO] Using 'UTF-8' encoding to copy filtered resources.
[INFO] Copying 2 resources to META-INF
[INFO] 
[INFO] --- maven-compiler-plugin:2.5.1:compile (default-compile) @ apache-any23-integration-test
---
[INFO] No sources to compile
[INFO] 
[INFO] --- maven-resources-plugin:2.5:testResources (default-testResources) @ apache-any23-integration-test
---
[debug] execute contextualize
[INFO] Using 'UTF-8' encoding to copy filtered resources.
[INFO] Copying 1 resource
[INFO] 
[INFO] --- maven-compiler-plugin:2.5.1:testCompile (default-testCompile) @ apache-any23-integration-test
---
[INFO] Compiling 1 source file to <https://builds.apache.org/job/Any23-trunk/ws/plugins/integration-test/target/test-classes>
[INFO] 
[INFO] --- maven-surefire-plugin:2.16:test (default-test) @ apache-any23-integration-test
---
[JENKINS] Recording test results
[INFO] 
[INFO] --- maven-jar-plugin:2.3.1:jar (default-jar) @ apache-any23-integration-test ---
[INFO] Building jar: <https://builds.apache.org/job/Any23-trunk/ws/plugins/integration-test/target/apache-any23-integration-test-1.1-SNAPSHOT.jar>
[INFO] 
[INFO] --- maven-site-plugin:3.0:attach-descriptor (attach-descriptor) @ apache-any23-integration-test
---
[INFO] 
[INFO] --- maven-assembly-plugin:2.3:single (assembly) @ apache-any23-integration-test ---
[INFO] Assemblies have been skipped per configuration of the skipAssembly parameter.
[INFO] 
[INFO] --- maven-invoker-plugin:1.5:run (default) @ apache-any23-integration-test ---
[INFO] Building: basic-crawler/pom.xml
[INFO] ..FAILED (22.8 s)
[INFO]   The build exited with code 1. See <https://builds.apache.org/job/Any23-trunk/ws/plugins/integration-test/target/plugins-build/basic-crawler/build.log>
for details.
[INFO] Building: office-scraper/pom.xml
[INFO] ..SUCCESS (8.5 s)
[INFO] Building: html-scraper/pom.xml
[INFO] ..SUCCESS (7.0 s)
[INFO] -------------------------------------------------
[INFO] Build Summary:
[INFO]   Passed: 2, Failed: 1, Errors: 0, Skipped: 0
[INFO] -------------------------------------------------
[ERROR] The following builds failed:
[ERROR] *  basic-crawler/pom.xml
[INFO] -------------------------------------------------
[INFO] ------------------------------------------------------------------------
[INFO] Reactor Summary:
[INFO] 
[INFO] Apache Any23 ...................................... SUCCESS [47.832s]
[INFO] Apache Any23 :: Base API .......................... SUCCESS [8.822s]
[INFO] Apache Any23 :: Test Resources .................... SUCCESS [8.543s]
[INFO] Apache Any23 :: NQuads Parser and Writer .......... SUCCESS [17.933s]
[INFO] Apache Any23 :: CSV Utilities ..................... SUCCESS [5.149s]
[INFO] Apache Any23 :: Mime Type Detection ............... SUCCESS [11.619s]
[INFO] Apache Any23 :: Encoding Detection ................ SUCCESS [8.043s]
[INFO] Apache Any23 :: Core .............................. SUCCESS [54.559s]
[INFO] Apache Any23 :: Plugins :: Basic Crawler .......... SUCCESS [29.672s]
[INFO] Apache Any23 :: Plugins :: HTML Scraper ........... SUCCESS [11.524s]
[INFO] Apache Any23 :: Plugins :: Office Scraper ......... SUCCESS [13.605s]
[INFO] Apache Any23 :: Plugins :: Integration Test ....... FAILURE [44.221s]
[INFO] Apache Any23 :: Service ........................... SKIPPED
[INFO] ------------------------------------------------------------------------
[INFO] BUILD FAILURE
[INFO] ------------------------------------------------------------------------
[INFO] Total time: 4:40.506s
[INFO] Finished at: Sun Jun 22 02:06:28 UTC 2014
[INFO] Final Memory: 40M/136M
[INFO] ------------------------------------------------------------------------
Waiting for Jenkins to finish collecting data
[ERROR] Failed to execute goal org.apache.maven.plugins:maven-invoker-plugin:1.5:run (default)
on project apache-any23-integration-test: 1 build failed. -> [Help 1]
[ERROR] 
[ERROR] To see the full stack trace of the errors, re-run Maven with the -e switch.
[ERROR] Re-run Maven using the -X switch to enable full debug logging.
[ERROR] 
[ERROR] For more information about the errors and possible solutions, please read the following
articles:
[ERROR] [Help 1] http://cwiki.apache.org/confluence/display/MAVEN/MojoFailureException
[ERROR] 
[ERROR] After correcting the problems, you can resume the build with the command
[ERROR]   mvn <goals> -rf :apache-any23-integration-test
[JENKINS] Archiving <https://builds.apache.org/job/Any23-trunk/ws/core/pom.xml> to org.apache.any23/apache-any23-core/1.1-SNAPSHOT/apache-any23-core-1.1-SNAPSHOT.pom
[JENKINS] Archiving <https://builds.apache.org/job/Any23-trunk/ws/core/target/apache-any23-core-1.1-SNAPSHOT.jar>
to org.apache.any23/apache-any23-core/1.1-20140622.020424-35/apache-any23-core-1.1-20140622.020424-35.jar
[JENKINS] Archiving <https://builds.apache.org/job/Any23-trunk/ws/core/target/apache-any23-core-1.1-SNAPSHOT.tar.gz>
to org.apache.any23/apache-any23-core/1.1-20140622.020424-35/apache-any23-core-1.1-20140622.020424-35.tar.gz
[JENKINS] Archiving <https://builds.apache.org/job/Any23-trunk/ws/core/target/apache-any23-core-1.1-SNAPSHOT.zip>
to org.apache.any23/apache-any23-core/1.1-20140622.020424-35/apache-any23-core-1.1-20140622.020424-35.zip
[JENKINS] Archiving <https://builds.apache.org/job/Any23-trunk/ws/core/target/apache-any23-core-1.1-SNAPSHOT-tests.jar>
to org.apache.any23/apache-any23-core/1.1-20140622.020424-35/apache-any23-core-1.1-20140622.020424-35-tests.jar
Sending artifact delta relative to Any23-trunk ? Apache Any23 :: Core #1021
Archived 5 artifacts
Archive block size is 32768
Received 819 blocks and 33240913 bytes
Compression is 44.7%
Took 26 sec
[JENKINS] Archiving <https://builds.apache.org/job/Any23-trunk/ws/test-resources/pom.xml>
to org.apache.any23/apache-any23-test-resources/1.1-SNAPSHOT/apache-any23-test-resources-1.1-SNAPSHOT.pom
[JENKINS] Archiving <https://builds.apache.org/job/Any23-trunk/ws/test-resources/target/apache-any23-test-resources-1.1-SNAPSHOT.jar>
to org.apache.any23/apache-any23-test-resources/1.1-20140622.020255-35/apache-any23-test-resources-1.1-20140622.020255-35.jar
[JENKINS] Archiving <https://builds.apache.org/job/Any23-trunk/ws/test-resources/target/apache-any23-test-resources-1.1-SNAPSHOT-tests.jar>
to org.apache.any23/apache-any23-test-resources/1.1-20140622.020255-35/apache-any23-test-resources-1.1-20140622.020255-35-tests.jar
Sending artifact delta relative to Any23-trunk ? Apache Any23 :: Test Resources #1021
Archived 3 artifacts
Archive block size is 32768
Received 3 blocks and 767733 bytes
Compression is 11.4%
Took 2.8 sec
[JENKINS] Archiving <https://builds.apache.org/job/Any23-trunk/ws/plugins/office-scraper/pom.xml>
to org.apache.any23.plugins/apache-any23-office-scraper/1.0.5-SNAPSHOT/apache-any23-office-scraper-1.0.5-SNAPSHOT.pom
[JENKINS] Archiving <https://builds.apache.org/job/Any23-trunk/ws/plugins/office-scraper/target/apache-any23-office-scraper-1.0.5-SNAPSHOT.jar>
to org.apache.any23.plugins/apache-any23-office-scraper/1.0.5-20140622.020537-35/apache-any23-office-scraper-1.0.5-20140622.020537-35.jar
[JENKINS] Archiving <https://builds.apache.org/job/Any23-trunk/ws/plugins/office-scraper/target/apache-any23-office-scraper-1.0.5-SNAPSHOT.tar.gz>
to org.apache.any23.plugins/apache-any23-office-scraper/1.0.5-20140622.020537-35/apache-any23-office-scraper-1.0.5-20140622.020537-35.tar.gz
[JENKINS] Archiving <https://builds.apache.org/job/Any23-trunk/ws/plugins/office-scraper/target/apache-any23-office-scraper-1.0.5-SNAPSHOT.zip>
to org.apache.any23.plugins/apache-any23-office-scraper/1.0.5-20140622.020537-35/apache-any23-office-scraper-1.0.5-20140622.020537-35.zip
Sending artifact delta relative to Any23-trunk ? Apache Any23 :: Plugins :: Office Scraper
#1021
Archived 4 artifacts
Archive block size is 32768
Received 49 blocks and 1771376 bytes
Compression is 47.5%
Took 3 sec
[JENKINS] Archiving <https://builds.apache.org/job/Any23-trunk/ws/plugins/html-scraper/pom.xml>
to org.apache.any23.plugins/apache-any23-html-scraper/1.0.6-SNAPSHOT/apache-any23-html-scraper-1.0.6-SNAPSHOT.pom
[JENKINS] Archiving <https://builds.apache.org/job/Any23-trunk/ws/plugins/html-scraper/target/apache-any23-html-scraper-1.0.6-SNAPSHOT.jar>
to org.apache.any23.plugins/apache-any23-html-scraper/1.0.6-20140622.020522-35/apache-any23-html-scraper-1.0.6-20140622.020522-35.jar
[JENKINS] Archiving <https://builds.apache.org/job/Any23-trunk/ws/plugins/html-scraper/target/apache-any23-html-scraper-1.0.6-SNAPSHOT.tar.gz>
to org.apache.any23.plugins/apache-any23-html-scraper/1.0.6-20140622.020522-35/apache-any23-html-scraper-1.0.6-20140622.020522-35.tar.gz
[JENKINS] Archiving <https://builds.apache.org/job/Any23-trunk/ws/plugins/html-scraper/target/apache-any23-html-scraper-1.0.6-SNAPSHOT.zip>
to org.apache.any23.plugins/apache-any23-html-scraper/1.0.6-20140622.020522-35/apache-any23-html-scraper-1.0.6-20140622.020522-35.zip
Sending artifact delta relative to Any23-trunk ? Apache Any23 :: Plugins :: HTML Scraper #1021
Archived 4 artifacts
Archive block size is 32768
Received 2 blocks and 163333 bytes
Compression is 28.6%
Took 2.5 sec
[JENKINS] Archiving <https://builds.apache.org/job/Any23-trunk/ws/service/pom.xml> to
org.apache.any23/apache-any23-service/1.1-SNAPSHOT/apache-any23-service-1.1-SNAPSHOT.pom
Sending artifact delta relative to Any23-trunk ? Apache Any23 :: Service #1016
Archived 1 artifacts
Archive block size is 32768
Received 0 blocks and 7071 bytes
Compression is 0.0%
Took 6.3 sec
[JENKINS] Archiving <https://builds.apache.org/job/Any23-trunk/ws/api/pom.xml> to org.apache.any23/apache-any23-api/1.1-SNAPSHOT/apache-any23-api-1.1-SNAPSHOT.pom
[JENKINS] Archiving <https://builds.apache.org/job/Any23-trunk/ws/api/target/apache-any23-api-1.1-SNAPSHOT.jar>
to org.apache.any23/apache-any23-api/1.1-20140622.020246-35/apache-any23-api-1.1-20140622.020246-35.jar
Sending artifact delta relative to Any23-trunk ? Apache Any23 :: Base API #1021
Archived 2 artifacts
Archive block size is 32768
Received 0 blocks and 99274 bytes
Compression is 0.0%
Took 2.2 sec
[JENKINS] Archiving <https://builds.apache.org/job/Any23-trunk/ws/csvutils/pom.xml>
to org.apache.any23/apache-any23-csvutils/1.1-SNAPSHOT/apache-any23-csvutils-1.1-SNAPSHOT.pom
[JENKINS] Archiving <https://builds.apache.org/job/Any23-trunk/ws/csvutils/target/apache-any23-csvutils-1.1-SNAPSHOT.jar>
to org.apache.any23/apache-any23-csvutils/1.1-20140622.020322-35/apache-any23-csvutils-1.1-20140622.020322-35.jar
Sending artifact delta relative to Any23-trunk ? Apache Any23 :: CSV Utilities #1021
Archived 2 artifacts
Archive block size is 32768
Received 0 blocks and 14034 bytes
Compression is 0.0%
Took 0.14 sec
[JENKINS] Archiving <https://builds.apache.org/job/Any23-trunk/ws/plugins/integration-test/pom.xml>
to org.apache.any23.plugins/apache-any23-integration-test/1.1-SNAPSHOT/apache-any23-integration-test-1.1-SNAPSHOT.pom
[JENKINS] Archiving <https://builds.apache.org/job/Any23-trunk/ws/plugins/integration-test/target/apache-any23-integration-test-1.1-SNAPSHOT.jar>
to org.apache.any23.plugins/apache-any23-integration-test/1.1-SNAPSHOT/apache-any23-integration-test-1.1-SNAPSHOT.jar
Sending artifact delta relative to Any23-trunk ? Apache Any23 :: Plugins :: Integration Test
#1016
Archived 2 artifacts
Archive block size is 32768
Received 0 blocks and 14884 bytes
Compression is 0.0%
Took 0.22 sec
[JENKINS] Archiving <https://builds.apache.org/job/Any23-trunk/ws/pom.xml> to org.apache.any23/apache-any23/1.1-SNAPSHOT/apache-any23-1.1-SNAPSHOT.pom
[JENKINS] Archiving <https://builds.apache.org/job/Any23-trunk/ws/target/apache-any23-1.1-SNAPSHOT-site.xml>
to org.apache.any23/apache-any23/1.1-20140622.020232-53/apache-any23-1.1-20140622.020232-53-site.xml
[JENKINS] Archiving <https://builds.apache.org/job/Any23-trunk/ws/target/apache-any23-1.1-SNAPSHOT-src.tar.gz>
to org.apache.any23/apache-any23/1.1-20140622.020232-53/apache-any23-1.1-20140622.020232-53-src.tar.gz
[JENKINS] Archiving <https://builds.apache.org/job/Any23-trunk/ws/target/apache-any23-1.1-SNAPSHOT-src.zip>
to org.apache.any23/apache-any23/1.1-20140622.020232-53/apache-any23-1.1-20140622.020232-53-src.zip
Sending artifact delta relative to Any23-trunk ? Apache Any23 #1021
Archived 4 artifacts
Archive block size is 32768
Received 11 blocks and 3265019 bytes
Compression is 9.9%
Took 4.8 sec
[JENKINS] Archiving <https://builds.apache.org/job/Any23-trunk/ws/plugins/basic-crawler/pom.xml>
to org.apache.any23.plugins/apache-any23-basic-crawler/1.0.5-SNAPSHOT/apache-any23-basic-crawler-1.0.5-SNAPSHOT.pom
[JENKINS] Archiving <https://builds.apache.org/job/Any23-trunk/ws/plugins/basic-crawler/target/apache-any23-basic-crawler-1.0.5-SNAPSHOT.jar>
to org.apache.any23.plugins/apache-any23-basic-crawler/1.0.5-20140622.020507-35/apache-any23-basic-crawler-1.0.5-20140622.020507-35.jar
[JENKINS] Archiving <https://builds.apache.org/job/Any23-trunk/ws/plugins/basic-crawler/target/apache-any23-basic-crawler-1.0.5-SNAPSHOT.tar.gz>
to org.apache.any23.plugins/apache-any23-basic-crawler/1.0.5-20140622.020507-35/apache-any23-basic-crawler-1.0.5-20140622.020507-35.tar.gz
[JENKINS] Archiving <https://builds.apache.org/job/Any23-trunk/ws/plugins/basic-crawler/target/apache-any23-basic-crawler-1.0.5-SNAPSHOT.zip>
to org.apache.any23.plugins/apache-any23-basic-crawler/1.0.5-20140622.020507-35/apache-any23-basic-crawler-1.0.5-20140622.020507-35.zip
[JENKINS] Archiving <https://builds.apache.org/job/Any23-trunk/ws/plugins/basic-crawler/target/apache-any23-basic-crawler-1.0.5-SNAPSHOT-tests.jar>
to org.apache.any23.plugins/apache-any23-basic-crawler/1.0.5-20140622.020507-35/apache-any23-basic-crawler-1.0.5-20140622.020507-35-tests.jar
Sending artifact delta relative to Any23-trunk ? Apache Any23 :: Plugins :: Basic Crawler
#1021
Archived 5 artifacts
Archive block size is 32768
Received 74 blocks and 2799788 bytes
Compression is 46.4%
Took 3.5 sec
[JENKINS] Archiving <https://builds.apache.org/job/Any23-trunk/ws/encoding/pom.xml>
to org.apache.any23/apache-any23-encoding/1.1-SNAPSHOT/apache-any23-encoding-1.1-SNAPSHOT.pom
[JENKINS] Archiving <https://builds.apache.org/job/Any23-trunk/ws/encoding/target/apache-any23-encoding-1.1-SNAPSHOT.jar>
to org.apache.any23/apache-any23-encoding/1.1-20140622.020342-35/apache-any23-encoding-1.1-20140622.020342-35.jar
Sending artifact delta relative to Any23-trunk ? Apache Any23 :: Encoding Detection #1021
Archived 2 artifacts
Archive block size is 32768
Received 0 blocks and 12731 bytes
Compression is 0.0%
Took 0.13 sec
[JENKINS] Archiving <https://builds.apache.org/job/Any23-trunk/ws/nquads/pom.xml> to
org.apache.any23/apache-any23-nquads/1.1-SNAPSHOT/apache-any23-nquads-1.1-SNAPSHOT.pom
[JENKINS] Archiving <https://builds.apache.org/job/Any23-trunk/ws/nquads/target/apache-any23-nquads-1.1-SNAPSHOT.jar>
to org.apache.any23/apache-any23-nquads/1.1-20140622.020313-35/apache-any23-nquads-1.1-20140622.020313-35.jar
Sending artifact delta relative to Any23-trunk ? Apache Any23 :: NQuads Parser and Writer
#1021
Archived 2 artifacts
Archive block size is 32768
Received 0 blocks and 15712 bytes
Compression is 0.0%
Took 0.4 sec
[JENKINS] Archiving <https://builds.apache.org/job/Any23-trunk/ws/mime/pom.xml> to org.apache.any23/apache-any23-mime/1.1-SNAPSHOT/apache-any23-mime-1.1-SNAPSHOT.pom
[JENKINS] Archiving <https://builds.apache.org/job/Any23-trunk/ws/mime/target/apache-any23-mime-1.1-SNAPSHOT.jar>
to org.apache.any23/apache-any23-mime/1.1-20140622.020334-35/apache-any23-mime-1.1-20140622.020334-35.jar
Sending artifact delta relative to Any23-trunk ? Apache Any23 :: Mime Type Detection #1021
Archived 2 artifacts
Archive block size is 32768
Received 0 blocks and 47400 bytes
Compression is 0.0%
Took 2.4 sec
channel stopped

Mime
View raw message