any23-dev mailing list archives

Site index · List index
Message view « Date » · « Thread »
Top « Date » · « Thread »
From Apache Jenkins Server <jenk...@builds.apache.org>
Subject Build failed in Jenkins: Any23-trunk #872
Date Sat, 14 Dec 2013 10:54:58 GMT
See <https://builds.apache.org/job/Any23-trunk/872/>

------------------------------------------
[...truncated 6716 lines...]
Results :

Tests run: 35, Failures: 0, Errors: 0, Skipped: 3

[JENKINS] Recording test results
[INFO] [assembly:single {execution: prepare-package}]
[INFO] Reading assembly descriptor: <https://builds.apache.org/job/Any23-trunk/ws/service/src/main/assembly/prepare-war-legals.xml>
[INFO] Copying files to <https://builds.apache.org/job/Any23-trunk/ws/service/target/war-legals>
[INFO] [war:war {execution: default-war}]
[INFO] Packaging webapp
[INFO] Assembling webapp [apache-any23-service] in [<https://builds.apache.org/job/Any23-trunk/ws/service/target/apache-any23-service-0.9.1-SNAPSHOT]>
[INFO] Processing war project
[INFO] Copying webapp webResources [<https://builds.apache.org/job/Any23-trunk/ws/service/src/main/resources/]>
to [<https://builds.apache.org/job/Any23-trunk/ws/service/target/apache-any23-service-0.9.1-SNAPSHOT]>
[INFO] Copying webapp resources [<https://builds.apache.org/job/Any23-trunk/ws/service/src/main/webapp]>
[INFO] Webapp assembled in [225 msecs]
[INFO] Building war: <https://builds.apache.org/job/Any23-trunk/ws/service/target/apache-any23-service-0.9.1-SNAPSHOT.war>
[INFO] WEB-INF/web.xml already added, skipping
[INFO] [war:war {execution: self-contained-war}]
[INFO] Packaging webapp
[INFO] Assembling webapp [apache-any23-service] in [<https://builds.apache.org/job/Any23-trunk/ws/service/target/apache-any23-service-0.9.1-SNAPSHOT]>
[INFO] Processing war project
[INFO] Copying webapp webResources [<https://builds.apache.org/job/Any23-trunk/ws/service/target/war-legals/with-deps/]>
to [<https://builds.apache.org/job/Any23-trunk/ws/service/target/apache-any23-service-0.9.1-SNAPSHOT]>
[INFO] Copying webapp resources [<https://builds.apache.org/job/Any23-trunk/ws/service/src/main/webapp]>
[INFO] Webapp assembled in [139 msecs]
[INFO] Building war: <https://builds.apache.org/job/Any23-trunk/ws/service/target/apache-any23-service-0.9.1-SNAPSHOT.war>
[INFO] WEB-INF/web.xml already added, skipping
[INFO] [war:war {execution: war-without-deps}]
[INFO] Packaging webapp
[INFO] Assembling webapp [apache-any23-service] in [<https://builds.apache.org/job/Any23-trunk/ws/service/target/apache-any23-service-0.9.1-SNAPSHOT]>
[INFO] Processing war project
[INFO] Copying webapp webResources [<https://builds.apache.org/job/Any23-trunk/ws/service/target/war-legals/without-deps/]>
to [<https://builds.apache.org/job/Any23-trunk/ws/service/target/apache-any23-service-0.9.1-SNAPSHOT]>
[INFO] Copying webapp resources [<https://builds.apache.org/job/Any23-trunk/ws/service/src/main/webapp]>
[INFO] Webapp assembled in [135 msecs]
[INFO] Building war: <https://builds.apache.org/job/Any23-trunk/ws/service/target/apache-any23-service-0.9.1-SNAPSHOT-without-deps.war>
[INFO] WEB-INF/web.xml already added, skipping
[INFO] [assembly:single {execution: assembly}]
[INFO] Reading assembly descriptor: <https://builds.apache.org/job/Any23-trunk/ws/service/src/main/assembly/with-deps.xml>
[INFO] Reading assembly descriptor: <https://builds.apache.org/job/Any23-trunk/ws/service/src/main/assembly/without-deps.xml>
[INFO] Reading assembly descriptor: <https://builds.apache.org/job/Any23-trunk/ws/service/src/main/assembly/server-embedded.xml>
[INFO] Building tar: <https://builds.apache.org/job/Any23-trunk/ws/service/target/apache-any23-service-0.9.1-SNAPSHOT-with-deps.tar.gz>
[INFO] Building zip: <https://builds.apache.org/job/Any23-trunk/ws/service/target/apache-any23-service-0.9.1-SNAPSHOT-with-deps.zip>
[INFO] Building tar: <https://builds.apache.org/job/Any23-trunk/ws/service/target/apache-any23-service-0.9.1-SNAPSHOT-without-deps.tar.gz>
[INFO] Building zip: <https://builds.apache.org/job/Any23-trunk/ws/service/target/apache-any23-service-0.9.1-SNAPSHOT-without-deps.zip>
[INFO] Building tar: <https://builds.apache.org/job/Any23-trunk/ws/service/target/apache-any23-service-0.9.1-SNAPSHOT-server-embedded.tar.gz>
[INFO] Building zip: <https://builds.apache.org/job/Any23-trunk/ws/service/target/apache-any23-service-0.9.1-SNAPSHOT-server-embedded.zip>
[INFO] [install:install {execution: default-install}]
[INFO] Installing <https://builds.apache.org/job/Any23-trunk/ws/service/target/apache-any23-service-0.9.1-SNAPSHOT.war>
to /home/jenkins/jenkins-slave/maven-repositories/1/org/apache/any23/apache-any23-service/0.9.1-SNAPSHOT/apache-any23-service-0.9.1-SNAPSHOT.war
[INFO] Installing <https://builds.apache.org/job/Any23-trunk/ws/service/target/apache-any23-service-0.9.1-SNAPSHOT-without-deps.war>
to /home/jenkins/jenkins-slave/maven-repositories/1/org/apache/any23/apache-any23-service/0.9.1-SNAPSHOT/apache-any23-service-0.9.1-SNAPSHOT-without-deps.war
[INFO] Installing <https://builds.apache.org/job/Any23-trunk/ws/service/target/apache-any23-service-0.9.1-SNAPSHOT-with-deps.tar.gz>
to /home/jenkins/jenkins-slave/maven-repositories/1/org/apache/any23/apache-any23-service/0.9.1-SNAPSHOT/apache-any23-service-0.9.1-SNAPSHOT-with-deps.tar.gz
[INFO] Installing <https://builds.apache.org/job/Any23-trunk/ws/service/target/apache-any23-service-0.9.1-SNAPSHOT-with-deps.zip>
to /home/jenkins/jenkins-slave/maven-repositories/1/org/apache/any23/apache-any23-service/0.9.1-SNAPSHOT/apache-any23-service-0.9.1-SNAPSHOT-with-deps.zip
[INFO] Installing <https://builds.apache.org/job/Any23-trunk/ws/service/target/apache-any23-service-0.9.1-SNAPSHOT-without-deps.tar.gz>
to /home/jenkins/jenkins-slave/maven-repositories/1/org/apache/any23/apache-any23-service/0.9.1-SNAPSHOT/apache-any23-service-0.9.1-SNAPSHOT-without-deps.tar.gz
[INFO] Installing <https://builds.apache.org/job/Any23-trunk/ws/service/target/apache-any23-service-0.9.1-SNAPSHOT-without-deps.zip>
to /home/jenkins/jenkins-slave/maven-repositories/1/org/apache/any23/apache-any23-service/0.9.1-SNAPSHOT/apache-any23-service-0.9.1-SNAPSHOT-without-deps.zip
[INFO] Installing <https://builds.apache.org/job/Any23-trunk/ws/service/target/apache-any23-service-0.9.1-SNAPSHOT-server-embedded.tar.gz>
to /home/jenkins/jenkins-slave/maven-repositories/1/org/apache/any23/apache-any23-service/0.9.1-SNAPSHOT/apache-any23-service-0.9.1-SNAPSHOT-server-embedded.tar.gz
[INFO] Installing <https://builds.apache.org/job/Any23-trunk/ws/service/target/apache-any23-service-0.9.1-SNAPSHOT-server-embedded.zip>
to /home/jenkins/jenkins-slave/maven-repositories/1/org/apache/any23/apache-any23-service/0.9.1-SNAPSHOT/apache-any23-service-0.9.1-SNAPSHOT-server-embedded.zip
[INFO] [deploy:deploy {execution: default-deploy}]
[INFO] Retrieving previous build number from apache.snapshots.https
[WARNING] *** CHECKSUM FAILED - Checksum failed on download: local = 'a0b42acbd832bc11a6e55e8631b999c4621c21ff';
remote = 'dca9c10f6c95a34d81457515d35ff0c35e0ca01d' - RETRYING
[WARNING] *** CHECKSUM FAILED - Checksum failed on download: local = 'a0b42acbd832bc11a6e55e8631b999c4621c21ff';
remote = 'dca9c10f6c95a34d81457515d35ff0c35e0ca01d' - IGNORING
Uploading: https://repository.apache.org/content/repositories/snapshots/org/apache/any23/apache-any23-service/0.9.1-SNAPSHOT/apache-any23-service-0.9.1-20131214.104118-72.war
27322K uploaded  (apache-any23-service-0.9.1-20131214.104118-72.war)
[INFO] Retrieving previous metadata from apache.snapshots.https
[WARNING] *** CHECKSUM FAILED - Checksum failed on download: local = '1ffd895b5928395533d3c689110876ae3e4bd046';
remote = 'd7868b4f96ad41bc8c564dca75bdb65c2221fa66' - RETRYING
[WARNING] *** CHECKSUM FAILED - Checksum failed on download: local = '1ffd895b5928395533d3c689110876ae3e4bd046';
remote = 'd7868b4f96ad41bc8c564dca75bdb65c2221fa66' - IGNORING
[INFO] Uploading repository metadata for: 'artifact org.apache.any23:apache-any23-service'
[INFO] Uploading project information for apache-any23-service 0.9.1-20131214.104118-72
[INFO] Retrieving previous metadata from apache.snapshots.https
[WARNING] *** CHECKSUM FAILED - Checksum failed on download: local = 'a0b42acbd832bc11a6e55e8631b999c4621c21ff';
remote = 'dca9c10f6c95a34d81457515d35ff0c35e0ca01d' - RETRYING
[WARNING] *** CHECKSUM FAILED - Checksum failed on download: local = 'a0b42acbd832bc11a6e55e8631b999c4621c21ff';
remote = 'dca9c10f6c95a34d81457515d35ff0c35e0ca01d' - IGNORING
[INFO] Uploading repository metadata for: 'snapshot org.apache.any23:apache-any23-service:0.9.1-SNAPSHOT'
[INFO] Retrieving previous build number from apache.snapshots.https
Uploading: https://repository.apache.org/content/repositories/snapshots/org/apache/any23/apache-any23-service/0.9.1-SNAPSHOT/apache-any23-service-0.9.1-20131214.104118-72-without-deps.war
121K uploaded  (apache-any23-service-0.9.1-20131214.104118-72-without-deps.war)
[INFO] Retrieving previous build number from apache.snapshots.https
Uploading: https://repository.apache.org/content/repositories/snapshots/org/apache/any23/apache-any23-service/0.9.1-SNAPSHOT/apache-any23-service-0.9.1-20131214.104118-72-with-deps.tar.gz
27334K uploaded  (apache-any23-service-0.9.1-20131214.104118-72-with-deps.tar.gz)
[INFO] Retrieving previous build number from apache.snapshots.https
Uploading: https://repository.apache.org/content/repositories/snapshots/org/apache/any23/apache-any23-service/0.9.1-SNAPSHOT/apache-any23-service-0.9.1-20131214.104118-72-with-deps.zip
27334K uploaded  (apache-any23-service-0.9.1-20131214.104118-72-with-deps.zip)
[INFO] Retrieving previous build number from apache.snapshots.https
Uploading: https://repository.apache.org/content/repositories/snapshots/org/apache/any23/apache-any23-service/0.9.1-SNAPSHOT/apache-any23-service-0.9.1-20131214.104118-72-without-deps.tar.gz
122K uploaded  (apache-any23-service-0.9.1-20131214.104118-72-without-deps.tar.gz)
[INFO] Retrieving previous build number from apache.snapshots.https
Uploading: https://repository.apache.org/content/repositories/snapshots/org/apache/any23/apache-any23-service/0.9.1-SNAPSHOT/apache-any23-service-0.9.1-20131214.104118-72-without-deps.zip
122K uploaded  (apache-any23-service-0.9.1-20131214.104118-72-without-deps.zip)
[INFO] Retrieving previous build number from apache.snapshots.https
Uploading: https://repository.apache.org/content/repositories/snapshots/org/apache/any23/apache-any23-service/0.9.1-SNAPSHOT/apache-any23-service-0.9.1-20131214.104118-72-server-embedded.tar.gz
31725K uploaded  (apache-any23-service-0.9.1-20131214.104118-72-server-embedded.tar.gz)
[INFO] Retrieving previous build number from apache.snapshots.https
Uploading: https://repository.apache.org/content/repositories/snapshots/org/apache/any23/apache-any23-service/0.9.1-SNAPSHOT/apache-any23-service-0.9.1-20131214.104118-72-server-embedded.zip
31728K uploaded  (apache-any23-service-0.9.1-20131214.104118-72-server-embedded.zip)
[INFO] 
[INFO] 
[INFO] ------------------------------------------------------------------------
[INFO] Reactor Summary:
[INFO] ------------------------------------------------------------------------
[INFO] Apache Any23 .......................................... SUCCESS [46.536s]
[INFO] Apache Any23 :: Base API .............................. SUCCESS [20.671s]
[INFO] Apache Any23 :: Test Resources ........................ SUCCESS [14.913s]
[INFO] Apache Any23 :: NQuads Parser and Writer .............. SUCCESS [24.824s]
[INFO] Apache Any23 :: CSV Utilities ......................... SUCCESS [16.112s]
[INFO] Apache Any23 :: Mime Type Detection ................... SUCCESS [20.264s]
[INFO] Apache Any23 :: Encoding Detection .................... SUCCESS [13.155s]
[INFO] Apache Any23 :: Core .................................. SUCCESS [1:08.350s]
[INFO] Apache Any23 :: Plugins :: Basic Crawler .............. SUCCESS [38.958s]
[INFO] Apache Any23 :: Plugins :: HTML Scraper ............... SUCCESS [15.591s]
[INFO] Apache Any23 :: Plugins :: Office Scraper ............. SUCCESS [25.176s]
[INFO] Apache Any23 :: Plugins :: Integration Test ........... SUCCESS [1:12.378s]
[INFO] Apache Any23 :: Service ............................... SUCCESS [1:25.465s]
[INFO] ------------------------------------------------------------------------
[INFO] ------------------------------------------------------------------------
[INFO] BUILD SUCCESSFUL
[INFO] ------------------------------------------------------------------------
[INFO] Total time: 8 minutes 14 seconds
[INFO] Finished at: Sat Dec 14 10:48:51 UTC 2013
[INFO] Final Memory: 80M/371M
[INFO] ------------------------------------------------------------------------
Waiting for Jenkins to finish collecting data
[JENKINS] Archiving <https://builds.apache.org/job/Any23-trunk/ws/core/pom.xml> to org.apache.any23/apache-any23-core/0.9.1-SNAPSHOT/apache-any23-core-0.9.1-SNAPSHOT.pom
[JENKINS] Archiving <https://builds.apache.org/job/Any23-trunk/ws/core/target/apache-any23-core-0.9.1-SNAPSHOT.jar>
to org.apache.any23/apache-any23-core/0.9.1-20131214.104118-59/apache-any23-core-0.9.1-20131214.104118-59.jar
[JENKINS] Archiving <https://builds.apache.org/job/Any23-trunk/ws/core/target/apache-any23-core-0.9.1-SNAPSHOT.tar.gz>
to org.apache.any23/apache-any23-core/0.9.1-20131214.104118-59/apache-any23-core-0.9.1-20131214.104118-59.tar.gz
[JENKINS] Archiving <https://builds.apache.org/job/Any23-trunk/ws/core/target/apache-any23-core-0.9.1-SNAPSHOT.zip>
to org.apache.any23/apache-any23-core/0.9.1-20131214.104118-59/apache-any23-core-0.9.1-20131214.104118-59.zip
[JENKINS] Archiving <https://builds.apache.org/job/Any23-trunk/ws/core/target/apache-any23-core-0.9.1-SNAPSHOT-tests.jar>
to org.apache.any23/apache-any23-core/0.9.1-20131214.104118-59/apache-any23-core-0.9.1-20131214.104118-59-tests.jar
[JENKINS] Archiving <https://builds.apache.org/job/Any23-trunk/ws/test-resources/pom.xml>
to org.apache.any23/apache-any23-test-resources/0.9.1-SNAPSHOT/apache-any23-test-resources-0.9.1-SNAPSHOT.pom
[JENKINS] Archiving <https://builds.apache.org/job/Any23-trunk/ws/test-resources/target/apache-any23-test-resources-0.9.1-SNAPSHOT.jar>
to org.apache.any23/apache-any23-test-resources/0.9.1-20131214.104118-51/apache-any23-test-resources-0.9.1-20131214.104118-51.jar
[JENKINS] Archiving <https://builds.apache.org/job/Any23-trunk/ws/test-resources/target/apache-any23-test-resources-0.9.1-SNAPSHOT-tests.jar>
to org.apache.any23/apache-any23-test-resources/0.9.1-20131214.104118-51/apache-any23-test-resources-0.9.1-20131214.104118-51-tests.jar
[JENKINS] Archiving <https://builds.apache.org/job/Any23-trunk/ws/plugins/office-scraper/pom.xml>
to org.apache.any23.plugins/apache-any23-office-scraper/1.0.4-SNAPSHOT/apache-any23-office-scraper-1.0.4-SNAPSHOT.pom
[JENKINS] Archiving <https://builds.apache.org/job/Any23-trunk/ws/plugins/office-scraper/target/apache-any23-office-scraper-1.0.4-SNAPSHOT.jar>
to org.apache.any23.plugins/apache-any23-office-scraper/1.0.4-20131214.104118-53/apache-any23-office-scraper-1.0.4-20131214.104118-53.jar
[JENKINS] Archiving <https://builds.apache.org/job/Any23-trunk/ws/plugins/office-scraper/target/apache-any23-office-scraper-1.0.4-SNAPSHOT.tar.gz>
to org.apache.any23.plugins/apache-any23-office-scraper/1.0.4-20131214.104118-53/apache-any23-office-scraper-1.0.4-20131214.104118-53.tar.gz
[JENKINS] Archiving <https://builds.apache.org/job/Any23-trunk/ws/plugins/office-scraper/target/apache-any23-office-scraper-1.0.4-SNAPSHOT.zip>
to org.apache.any23.plugins/apache-any23-office-scraper/1.0.4-20131214.104118-53/apache-any23-office-scraper-1.0.4-20131214.104118-53.zip
[JENKINS] Archiving <https://builds.apache.org/job/Any23-trunk/ws/plugins/html-scraper/pom.xml>
to org.apache.any23.plugins/apache-any23-html-scraper/1.0.5-SNAPSHOT/apache-any23-html-scraper-1.0.5-SNAPSHOT.pom
[JENKINS] Archiving <https://builds.apache.org/job/Any23-trunk/ws/plugins/html-scraper/target/apache-any23-html-scraper-1.0.5-SNAPSHOT.jar>
to org.apache.any23.plugins/apache-any23-html-scraper/1.0.5-20131214.104118-54/apache-any23-html-scraper-1.0.5-20131214.104118-54.jar
[JENKINS] Archiving <https://builds.apache.org/job/Any23-trunk/ws/plugins/html-scraper/target/apache-any23-html-scraper-1.0.5-SNAPSHOT.tar.gz>
to org.apache.any23.plugins/apache-any23-html-scraper/1.0.5-20131214.104118-54/apache-any23-html-scraper-1.0.5-20131214.104118-54.tar.gz
[JENKINS] Archiving <https://builds.apache.org/job/Any23-trunk/ws/plugins/html-scraper/target/apache-any23-html-scraper-1.0.5-SNAPSHOT.zip>
to org.apache.any23.plugins/apache-any23-html-scraper/1.0.5-20131214.104118-54/apache-any23-html-scraper-1.0.5-20131214.104118-54.zip
[JENKINS] Archiving <https://builds.apache.org/job/Any23-trunk/ws/service/pom.xml> to
org.apache.any23/apache-any23-service/0.9.1-SNAPSHOT/apache-any23-service-0.9.1-SNAPSHOT.pom
[JENKINS] Archiving <https://builds.apache.org/job/Any23-trunk/ws/service/target/apache-any23-service-0.9.1-SNAPSHOT.war>
to org.apache.any23/apache-any23-service/0.9.1-20131214.104118-72/apache-any23-service-0.9.1-20131214.104118-72.war
[JENKINS] Archiving <https://builds.apache.org/job/Any23-trunk/ws/service/target/apache-any23-service-0.9.1-SNAPSHOT-without-deps.war>
to org.apache.any23/apache-any23-service/0.9.1-20131214.104118-72/apache-any23-service-0.9.1-20131214.104118-72-without-deps.war
[JENKINS] Archiving <https://builds.apache.org/job/Any23-trunk/ws/service/target/apache-any23-service-0.9.1-SNAPSHOT-with-deps.tar.gz>
to org.apache.any23/apache-any23-service/0.9.1-20131214.104118-72/apache-any23-service-0.9.1-20131214.104118-72-with-deps.tar.gz
[JENKINS] Archiving <https://builds.apache.org/job/Any23-trunk/ws/service/target/apache-any23-service-0.9.1-SNAPSHOT-with-deps.zip>
to org.apache.any23/apache-any23-service/0.9.1-20131214.104118-72/apache-any23-service-0.9.1-20131214.104118-72-with-deps.zip
[JENKINS] Archiving <https://builds.apache.org/job/Any23-trunk/ws/service/target/apache-any23-service-0.9.1-SNAPSHOT-without-deps.tar.gz>
to org.apache.any23/apache-any23-service/0.9.1-20131214.104118-72/apache-any23-service-0.9.1-20131214.104118-72-without-deps.tar.gz
[JENKINS] Archiving <https://builds.apache.org/job/Any23-trunk/ws/service/target/apache-any23-service-0.9.1-SNAPSHOT-without-deps.zip>
to org.apache.any23/apache-any23-service/0.9.1-20131214.104118-72/apache-any23-service-0.9.1-20131214.104118-72-without-deps.zip
[JENKINS] Archiving <https://builds.apache.org/job/Any23-trunk/ws/service/target/apache-any23-service-0.9.1-SNAPSHOT-server-embedded.tar.gz>
to org.apache.any23/apache-any23-service/0.9.1-20131214.104118-72/apache-any23-service-0.9.1-20131214.104118-72-server-embedded.tar.gz
[JENKINS] Archiving <https://builds.apache.org/job/Any23-trunk/ws/service/target/apache-any23-service-0.9.1-SNAPSHOT-server-embedded.zip>
to org.apache.any23/apache-any23-service/0.9.1-20131214.104118-72/apache-any23-service-0.9.1-20131214.104118-72-server-embedded.zip
[JENKINS] Archiving <https://builds.apache.org/job/Any23-trunk/ws/api/pom.xml> to org.apache.any23/apache-any23-api/0.9.1-SNAPSHOT/apache-any23-api-0.9.1-SNAPSHOT.pom
[JENKINS] Archiving <https://builds.apache.org/job/Any23-trunk/ws/api/target/apache-any23-api-0.9.1-SNAPSHOT.jar>
to org.apache.any23/apache-any23-api/0.9.1-20131214.104118-47/apache-any23-api-0.9.1-20131214.104118-47.jar
[JENKINS] Archiving <https://builds.apache.org/job/Any23-trunk/ws/csvutils/pom.xml>
to org.apache.any23/apache-any23-csvutils/0.9.1-SNAPSHOT/apache-any23-csvutils-0.9.1-SNAPSHOT.pom
[JENKINS] Archiving <https://builds.apache.org/job/Any23-trunk/ws/csvutils/target/apache-any23-csvutils-0.9.1-SNAPSHOT.jar>
to org.apache.any23/apache-any23-csvutils/0.9.1-20131214.104118-47/apache-any23-csvutils-0.9.1-20131214.104118-47.jar
[JENKINS] Archiving <https://builds.apache.org/job/Any23-trunk/ws/plugins/integration-test/pom.xml>
to org.apache.any23.plugins/apache-any23-integration-test/0.9.1-SNAPSHOT/apache-any23-integration-test-0.9.1-SNAPSHOT.pom
[JENKINS] Archiving <https://builds.apache.org/job/Any23-trunk/ws/plugins/integration-test/target/apache-any23-integration-test-0.9.1-SNAPSHOT.jar>
to org.apache.any23.plugins/apache-any23-integration-test/0.9.1-20131214.104118-44/apache-any23-integration-test-0.9.1-20131214.104118-44.jar
[JENKINS] Archiving <https://builds.apache.org/job/Any23-trunk/ws/pom.xml> to org.apache.any23/apache-any23/0.9.1-SNAPSHOT/apache-any23-0.9.1-SNAPSHOT.pom
[JENKINS] Archiving /home/jenkins/jenkins-slave/maven-repositories/1/org/apache/any23/apache-any23/0.9.1-SNAPSHOT/apache-any23-0.9.1-SNAPSHOT.pom
to org.apache.any23/apache-any23/0.9.1-20131214.104118-59/apache-any23-0.9.1-20131214.104118-59.pom
[JENKINS] Archiving <https://builds.apache.org/job/Any23-trunk/ws/target/apache-any23-0.9.1-SNAPSHOT-site.xml>
to org.apache.any23/apache-any23/0.9.1-20131214.104118-59/apache-any23-0.9.1-20131214.104118-59-site.xml
[JENKINS] Archiving <https://builds.apache.org/job/Any23-trunk/ws/target/apache-any23-0.9.1-SNAPSHOT-src.tar.gz>
to org.apache.any23/apache-any23/0.9.1-20131214.104118-59/apache-any23-0.9.1-20131214.104118-59-src.tar.gz
[JENKINS] Archiving <https://builds.apache.org/job/Any23-trunk/ws/target/apache-any23-0.9.1-SNAPSHOT-src.zip>
to org.apache.any23/apache-any23/0.9.1-20131214.104118-59/apache-any23-0.9.1-20131214.104118-59-src.zip
/home/jenkins/jenkins-slave/maven-repositories/1/org/apache/any23/apache-any23/0.9.1-SNAPSHOT/apache-any23-0.9.1-SNAPSHOT.pom
is not inside <https://builds.apache.org/job/Any23-trunk/ws/;> will archive in a separate
pass
[JENKINS] Archiving <https://builds.apache.org/job/Any23-trunk/ws/plugins/basic-crawler/pom.xml>
to org.apache.any23.plugins/apache-any23-basic-crawler/1.0.4-SNAPSHOT/apache-any23-basic-crawler-1.0.4-SNAPSHOT.pom
[JENKINS] Archiving <https://builds.apache.org/job/Any23-trunk/ws/plugins/basic-crawler/target/apache-any23-basic-crawler-1.0.4-SNAPSHOT.jar>
to org.apache.any23.plugins/apache-any23-basic-crawler/1.0.4-20131214.104118-58/apache-any23-basic-crawler-1.0.4-20131214.104118-58.jar
[JENKINS] Archiving <https://builds.apache.org/job/Any23-trunk/ws/plugins/basic-crawler/target/apache-any23-basic-crawler-1.0.4-SNAPSHOT.tar.gz>
to org.apache.any23.plugins/apache-any23-basic-crawler/1.0.4-20131214.104118-58/apache-any23-basic-crawler-1.0.4-20131214.104118-58.tar.gz
[JENKINS] Archiving <https://builds.apache.org/job/Any23-trunk/ws/plugins/basic-crawler/target/apache-any23-basic-crawler-1.0.4-SNAPSHOT.zip>
to org.apache.any23.plugins/apache-any23-basic-crawler/1.0.4-20131214.104118-58/apache-any23-basic-crawler-1.0.4-20131214.104118-58.zip
[JENKINS] Archiving <https://builds.apache.org/job/Any23-trunk/ws/plugins/basic-crawler/target/apache-any23-basic-crawler-1.0.4-SNAPSHOT-tests.jar>
to org.apache.any23.plugins/apache-any23-basic-crawler/1.0.4-20131214.104118-58/apache-any23-basic-crawler-1.0.4-20131214.104118-58-tests.jar
[JENKINS] Archiving <https://builds.apache.org/job/Any23-trunk/ws/encoding/pom.xml>
to org.apache.any23/apache-any23-encoding/0.9.1-SNAPSHOT/apache-any23-encoding-0.9.1-SNAPSHOT.pom
[JENKINS] Archiving <https://builds.apache.org/job/Any23-trunk/ws/encoding/target/apache-any23-encoding-0.9.1-SNAPSHOT.jar>
to org.apache.any23/apache-any23-encoding/0.9.1-20131214.104118-47/apache-any23-encoding-0.9.1-20131214.104118-47.jar
[JENKINS] Archiving <https://builds.apache.org/job/Any23-trunk/ws/nquads/pom.xml> to
org.apache.any23/apache-any23-nquads/0.9.1-SNAPSHOT/apache-any23-nquads-0.9.1-SNAPSHOT.pom
[JENKINS] Archiving <https://builds.apache.org/job/Any23-trunk/ws/nquads/target/apache-any23-nquads-0.9.1-SNAPSHOT.jar>
to org.apache.any23/apache-any23-nquads/0.9.1-20131214.104118-47/apache-any23-nquads-0.9.1-20131214.104118-47.jar
[JENKINS] Archiving <https://builds.apache.org/job/Any23-trunk/ws/mime/pom.xml> to org.apache.any23/apache-any23-mime/0.9.1-SNAPSHOT/apache-any23-mime-0.9.1-SNAPSHOT.pom
[JENKINS] Archiving <https://builds.apache.org/job/Any23-trunk/ws/mime/target/apache-any23-mime-0.9.1-SNAPSHOT.jar>
to org.apache.any23/apache-any23-mime/0.9.1-20131214.104118-47/apache-any23-mime-0.9.1-20131214.104118-47.jar
channel stopped
Maven RedeployPublisher use remote ubuntu4 maven settings from : /home/jenkins/.m2/settings.xml
[INFO] Deployment in https://repository.apache.org/content/repositories/snapshots (id=apache.snapshots.https,uniqueVersion=false)
Deploying the main artifact jenkins-3755772758641666551apache-any23-0.9.1-20131214.104118-59.pom
Deploying the main artifact jenkins-448483335737245758apache-any23-0.9.1-20131214.104118-59-site.xml
Deploying the main artifact jenkins-5580340057246011367apache-any23-0.9.1-20131214.104118-59-src.tar.gz
Deploying the main artifact jenkins-8948557100594194419apache-any23-0.9.1-20131214.104118-59-src.zip
[INFO] Deployment in https://repository.apache.org/content/repositories/snapshots (id=apache.snapshots.https,uniqueVersion=false)
Deploying the main artifact jenkins-3003563872422333100apache-any23-api-0.9.1-20131214.104118-47.jar
[INFO] Deployment in https://repository.apache.org/content/repositories/snapshots (id=apache.snapshots.https,uniqueVersion=false)
Deploying the main artifact jenkins-5317067838297003346apache-any23-core-0.9.1-20131214.104118-59.jar
Deploying the main artifact jenkins-3955756858224836817apache-any23-core-0.9.1-20131214.104118-59.tar.gz
Deploying the main artifact jenkins-2857307937764472253apache-any23-core-0.9.1-20131214.104118-59.zip
Deploying the main artifact jenkins-6840702655944510971apache-any23-core-0.9.1-20131214.104118-59-tests.jar
[INFO] Deployment in https://repository.apache.org/content/repositories/snapshots (id=apache.snapshots.https,uniqueVersion=false)
Deploying the main artifact jenkins-4496332636812926850apache-any23-csvutils-0.9.1-20131214.104118-47.jar
[INFO] Deployment in https://repository.apache.org/content/repositories/snapshots (id=apache.snapshots.https,uniqueVersion=false)
Deploying the main artifact jenkins-1476188684843034001apache-any23-encoding-0.9.1-20131214.104118-47.jar
[INFO] Deployment in https://repository.apache.org/content/repositories/snapshots (id=apache.snapshots.https,uniqueVersion=false)
Deploying the main artifact jenkins-7183540513570655407apache-any23-mime-0.9.1-20131214.104118-47.jar
[INFO] Deployment in https://repository.apache.org/content/repositories/snapshots (id=apache.snapshots.https,uniqueVersion=false)
Deploying the main artifact jenkins-5522242467561701648apache-any23-nquads-0.9.1-20131214.104118-47.jar
[INFO] Deployment in https://repository.apache.org/content/repositories/snapshots (id=apache.snapshots.https,uniqueVersion=false)
Deploying the main artifact jenkins-2076824799881169719apache-any23-service-0.9.1-20131214.104118-72.war
Deploying the main artifact jenkins-1674376072301330686apache-any23-service-0.9.1-20131214.104118-72-without-deps.war
Deploying the main artifact jenkins-4108610218066541608apache-any23-service-0.9.1-20131214.104118-72-with-deps.tar.gz
Deploying the main artifact jenkins-1812685801599925872apache-any23-service-0.9.1-20131214.104118-72-with-deps.zip
Deploying the main artifact jenkins-4951443357767916524apache-any23-service-0.9.1-20131214.104118-72-without-deps.tar.gz
Deploying the main artifact jenkins-4918272489983249302apache-any23-service-0.9.1-20131214.104118-72-without-deps.zip
Deploying the main artifact jenkins-7450609838935582759apache-any23-service-0.9.1-20131214.104118-72-server-embedded.tar.gz
Deploying the main artifact jenkins-1077651796194510722apache-any23-service-0.9.1-20131214.104118-72-server-embedded.zip
[INFO] Deployment in https://repository.apache.org/content/repositories/snapshots (id=apache.snapshots.https,uniqueVersion=false)
Deploying the main artifact jenkins-6244396024918500905apache-any23-test-resources-0.9.1-20131214.104118-51.jar
Deploying the main artifact jenkins-5212747662267234814apache-any23-test-resources-0.9.1-20131214.104118-51-tests.jar
[INFO] Deployment in https://repository.apache.org/content/repositories/snapshots (id=apache.snapshots.https,uniqueVersion=false)
Deploying the main artifact jenkins-632913488179366562apache-any23-basic-crawler-1.0.4-20131214.104118-58.jar
Deploying the main artifact jenkins-872588735685015782apache-any23-basic-crawler-1.0.4-20131214.104118-58.tar.gz
Deploying the main artifact jenkins-7046151743196888450apache-any23-basic-crawler-1.0.4-20131214.104118-58.zip
Deploying the main artifact jenkins-2584013499558215727apache-any23-basic-crawler-1.0.4-20131214.104118-58-tests.jar
ERROR: Error installing artifact's metadata: Error while deploying metadata: The target server
failed to respond
org.apache.maven.artifact.deployer.ArtifactDeploymentException: Error installing artifact's
metadata: Error while deploying metadata: The target server failed to respond
	at hudson.maven.artifact.deployer.DefaultArtifactDeployer.deploy(DefaultArtifactDeployer.java:183)
	at hudson.maven.reporters.MavenArtifactRecord.deploy(MavenArtifactRecord.java:200)
	at hudson.maven.RedeployPublisher.perform(RedeployPublisher.java:176)
	at hudson.tasks.BuildStepMonitor$1.perform(BuildStepMonitor.java:20)
	at hudson.model.AbstractBuild$AbstractBuildExecution.perform(AbstractBuild.java:785)
	at hudson.model.AbstractBuild$AbstractBuildExecution.performAllBuildSteps(AbstractBuild.java:757)
	at hudson.maven.MavenModuleSetBuild$MavenModuleSetBuildExecution.post2(MavenModuleSetBuild.java:1020)
	at hudson.model.AbstractBuild$AbstractBuildExecution.post(AbstractBuild.java:706)
	at hudson.model.Run.execute(Run.java:1702)
	at hudson.maven.MavenModuleSetBuild.run(MavenModuleSetBuild.java:509)
	at hudson.model.ResourceController.execute(ResourceController.java:88)
	at hudson.model.Executor.run(Executor.java:231)
Caused by: org.apache.maven.artifact.repository.metadata.RepositoryMetadataDeploymentException:
Error while deploying metadata: The target server failed to respond
	at org.apache.maven.artifact.repository.metadata.DefaultRepositoryMetadataManager.deploy(DefaultRepositoryMetadataManager.java:492)
	at hudson.maven.artifact.deployer.DefaultArtifactDeployer.deploy(DefaultArtifactDeployer.java:167)
	... 11 more
Caused by: org.apache.maven.wagon.TransferFailedException: The target server failed to respond
	at org.apache.maven.wagon.shared.http4.AbstractHttpClientWagon.put(AbstractHttpClientWagon.java:580)
	at org.apache.maven.wagon.shared.http4.AbstractHttpClientWagon.put(AbstractHttpClientWagon.java:524)
	at org.apache.maven.wagon.shared.http4.AbstractHttpClientWagon.put(AbstractHttpClientWagon.java:505)
	at org.apache.maven.wagon.shared.http4.AbstractHttpClientWagon.put(AbstractHttpClientWagon.java:485)
	at org.apache.maven.repository.legacy.DefaultWagonManager.putRemoteFile(DefaultWagonManager.java:543)
	at org.apache.maven.repository.legacy.DefaultWagonManager.putArtifactMetadata(DefaultWagonManager.java:501)
	at org.apache.maven.artifact.repository.metadata.DefaultRepositoryMetadataManager.deploy(DefaultRepositoryMetadataManager.java:488)
	... 12 more
Caused by: org.apache.http.NoHttpResponseException: The target server failed to respond
	at org.apache.http.impl.conn.DefaultHttpResponseParser.parseHead(DefaultHttpResponseParser.java:95)
	at org.apache.http.impl.conn.DefaultHttpResponseParser.parseHead(DefaultHttpResponseParser.java:62)
	at org.apache.http.impl.io.AbstractMessageParser.parse(AbstractMessageParser.java:254)
	at org.apache.http.impl.AbstractHttpClientConnection.receiveResponseHeader(AbstractHttpClientConnection.java:289)
	at org.apache.http.impl.conn.DefaultClientConnection.receiveResponseHeader(DefaultClientConnection.java:252)
	at org.apache.http.impl.conn.ManagedClientConnectionImpl.receiveResponseHeader(ManagedClientConnectionImpl.java:191)
	at org.apache.http.protocol.HttpRequestExecutor.doReceiveResponse(HttpRequestExecutor.java:300)
	at org.apache.http.protocol.HttpRequestExecutor.execute(HttpRequestExecutor.java:127)
	at org.apache.http.impl.client.DefaultRequestDirector.tryExecute(DefaultRequestDirector.java:715)
	at org.apache.http.impl.client.DefaultRequestDirector.execute(DefaultRequestDirector.java:520)
	at org.apache.http.impl.client.AbstractHttpClient.execute(AbstractHttpClient.java:906)
	at org.apache.http.impl.client.AbstractHttpClient.execute(AbstractHttpClient.java:805)
	at org.apache.maven.wagon.shared.http4.AbstractHttpClientWagon.execute(AbstractHttpClientWagon.java:746)
	at org.apache.maven.wagon.shared.http4.AbstractHttpClientWagon.put(AbstractHttpClientWagon.java:574)
	... 18 more
[INFO] Deployment failed after 5 min 22 sec
Build step 'Deploy artifacts to Maven repository' changed build result to FAILURE

Mime
View raw message