any23-dev mailing list archives

Site index · List index
Message view « Date » · « Thread »
Top « Date » · « Thread »
From Apache Jenkins Server <jenk...@builds.apache.org>
Subject Build failed in Jenkins: Any23-trunk #862
Date Tue, 03 Dec 2013 12:44:50 GMT
See <https://builds.apache.org/job/Any23-trunk/862/>

------------------------------------------
[...truncated 6710 lines...]
========================================================================

  [2013-12-03 12:13:27,030] INFO  4722[qtp31-1 - Acceptor0 LocalConnector@0.0.0.0:1] - sun.reflect.GeneratedMethodAccessor8.invoke(?:?)
- org.apache.any23.servlet.ServletTest$TestableServlet-9826960: Attempting conversion to 'turtle'
from POST body
  [2013-12-03 12:13:27,030] INFO  4722[qtp31-1 - Acceptor0 LocalConnector@0.0.0.0:1] - org.apache.any23.extractor.SingleDocumentExtraction.run(SingleDocumentExtraction.java:221)
- Processing http://any23.org/tmp/
  [2013-12-03 12:13:27,061] INFO  4753[qtp31-1 - Acceptor0 LocalConnector@0.0.0.0:1] - sun.reflect.GeneratedMethodAccessor8.invoke(?:?)
- org.apache.any23.servlet.ServletTest$TestableServlet-9826960: Extraction complete, 6 triples
  Tests run: 35, Failures: 0, Errors: 0, Skipped: 3, Time elapsed: 5.041 sec - in org.apache.any23.servlet.ServletTest

Results :

Tests run: 35, Failures: 0, Errors: 0, Skipped: 3

[INFO] [assembly:single {execution: prepare-package}]
[INFO] Reading assembly descriptor: <https://builds.apache.org/job/Any23-trunk/ws/service/src/main/assembly/prepare-war-legals.xml>
[INFO] Copying files to <https://builds.apache.org/job/Any23-trunk/ws/service/target/war-legals>
[INFO] [war:war {execution: default-war}]
[INFO] Packaging webapp
[INFO] Assembling webapp [apache-any23-service] in [<https://builds.apache.org/job/Any23-trunk/ws/service/target/apache-any23-service-0.9.1-SNAPSHOT]>
[INFO] Processing war project
[INFO] Copying webapp webResources [<https://builds.apache.org/job/Any23-trunk/ws/service/src/main/resources/]>
to [<https://builds.apache.org/job/Any23-trunk/ws/service/target/apache-any23-service-0.9.1-SNAPSHOT]>
[INFO] Copying webapp resources [<https://builds.apache.org/job/Any23-trunk/ws/service/src/main/webapp]>
[INFO] Webapp assembled in [211 msecs]
[INFO] Building war: <https://builds.apache.org/job/Any23-trunk/ws/service/target/apache-any23-service-0.9.1-SNAPSHOT.war>
[INFO] WEB-INF/web.xml already added, skipping
[INFO] [war:war {execution: self-contained-war}]
[INFO] Packaging webapp
[INFO] Assembling webapp [apache-any23-service] in [<https://builds.apache.org/job/Any23-trunk/ws/service/target/apache-any23-service-0.9.1-SNAPSHOT]>
[INFO] Processing war project
[INFO] Copying webapp webResources [<https://builds.apache.org/job/Any23-trunk/ws/service/target/war-legals/with-deps/]>
to [<https://builds.apache.org/job/Any23-trunk/ws/service/target/apache-any23-service-0.9.1-SNAPSHOT]>
[INFO] Copying webapp resources [<https://builds.apache.org/job/Any23-trunk/ws/service/src/main/webapp]>
[INFO] Webapp assembled in [140 msecs]
[INFO] Building war: <https://builds.apache.org/job/Any23-trunk/ws/service/target/apache-any23-service-0.9.1-SNAPSHOT.war>
[INFO] WEB-INF/web.xml already added, skipping
[INFO] [war:war {execution: war-without-deps}]
[INFO] Packaging webapp
[INFO] Assembling webapp [apache-any23-service] in [<https://builds.apache.org/job/Any23-trunk/ws/service/target/apache-any23-service-0.9.1-SNAPSHOT]>
[INFO] Processing war project
[INFO] Copying webapp webResources [<https://builds.apache.org/job/Any23-trunk/ws/service/target/war-legals/without-deps/]>
to [<https://builds.apache.org/job/Any23-trunk/ws/service/target/apache-any23-service-0.9.1-SNAPSHOT]>
[INFO] Copying webapp resources [<https://builds.apache.org/job/Any23-trunk/ws/service/src/main/webapp]>
[INFO] Webapp assembled in [134 msecs]
[INFO] Building war: <https://builds.apache.org/job/Any23-trunk/ws/service/target/apache-any23-service-0.9.1-SNAPSHOT-without-deps.war>
[INFO] WEB-INF/web.xml already added, skipping
[INFO] [assembly:single {execution: assembly}]
[INFO] Reading assembly descriptor: <https://builds.apache.org/job/Any23-trunk/ws/service/src/main/assembly/with-deps.xml>
[INFO] Reading assembly descriptor: <https://builds.apache.org/job/Any23-trunk/ws/service/src/main/assembly/without-deps.xml>
[INFO] Reading assembly descriptor: <https://builds.apache.org/job/Any23-trunk/ws/service/src/main/assembly/server-embedded.xml>
[INFO] Building tar: <https://builds.apache.org/job/Any23-trunk/ws/service/target/apache-any23-service-0.9.1-SNAPSHOT-with-deps.tar.gz>
[INFO] Building zip: <https://builds.apache.org/job/Any23-trunk/ws/service/target/apache-any23-service-0.9.1-SNAPSHOT-with-deps.zip>
[INFO] Building tar: <https://builds.apache.org/job/Any23-trunk/ws/service/target/apache-any23-service-0.9.1-SNAPSHOT-without-deps.tar.gz>
[INFO] Building zip: <https://builds.apache.org/job/Any23-trunk/ws/service/target/apache-any23-service-0.9.1-SNAPSHOT-without-deps.zip>
[INFO] Building tar: <https://builds.apache.org/job/Any23-trunk/ws/service/target/apache-any23-service-0.9.1-SNAPSHOT-server-embedded.tar.gz>
[INFO] Building zip: <https://builds.apache.org/job/Any23-trunk/ws/service/target/apache-any23-service-0.9.1-SNAPSHOT-server-embedded.zip>
[INFO] [install:install {execution: default-install}]
[INFO] Installing <https://builds.apache.org/job/Any23-trunk/ws/service/target/apache-any23-service-0.9.1-SNAPSHOT.war>
to /home/jenkins/jenkins-slave/maven-repositories/1/org/apache/any23/apache-any23-service/0.9.1-SNAPSHOT/apache-any23-service-0.9.1-SNAPSHOT.war
[INFO] Installing <https://builds.apache.org/job/Any23-trunk/ws/service/target/apache-any23-service-0.9.1-SNAPSHOT-without-deps.war>
to /home/jenkins/jenkins-slave/maven-repositories/1/org/apache/any23/apache-any23-service/0.9.1-SNAPSHOT/apache-any23-service-0.9.1-SNAPSHOT-without-deps.war
[INFO] Installing <https://builds.apache.org/job/Any23-trunk/ws/service/target/apache-any23-service-0.9.1-SNAPSHOT-with-deps.tar.gz>
to /home/jenkins/jenkins-slave/maven-repositories/1/org/apache/any23/apache-any23-service/0.9.1-SNAPSHOT/apache-any23-service-0.9.1-SNAPSHOT-with-deps.tar.gz
[INFO] Installing <https://builds.apache.org/job/Any23-trunk/ws/service/target/apache-any23-service-0.9.1-SNAPSHOT-with-deps.zip>
to /home/jenkins/jenkins-slave/maven-repositories/1/org/apache/any23/apache-any23-service/0.9.1-SNAPSHOT/apache-any23-service-0.9.1-SNAPSHOT-with-deps.zip
[INFO] Installing <https://builds.apache.org/job/Any23-trunk/ws/service/target/apache-any23-service-0.9.1-SNAPSHOT-without-deps.tar.gz>
to /home/jenkins/jenkins-slave/maven-repositories/1/org/apache/any23/apache-any23-service/0.9.1-SNAPSHOT/apache-any23-service-0.9.1-SNAPSHOT-without-deps.tar.gz
[INFO] Installing <https://builds.apache.org/job/Any23-trunk/ws/service/target/apache-any23-service-0.9.1-SNAPSHOT-without-deps.zip>
to /home/jenkins/jenkins-slave/maven-repositories/1/org/apache/any23/apache-any23-service/0.9.1-SNAPSHOT/apache-any23-service-0.9.1-SNAPSHOT-without-deps.zip
[INFO] Installing <https://builds.apache.org/job/Any23-trunk/ws/service/target/apache-any23-service-0.9.1-SNAPSHOT-server-embedded.tar.gz>
to /home/jenkins/jenkins-slave/maven-repositories/1/org/apache/any23/apache-any23-service/0.9.1-SNAPSHOT/apache-any23-service-0.9.1-SNAPSHOT-server-embedded.tar.gz
[INFO] Installing <https://builds.apache.org/job/Any23-trunk/ws/service/target/apache-any23-service-0.9.1-SNAPSHOT-server-embedded.zip>
to /home/jenkins/jenkins-slave/maven-repositories/1/org/apache/any23/apache-any23-service/0.9.1-SNAPSHOT/apache-any23-service-0.9.1-SNAPSHOT-server-embedded.zip
[INFO] [deploy:deploy {execution: default-deploy}]
[INFO] Retrieving previous build number from apache.snapshots.https
[WARNING] *** CHECKSUM FAILED - Checksum failed on download: local = '68a4d7d80430aff4ac60beaa694530523cae8b3e';
remote = 'fd91f28d3ce72980b9f3a41de9f9e637f3983a1e' - RETRYING
[WARNING] *** CHECKSUM FAILED - Checksum failed on download: local = '68a4d7d80430aff4ac60beaa694530523cae8b3e';
remote = 'fd91f28d3ce72980b9f3a41de9f9e637f3983a1e' - IGNORING
Uploading: https://repository.apache.org/content/repositories/snapshots/org/apache/any23/apache-any23-service/0.9.1-SNAPSHOT/apache-any23-service-0.9.1-20131203.112404-46.war
27322K uploaded  (apache-any23-service-0.9.1-20131203.112404-46.war)
[INFO] Retrieving previous metadata from apache.snapshots.https
[WARNING] *** CHECKSUM FAILED - Checksum failed on download: local = 'cb81b37a2d78124978f0e373284e70c166bb9fec';
remote = '6ae13f6f2af3086aa0615fb37a043327afeb6ed5' - RETRYING
[WARNING] *** CHECKSUM FAILED - Checksum failed on download: local = 'cb81b37a2d78124978f0e373284e70c166bb9fec';
remote = '6ae13f6f2af3086aa0615fb37a043327afeb6ed5' - IGNORING
[INFO] Uploading repository metadata for: 'artifact org.apache.any23:apache-any23-service'
[INFO] Uploading project information for apache-any23-service 0.9.1-20131203.112404-46
[INFO] Retrieving previous metadata from apache.snapshots.https
[WARNING] *** CHECKSUM FAILED - Checksum failed on download: local = '68a4d7d80430aff4ac60beaa694530523cae8b3e';
remote = 'fd91f28d3ce72980b9f3a41de9f9e637f3983a1e' - RETRYING
[WARNING] *** CHECKSUM FAILED - Checksum failed on download: local = '68a4d7d80430aff4ac60beaa694530523cae8b3e';
remote = 'fd91f28d3ce72980b9f3a41de9f9e637f3983a1e' - IGNORING
[INFO] Uploading repository metadata for: 'snapshot org.apache.any23:apache-any23-service:0.9.1-SNAPSHOT'
[INFO] Retrieving previous build number from apache.snapshots.https
Uploading: https://repository.apache.org/content/repositories/snapshots/org/apache/any23/apache-any23-service/0.9.1-SNAPSHOT/apache-any23-service-0.9.1-20131203.112404-46-without-deps.war
121K uploaded  (apache-any23-service-0.9.1-20131203.112404-46-without-deps.war)
[INFO] Retrieving previous build number from apache.snapshots.https
Uploading: https://repository.apache.org/content/repositories/snapshots/org/apache/any23/apache-any23-service/0.9.1-SNAPSHOT/apache-any23-service-0.9.1-20131203.112404-46-with-deps.tar.gz
27334K uploaded  (apache-any23-service-0.9.1-20131203.112404-46-with-deps.tar.gz)
[INFO] Retrieving previous build number from apache.snapshots.https
Uploading: https://repository.apache.org/content/repositories/snapshots/org/apache/any23/apache-any23-service/0.9.1-SNAPSHOT/apache-any23-service-0.9.1-20131203.112404-46-with-deps.zip
27334K uploaded  (apache-any23-service-0.9.1-20131203.112404-46-with-deps.zip)
[INFO] Retrieving previous build number from apache.snapshots.https
Uploading: https://repository.apache.org/content/repositories/snapshots/org/apache/any23/apache-any23-service/0.9.1-SNAPSHOT/apache-any23-service-0.9.1-20131203.112404-46-without-deps.tar.gz
127K uploaded  (apache-any23-service-0.9.1-20131203.112404-46-without-deps.tar.gz)
[INFO] Retrieving previous build number from apache.snapshots.https
Uploading: https://repository.apache.org/content/repositories/snapshots/org/apache/any23/apache-any23-service/0.9.1-SNAPSHOT/apache-any23-service-0.9.1-20131203.112404-46-without-deps.zip
127K uploaded  (apache-any23-service-0.9.1-20131203.112404-46-without-deps.zip)
[INFO] Retrieving previous build number from apache.snapshots.https
Uploading: https://repository.apache.org/content/repositories/snapshots/org/apache/any23/apache-any23-service/0.9.1-SNAPSHOT/apache-any23-service-0.9.1-20131203.112404-46-server-embedded.tar.gz
31725K uploaded  (apache-any23-service-0.9.1-20131203.112404-46-server-embedded.tar.gz)
[INFO] Retrieving previous build number from apache.snapshots.https
Uploading: https://repository.apache.org/content/repositories/snapshots/org/apache/any23/apache-any23-service/0.9.1-SNAPSHOT/apache-any23-service-0.9.1-20131203.112404-46-server-embedded.zip
31727K uploaded  (apache-any23-service-0.9.1-20131203.112404-46-server-embedded.zip)
[INFO] 
[INFO] 
[INFO] ------------------------------------------------------------------------
[INFO] Reactor Summary:
[INFO] ------------------------------------------------------------------------
[INFO] Apache Any23 .......................................... SUCCESS [54.951s]
[INFO] Apache Any23 :: Base API .............................. SUCCESS [27.732s]
[INFO] Apache Any23 :: Test Resources ........................ SUCCESS [23.709s]
[INFO] Apache Any23 :: NQuads Parser and Writer .............. SUCCESS [27.146s]
[INFO] Apache Any23 :: CSV Utilities ......................... SUCCESS [34.636s]
[INFO] Apache Any23 :: Mime Type Detection ................... SUCCESS [49.714s]
[INFO] Apache Any23 :: Encoding Detection .................... SUCCESS [25.940s]
[INFO] Apache Any23 :: Core .................................. SUCCESS [50.204s]
[INFO] Apache Any23 :: Plugins :: Basic Crawler .............. SUCCESS [46.724s]
[INFO] Apache Any23 :: Plugins :: HTML Scraper ............... SUCCESS [21.738s]
[INFO] Apache Any23 :: Plugins :: Office Scraper ............. SUCCESS [31.000s]
[INFO] Apache Any23 :: Plugins :: Integration Test ........... SUCCESS [1:20.840s]
[INFO] Apache Any23 :: Service ............................... SUCCESS [1:32.334s]
[INFO] ------------------------------------------------------------------------
[INFO] ------------------------------------------------------------------------
[INFO] BUILD SUCCESSFUL
[INFO] ------------------------------------------------------------------------
[INFO] Total time: 56 minutes 40 seconds
[INFO] Finished at: Tue Dec 03 12:19:55 UTC 2013
[INFO] Final Memory: 79M/328M
[INFO] ------------------------------------------------------------------------
[JENKINS] Archiving <https://builds.apache.org/job/Any23-trunk/ws/core/pom.xml> to org.apache.any23/apache-any23-core/0.9.1-SNAPSHOT/apache-any23-core-0.9.1-SNAPSHOT.pom
[JENKINS] Archiving <https://builds.apache.org/job/Any23-trunk/ws/core/target/apache-any23-core-0.9.1-SNAPSHOT.jar>
to org.apache.any23/apache-any23-core/0.9.1-20131203.112404-41/apache-any23-core-0.9.1-20131203.112404-41.jar
[JENKINS] Archiving <https://builds.apache.org/job/Any23-trunk/ws/core/target/apache-any23-core-0.9.1-SNAPSHOT.tar.gz>
to org.apache.any23/apache-any23-core/0.9.1-20131203.112404-41/apache-any23-core-0.9.1-20131203.112404-41.tar.gz
[JENKINS] Archiving <https://builds.apache.org/job/Any23-trunk/ws/core/target/apache-any23-core-0.9.1-SNAPSHOT.zip>
to org.apache.any23/apache-any23-core/0.9.1-20131203.112404-41/apache-any23-core-0.9.1-20131203.112404-41.zip
[JENKINS] Archiving <https://builds.apache.org/job/Any23-trunk/ws/core/target/apache-any23-core-0.9.1-SNAPSHOT-tests.jar>
to org.apache.any23/apache-any23-core/0.9.1-20131203.112404-41/apache-any23-core-0.9.1-20131203.112404-41-tests.jar
[JENKINS] Archiving <https://builds.apache.org/job/Any23-trunk/ws/test-resources/pom.xml>
to org.apache.any23/apache-any23-test-resources/0.9.1-SNAPSHOT/apache-any23-test-resources-0.9.1-SNAPSHOT.pom
[JENKINS] Archiving <https://builds.apache.org/job/Any23-trunk/ws/test-resources/target/apache-any23-test-resources-0.9.1-SNAPSHOT.jar>
to org.apache.any23/apache-any23-test-resources/0.9.1-20131203.112404-37/apache-any23-test-resources-0.9.1-20131203.112404-37.jar
[JENKINS] Archiving <https://builds.apache.org/job/Any23-trunk/ws/test-resources/target/apache-any23-test-resources-0.9.1-SNAPSHOT-tests.jar>
to org.apache.any23/apache-any23-test-resources/0.9.1-20131203.112404-37/apache-any23-test-resources-0.9.1-20131203.112404-37-tests.jar
[JENKINS] Archiving <https://builds.apache.org/job/Any23-trunk/ws/plugins/office-scraper/pom.xml>
to org.apache.any23.plugins/apache-any23-office-scraper/1.0.4-SNAPSHOT/apache-any23-office-scraper-1.0.4-SNAPSHOT.pom
[JENKINS] Archiving <https://builds.apache.org/job/Any23-trunk/ws/plugins/office-scraper/target/apache-any23-office-scraper-1.0.4-SNAPSHOT.jar>
to org.apache.any23.plugins/apache-any23-office-scraper/1.0.4-20131203.112404-37/apache-any23-office-scraper-1.0.4-20131203.112404-37.jar
[JENKINS] Archiving <https://builds.apache.org/job/Any23-trunk/ws/plugins/office-scraper/target/apache-any23-office-scraper-1.0.4-SNAPSHOT.tar.gz>
to org.apache.any23.plugins/apache-any23-office-scraper/1.0.4-20131203.112404-37/apache-any23-office-scraper-1.0.4-20131203.112404-37.tar.gz
[JENKINS] Archiving <https://builds.apache.org/job/Any23-trunk/ws/plugins/office-scraper/target/apache-any23-office-scraper-1.0.4-SNAPSHOT.zip>
to org.apache.any23.plugins/apache-any23-office-scraper/1.0.4-20131203.112404-37/apache-any23-office-scraper-1.0.4-20131203.112404-37.zip
[JENKINS] Archiving <https://builds.apache.org/job/Any23-trunk/ws/plugins/html-scraper/pom.xml>
to org.apache.any23.plugins/apache-any23-html-scraper/1.0.5-SNAPSHOT/apache-any23-html-scraper-1.0.5-SNAPSHOT.pom
[JENKINS] Archiving <https://builds.apache.org/job/Any23-trunk/ws/plugins/html-scraper/target/apache-any23-html-scraper-1.0.5-SNAPSHOT.jar>
to org.apache.any23.plugins/apache-any23-html-scraper/1.0.5-20131203.112404-38/apache-any23-html-scraper-1.0.5-20131203.112404-38.jar
[JENKINS] Archiving <https://builds.apache.org/job/Any23-trunk/ws/plugins/html-scraper/target/apache-any23-html-scraper-1.0.5-SNAPSHOT.tar.gz>
to org.apache.any23.plugins/apache-any23-html-scraper/1.0.5-20131203.112404-38/apache-any23-html-scraper-1.0.5-20131203.112404-38.tar.gz
[JENKINS] Archiving <https://builds.apache.org/job/Any23-trunk/ws/plugins/html-scraper/target/apache-any23-html-scraper-1.0.5-SNAPSHOT.zip>
to org.apache.any23.plugins/apache-any23-html-scraper/1.0.5-20131203.112404-38/apache-any23-html-scraper-1.0.5-20131203.112404-38.zip
[JENKINS] Archiving <https://builds.apache.org/job/Any23-trunk/ws/service/pom.xml> to
org.apache.any23/apache-any23-service/0.9.1-SNAPSHOT/apache-any23-service-0.9.1-SNAPSHOT.pom
[JENKINS] Archiving <https://builds.apache.org/job/Any23-trunk/ws/service/target/apache-any23-service-0.9.1-SNAPSHOT.war>
to org.apache.any23/apache-any23-service/0.9.1-20131203.112404-46/apache-any23-service-0.9.1-20131203.112404-46.war
[JENKINS] Archiving <https://builds.apache.org/job/Any23-trunk/ws/service/target/apache-any23-service-0.9.1-SNAPSHOT-without-deps.war>
to org.apache.any23/apache-any23-service/0.9.1-20131203.112404-46/apache-any23-service-0.9.1-20131203.112404-46-without-deps.war
[JENKINS] Archiving <https://builds.apache.org/job/Any23-trunk/ws/service/target/apache-any23-service-0.9.1-SNAPSHOT-with-deps.tar.gz>
to org.apache.any23/apache-any23-service/0.9.1-20131203.112404-46/apache-any23-service-0.9.1-20131203.112404-46-with-deps.tar.gz
[JENKINS] Archiving <https://builds.apache.org/job/Any23-trunk/ws/service/target/apache-any23-service-0.9.1-SNAPSHOT-with-deps.zip>
to org.apache.any23/apache-any23-service/0.9.1-20131203.112404-46/apache-any23-service-0.9.1-20131203.112404-46-with-deps.zip
[JENKINS] Archiving <https://builds.apache.org/job/Any23-trunk/ws/service/target/apache-any23-service-0.9.1-SNAPSHOT-without-deps.tar.gz>
to org.apache.any23/apache-any23-service/0.9.1-20131203.112404-46/apache-any23-service-0.9.1-20131203.112404-46-without-deps.tar.gz
[JENKINS] Archiving <https://builds.apache.org/job/Any23-trunk/ws/service/target/apache-any23-service-0.9.1-SNAPSHOT-without-deps.zip>
to org.apache.any23/apache-any23-service/0.9.1-20131203.112404-46/apache-any23-service-0.9.1-20131203.112404-46-without-deps.zip
[JENKINS] Archiving <https://builds.apache.org/job/Any23-trunk/ws/service/target/apache-any23-service-0.9.1-SNAPSHOT-server-embedded.tar.gz>
to org.apache.any23/apache-any23-service/0.9.1-20131203.112404-46/apache-any23-service-0.9.1-20131203.112404-46-server-embedded.tar.gz
[JENKINS] Archiving <https://builds.apache.org/job/Any23-trunk/ws/service/target/apache-any23-service-0.9.1-SNAPSHOT-server-embedded.zip>
to org.apache.any23/apache-any23-service/0.9.1-20131203.112404-46/apache-any23-service-0.9.1-20131203.112404-46-server-embedded.zip
[JENKINS] Archiving <https://builds.apache.org/job/Any23-trunk/ws/api/pom.xml> to org.apache.any23/apache-any23-api/0.9.1-SNAPSHOT/apache-any23-api-0.9.1-SNAPSHOT.pom
[JENKINS] Archiving <https://builds.apache.org/job/Any23-trunk/ws/api/target/apache-any23-api-0.9.1-SNAPSHOT.jar>
to org.apache.any23/apache-any23-api/0.9.1-20131203.112404-35/apache-any23-api-0.9.1-20131203.112404-35.jar
[JENKINS] Archiving <https://builds.apache.org/job/Any23-trunk/ws/csvutils/pom.xml>
to org.apache.any23/apache-any23-csvutils/0.9.1-SNAPSHOT/apache-any23-csvutils-0.9.1-SNAPSHOT.pom
[JENKINS] Archiving <https://builds.apache.org/job/Any23-trunk/ws/csvutils/target/apache-any23-csvutils-0.9.1-SNAPSHOT.jar>
to org.apache.any23/apache-any23-csvutils/0.9.1-20131203.112404-35/apache-any23-csvutils-0.9.1-20131203.112404-35.jar
[JENKINS] Archiving <https://builds.apache.org/job/Any23-trunk/ws/plugins/integration-test/pom.xml>
to org.apache.any23.plugins/apache-any23-integration-test/0.9.1-SNAPSHOT/apache-any23-integration-test-0.9.1-SNAPSHOT.pom
[JENKINS] Archiving <https://builds.apache.org/job/Any23-trunk/ws/plugins/integration-test/target/apache-any23-integration-test-0.9.1-SNAPSHOT.jar>
to org.apache.any23.plugins/apache-any23-integration-test/0.9.1-20131203.112404-32/apache-any23-integration-test-0.9.1-20131203.112404-32.jar
[JENKINS] Archiving <https://builds.apache.org/job/Any23-trunk/ws/pom.xml> to org.apache.any23/apache-any23/0.9.1-SNAPSHOT/apache-any23-0.9.1-SNAPSHOT.pom
[JENKINS] Archiving /home/jenkins/jenkins-slave/maven-repositories/1/org/apache/any23/apache-any23/0.9.1-SNAPSHOT/apache-any23-0.9.1-SNAPSHOT.pom
to org.apache.any23/apache-any23/0.9.1-20131203.112404-41/apache-any23-0.9.1-20131203.112404-41.pom
[JENKINS] Archiving <https://builds.apache.org/job/Any23-trunk/ws/target/apache-any23-0.9.1-SNAPSHOT-site.xml>
to org.apache.any23/apache-any23/0.9.1-20131203.112404-41/apache-any23-0.9.1-20131203.112404-41-site.xml
[JENKINS] Archiving <https://builds.apache.org/job/Any23-trunk/ws/target/apache-any23-0.9.1-SNAPSHOT-src.tar.gz>
to org.apache.any23/apache-any23/0.9.1-20131203.112404-41/apache-any23-0.9.1-20131203.112404-41-src.tar.gz
[JENKINS] Archiving <https://builds.apache.org/job/Any23-trunk/ws/target/apache-any23-0.9.1-SNAPSHOT-src.zip>
to org.apache.any23/apache-any23/0.9.1-20131203.112404-41/apache-any23-0.9.1-20131203.112404-41-src.zip
/home/jenkins/jenkins-slave/maven-repositories/1/org/apache/any23/apache-any23/0.9.1-SNAPSHOT/apache-any23-0.9.1-SNAPSHOT.pom
is not inside <https://builds.apache.org/job/Any23-trunk/ws/;> will archive in a separate
pass
[JENKINS] Archiving <https://builds.apache.org/job/Any23-trunk/ws/plugins/basic-crawler/pom.xml>
to org.apache.any23.plugins/apache-any23-basic-crawler/1.0.4-SNAPSHOT/apache-any23-basic-crawler-1.0.4-SNAPSHOT.pom
[JENKINS] Archiving <https://builds.apache.org/job/Any23-trunk/ws/plugins/basic-crawler/target/apache-any23-basic-crawler-1.0.4-SNAPSHOT.jar>
to org.apache.any23.plugins/apache-any23-basic-crawler/1.0.4-20131203.112404-40/apache-any23-basic-crawler-1.0.4-20131203.112404-40.jar
[JENKINS] Archiving <https://builds.apache.org/job/Any23-trunk/ws/plugins/basic-crawler/target/apache-any23-basic-crawler-1.0.4-SNAPSHOT.tar.gz>
to org.apache.any23.plugins/apache-any23-basic-crawler/1.0.4-20131203.112404-40/apache-any23-basic-crawler-1.0.4-20131203.112404-40.tar.gz
[JENKINS] Archiving <https://builds.apache.org/job/Any23-trunk/ws/plugins/basic-crawler/target/apache-any23-basic-crawler-1.0.4-SNAPSHOT.zip>
to org.apache.any23.plugins/apache-any23-basic-crawler/1.0.4-20131203.112404-40/apache-any23-basic-crawler-1.0.4-20131203.112404-40.zip
[JENKINS] Archiving <https://builds.apache.org/job/Any23-trunk/ws/plugins/basic-crawler/target/apache-any23-basic-crawler-1.0.4-SNAPSHOT-tests.jar>
to org.apache.any23.plugins/apache-any23-basic-crawler/1.0.4-20131203.112404-40/apache-any23-basic-crawler-1.0.4-20131203.112404-40-tests.jar
[JENKINS] Archiving <https://builds.apache.org/job/Any23-trunk/ws/encoding/pom.xml>
to org.apache.any23/apache-any23-encoding/0.9.1-SNAPSHOT/apache-any23-encoding-0.9.1-SNAPSHOT.pom
[JENKINS] Archiving <https://builds.apache.org/job/Any23-trunk/ws/encoding/target/apache-any23-encoding-0.9.1-SNAPSHOT.jar>
to org.apache.any23/apache-any23-encoding/0.9.1-20131203.112404-35/apache-any23-encoding-0.9.1-20131203.112404-35.jar
[JENKINS] Archiving <https://builds.apache.org/job/Any23-trunk/ws/nquads/pom.xml> to
org.apache.any23/apache-any23-nquads/0.9.1-SNAPSHOT/apache-any23-nquads-0.9.1-SNAPSHOT.pom
[JENKINS] Archiving <https://builds.apache.org/job/Any23-trunk/ws/nquads/target/apache-any23-nquads-0.9.1-SNAPSHOT.jar>
to org.apache.any23/apache-any23-nquads/0.9.1-20131203.112404-35/apache-any23-nquads-0.9.1-20131203.112404-35.jar
[JENKINS] Archiving <https://builds.apache.org/job/Any23-trunk/ws/mime/pom.xml> to org.apache.any23/apache-any23-mime/0.9.1-SNAPSHOT/apache-any23-mime-0.9.1-SNAPSHOT.pom
[JENKINS] Archiving <https://builds.apache.org/job/Any23-trunk/ws/mime/target/apache-any23-mime-0.9.1-SNAPSHOT.jar>
to org.apache.any23/apache-any23-mime/0.9.1-20131203.112404-35/apache-any23-mime-0.9.1-20131203.112404-35.jar
channel stopped
Maven RedeployPublisher use remote ubuntu6 maven settings from : /home/jenkins/.m2/settings.xml
[INFO] Deployment in https://repository.apache.org/content/repositories/snapshots (id=apache.snapshots.https,uniqueVersion=false)
Deploying the main artifact jenkins-7608749678795687176apache-any23-0.9.1-20131203.112404-41.pom
Deploying the main artifact jenkins-6985906615424612547apache-any23-0.9.1-20131203.112404-41-site.xml
Deploying the main artifact jenkins-8981786203158939801apache-any23-0.9.1-20131203.112404-41-src.tar.gz
Deploying the main artifact jenkins-3447120064069255867apache-any23-0.9.1-20131203.112404-41-src.zip
[INFO] Deployment in https://repository.apache.org/content/repositories/snapshots (id=apache.snapshots.https,uniqueVersion=false)
Deploying the main artifact jenkins-6572881465349940011apache-any23-api-0.9.1-20131203.112404-35.jar
[INFO] Deployment in https://repository.apache.org/content/repositories/snapshots (id=apache.snapshots.https,uniqueVersion=false)
Deploying the main artifact jenkins-3067382411708401215apache-any23-core-0.9.1-20131203.112404-41.jar
Deploying the main artifact jenkins-7753089020859008544apache-any23-core-0.9.1-20131203.112404-41.tar.gz
Deploying the main artifact jenkins-3856478699772002696apache-any23-core-0.9.1-20131203.112404-41.zip
Deploying the main artifact jenkins-5084184306754809877apache-any23-core-0.9.1-20131203.112404-41-tests.jar
[INFO] Deployment in https://repository.apache.org/content/repositories/snapshots (id=apache.snapshots.https,uniqueVersion=false)
Deploying the main artifact jenkins-1277936435089881657apache-any23-csvutils-0.9.1-20131203.112404-35.jar
[INFO] Deployment in https://repository.apache.org/content/repositories/snapshots (id=apache.snapshots.https,uniqueVersion=false)
Deploying the main artifact jenkins-8380605518116050207apache-any23-encoding-0.9.1-20131203.112404-35.jar
[INFO] Deployment in https://repository.apache.org/content/repositories/snapshots (id=apache.snapshots.https,uniqueVersion=false)
Deploying the main artifact jenkins-3677091080331364480apache-any23-mime-0.9.1-20131203.112404-35.jar
[INFO] Deployment in https://repository.apache.org/content/repositories/snapshots (id=apache.snapshots.https,uniqueVersion=false)
Deploying the main artifact jenkins-6228973067752506455apache-any23-nquads-0.9.1-20131203.112404-35.jar
[INFO] Deployment in https://repository.apache.org/content/repositories/snapshots (id=apache.snapshots.https,uniqueVersion=false)
Deploying the main artifact jenkins-462357374130191247apache-any23-service-0.9.1-20131203.112404-46.war
Deploying the main artifact jenkins-6641114013873514410apache-any23-service-0.9.1-20131203.112404-46-without-deps.war
Deploying the main artifact jenkins-3642347501596171470apache-any23-service-0.9.1-20131203.112404-46-with-deps.tar.gz
Deploying the main artifact jenkins-4397835745594038308apache-any23-service-0.9.1-20131203.112404-46-with-deps.zip
Deploying the main artifact jenkins-5965655690819589303apache-any23-service-0.9.1-20131203.112404-46-without-deps.tar.gz
Deploying the main artifact jenkins-8567469740109274838apache-any23-service-0.9.1-20131203.112404-46-without-deps.zip
Deploying the main artifact jenkins-7783929989560959844apache-any23-service-0.9.1-20131203.112404-46-server-embedded.tar.gz
Deploying the main artifact jenkins-6539220256917311629apache-any23-service-0.9.1-20131203.112404-46-server-embedded.zip
[INFO] Deployment in https://repository.apache.org/content/repositories/snapshots (id=apache.snapshots.https,uniqueVersion=false)
Deploying the main artifact jenkins-7209996345029247621apache-any23-test-resources-0.9.1-20131203.112404-37.jar
Deploying the main artifact jenkins-7547606087013177405apache-any23-test-resources-0.9.1-20131203.112404-37-tests.jar
ERROR: Error installing artifact's metadata: Error while deploying metadata: The target server
failed to respond
org.apache.maven.artifact.deployer.ArtifactDeploymentException: Error installing artifact's
metadata: Error while deploying metadata: The target server failed to respond
	at hudson.maven.artifact.deployer.DefaultArtifactDeployer.deploy(DefaultArtifactDeployer.java:183)
	at hudson.maven.reporters.MavenArtifactRecord.deploy(MavenArtifactRecord.java:200)
	at hudson.maven.RedeployPublisher.perform(RedeployPublisher.java:176)
	at hudson.tasks.BuildStepMonitor$1.perform(BuildStepMonitor.java:20)
	at hudson.model.AbstractBuild$AbstractBuildExecution.perform(AbstractBuild.java:785)
	at hudson.model.AbstractBuild$AbstractBuildExecution.performAllBuildSteps(AbstractBuild.java:757)
	at hudson.maven.MavenModuleSetBuild$MavenModuleSetBuildExecution.post2(MavenModuleSetBuild.java:1020)
	at hudson.model.AbstractBuild$AbstractBuildExecution.post(AbstractBuild.java:706)
	at hudson.model.Run.execute(Run.java:1702)
	at hudson.maven.MavenModuleSetBuild.run(MavenModuleSetBuild.java:509)
	at hudson.model.ResourceController.execute(ResourceController.java:88)
	at hudson.model.Executor.run(Executor.java:231)
Caused by: org.apache.maven.artifact.repository.metadata.RepositoryMetadataDeploymentException:
Error while deploying metadata: The target server failed to respond
	at org.apache.maven.artifact.repository.metadata.DefaultRepositoryMetadataManager.deploy(DefaultRepositoryMetadataManager.java:492)
	at hudson.maven.artifact.deployer.DefaultArtifactDeployer.deploy(DefaultArtifactDeployer.java:167)
	... 11 more
Caused by: org.apache.maven.wagon.TransferFailedException: The target server failed to respond
	at org.apache.maven.wagon.shared.http4.AbstractHttpClientWagon.put(AbstractHttpClientWagon.java:580)
	at org.apache.maven.wagon.shared.http4.AbstractHttpClientWagon.put(AbstractHttpClientWagon.java:524)
	at org.apache.maven.wagon.shared.http4.AbstractHttpClientWagon.put(AbstractHttpClientWagon.java:505)
	at org.apache.maven.wagon.shared.http4.AbstractHttpClientWagon.put(AbstractHttpClientWagon.java:485)
	at org.apache.maven.repository.legacy.DefaultWagonManager.putRemoteFile(DefaultWagonManager.java:543)
	at org.apache.maven.repository.legacy.DefaultWagonManager.putArtifactMetadata(DefaultWagonManager.java:501)
	at org.apache.maven.artifact.repository.metadata.DefaultRepositoryMetadataManager.deploy(DefaultRepositoryMetadataManager.java:488)
	... 12 more
Caused by: org.apache.http.NoHttpResponseException: The target server failed to respond
	at org.apache.http.impl.conn.DefaultHttpResponseParser.parseHead(DefaultHttpResponseParser.java:95)
	at org.apache.http.impl.conn.DefaultHttpResponseParser.parseHead(DefaultHttpResponseParser.java:62)
	at org.apache.http.impl.io.AbstractMessageParser.parse(AbstractMessageParser.java:254)
	at org.apache.http.impl.AbstractHttpClientConnection.receiveResponseHeader(AbstractHttpClientConnection.java:289)
	at org.apache.http.impl.conn.DefaultClientConnection.receiveResponseHeader(DefaultClientConnection.java:252)
	at org.apache.http.impl.conn.ManagedClientConnectionImpl.receiveResponseHeader(ManagedClientConnectionImpl.java:191)
	at org.apache.http.protocol.HttpRequestExecutor.doReceiveResponse(HttpRequestExecutor.java:300)
	at org.apache.http.protocol.HttpRequestExecutor.execute(HttpRequestExecutor.java:127)
	at org.apache.http.impl.client.DefaultRequestDirector.tryExecute(DefaultRequestDirector.java:715)
	at org.apache.http.impl.client.DefaultRequestDirector.execute(DefaultRequestDirector.java:520)
	at org.apache.http.impl.client.AbstractHttpClient.execute(AbstractHttpClient.java:906)
	at org.apache.http.impl.client.AbstractHttpClient.execute(AbstractHttpClient.java:805)
	at org.apache.maven.wagon.shared.http4.AbstractHttpClientWagon.execute(AbstractHttpClientWagon.java:746)
	at org.apache.maven.wagon.shared.http4.AbstractHttpClientWagon.put(AbstractHttpClientWagon.java:574)
	... 18 more
[INFO] Deployment failed after 23 min
Build step 'Deploy artifacts to Maven repository' changed build result to FAILURE

Mime
View raw message