any23-dev mailing list archives

Site index · List index
Message view « Date » · « Thread »
Top « Date » · « Thread »
From Apache Jenkins Server <jenk...@builds.apache.org>
Subject Build failed in Jenkins: Any23-trunk #889
Date Tue, 31 Dec 2013 08:07:32 GMT
See <https://builds.apache.org/job/Any23-trunk/889/>

------------------------------------------
[...truncated 6709 lines...]
========================================================================

  [2013-12-31 07:25:53,877] INFO  4626[qtp31-1 - Acceptor0 LocalConnector@0.0.0.0:1] - sun.reflect.GeneratedMethodAccessor8.invoke(?:?)
- org.apache.any23.servlet.ServletTest$TestableServlet-4587712: Attempting conversion to 'turtle'
from POST body
  [2013-12-31 07:25:53,877] INFO  4626[qtp31-1 - Acceptor0 LocalConnector@0.0.0.0:1] - org.apache.any23.extractor.SingleDocumentExtraction.run(SingleDocumentExtraction.java:221)
- Processing http://any23.org/tmp/
  [2013-12-31 07:25:53,899] INFO  4648[qtp31-1 - Acceptor0 LocalConnector@0.0.0.0:1] - sun.reflect.GeneratedMethodAccessor8.invoke(?:?)
- org.apache.any23.servlet.ServletTest$TestableServlet-4587712: Extraction complete, 6 triples
  Tests run: 35, Failures: 0, Errors: 0, Skipped: 3, Time elapsed: 4.936 sec - in org.apache.any23.servlet.ServletTest

Results :

Tests run: 35, Failures: 0, Errors: 0, Skipped: 3

[INFO] [assembly:single {execution: prepare-package}]
[INFO] Reading assembly descriptor: <https://builds.apache.org/job/Any23-trunk/ws/service/src/main/assembly/prepare-war-legals.xml>
[INFO] Copying files to <https://builds.apache.org/job/Any23-trunk/ws/service/target/war-legals>
[INFO] [war:war {execution: default-war}]
[INFO] Packaging webapp
[INFO] Assembling webapp [apache-any23-service] in [<https://builds.apache.org/job/Any23-trunk/ws/service/target/apache-any23-service-0.9.1-SNAPSHOT]>
[INFO] Processing war project
[INFO] Copying webapp webResources [<https://builds.apache.org/job/Any23-trunk/ws/service/src/main/resources/]>
to [<https://builds.apache.org/job/Any23-trunk/ws/service/target/apache-any23-service-0.9.1-SNAPSHOT]>
[INFO] Copying webapp resources [<https://builds.apache.org/job/Any23-trunk/ws/service/src/main/webapp]>
[INFO] Webapp assembled in [216 msecs]
[INFO] Building war: <https://builds.apache.org/job/Any23-trunk/ws/service/target/apache-any23-service-0.9.1-SNAPSHOT.war>
[INFO] WEB-INF/web.xml already added, skipping
[INFO] [war:war {execution: self-contained-war}]
[INFO] Packaging webapp
[INFO] Assembling webapp [apache-any23-service] in [<https://builds.apache.org/job/Any23-trunk/ws/service/target/apache-any23-service-0.9.1-SNAPSHOT]>
[INFO] Processing war project
[INFO] Copying webapp webResources [<https://builds.apache.org/job/Any23-trunk/ws/service/target/war-legals/with-deps/]>
to [<https://builds.apache.org/job/Any23-trunk/ws/service/target/apache-any23-service-0.9.1-SNAPSHOT]>
[INFO] Copying webapp resources [<https://builds.apache.org/job/Any23-trunk/ws/service/src/main/webapp]>
[INFO] Webapp assembled in [135 msecs]
[INFO] Building war: <https://builds.apache.org/job/Any23-trunk/ws/service/target/apache-any23-service-0.9.1-SNAPSHOT.war>
[INFO] WEB-INF/web.xml already added, skipping
[INFO] [war:war {execution: war-without-deps}]
[INFO] Packaging webapp
[INFO] Assembling webapp [apache-any23-service] in [<https://builds.apache.org/job/Any23-trunk/ws/service/target/apache-any23-service-0.9.1-SNAPSHOT]>
[INFO] Processing war project
[INFO] Copying webapp webResources [<https://builds.apache.org/job/Any23-trunk/ws/service/target/war-legals/without-deps/]>
to [<https://builds.apache.org/job/Any23-trunk/ws/service/target/apache-any23-service-0.9.1-SNAPSHOT]>
[INFO] Copying webapp resources [<https://builds.apache.org/job/Any23-trunk/ws/service/src/main/webapp]>
[INFO] Webapp assembled in [131 msecs]
[INFO] Building war: <https://builds.apache.org/job/Any23-trunk/ws/service/target/apache-any23-service-0.9.1-SNAPSHOT-without-deps.war>
[INFO] WEB-INF/web.xml already added, skipping
[INFO] [assembly:single {execution: assembly}]
[INFO] Reading assembly descriptor: <https://builds.apache.org/job/Any23-trunk/ws/service/src/main/assembly/with-deps.xml>
[INFO] Reading assembly descriptor: <https://builds.apache.org/job/Any23-trunk/ws/service/src/main/assembly/without-deps.xml>
[INFO] Reading assembly descriptor: <https://builds.apache.org/job/Any23-trunk/ws/service/src/main/assembly/server-embedded.xml>
[INFO] Building tar: <https://builds.apache.org/job/Any23-trunk/ws/service/target/apache-any23-service-0.9.1-SNAPSHOT-with-deps.tar.gz>
[INFO] Building zip: <https://builds.apache.org/job/Any23-trunk/ws/service/target/apache-any23-service-0.9.1-SNAPSHOT-with-deps.zip>
[INFO] Building tar: <https://builds.apache.org/job/Any23-trunk/ws/service/target/apache-any23-service-0.9.1-SNAPSHOT-without-deps.tar.gz>
[INFO] Building zip: <https://builds.apache.org/job/Any23-trunk/ws/service/target/apache-any23-service-0.9.1-SNAPSHOT-without-deps.zip>
[INFO] Building tar: <https://builds.apache.org/job/Any23-trunk/ws/service/target/apache-any23-service-0.9.1-SNAPSHOT-server-embedded.tar.gz>
[INFO] Building zip: <https://builds.apache.org/job/Any23-trunk/ws/service/target/apache-any23-service-0.9.1-SNAPSHOT-server-embedded.zip>
[INFO] [install:install {execution: default-install}]
[INFO] Installing <https://builds.apache.org/job/Any23-trunk/ws/service/target/apache-any23-service-0.9.1-SNAPSHOT.war>
to /home/jenkins/jenkins-slave/maven-repositories/1/org/apache/any23/apache-any23-service/0.9.1-SNAPSHOT/apache-any23-service-0.9.1-SNAPSHOT.war
[INFO] Installing <https://builds.apache.org/job/Any23-trunk/ws/service/target/apache-any23-service-0.9.1-SNAPSHOT-without-deps.war>
to /home/jenkins/jenkins-slave/maven-repositories/1/org/apache/any23/apache-any23-service/0.9.1-SNAPSHOT/apache-any23-service-0.9.1-SNAPSHOT-without-deps.war
[INFO] Installing <https://builds.apache.org/job/Any23-trunk/ws/service/target/apache-any23-service-0.9.1-SNAPSHOT-with-deps.tar.gz>
to /home/jenkins/jenkins-slave/maven-repositories/1/org/apache/any23/apache-any23-service/0.9.1-SNAPSHOT/apache-any23-service-0.9.1-SNAPSHOT-with-deps.tar.gz
[INFO] Installing <https://builds.apache.org/job/Any23-trunk/ws/service/target/apache-any23-service-0.9.1-SNAPSHOT-with-deps.zip>
to /home/jenkins/jenkins-slave/maven-repositories/1/org/apache/any23/apache-any23-service/0.9.1-SNAPSHOT/apache-any23-service-0.9.1-SNAPSHOT-with-deps.zip
[INFO] Installing <https://builds.apache.org/job/Any23-trunk/ws/service/target/apache-any23-service-0.9.1-SNAPSHOT-without-deps.tar.gz>
to /home/jenkins/jenkins-slave/maven-repositories/1/org/apache/any23/apache-any23-service/0.9.1-SNAPSHOT/apache-any23-service-0.9.1-SNAPSHOT-without-deps.tar.gz
[INFO] Installing <https://builds.apache.org/job/Any23-trunk/ws/service/target/apache-any23-service-0.9.1-SNAPSHOT-without-deps.zip>
to /home/jenkins/jenkins-slave/maven-repositories/1/org/apache/any23/apache-any23-service/0.9.1-SNAPSHOT/apache-any23-service-0.9.1-SNAPSHOT-without-deps.zip
[INFO] Installing <https://builds.apache.org/job/Any23-trunk/ws/service/target/apache-any23-service-0.9.1-SNAPSHOT-server-embedded.tar.gz>
to /home/jenkins/jenkins-slave/maven-repositories/1/org/apache/any23/apache-any23-service/0.9.1-SNAPSHOT/apache-any23-service-0.9.1-SNAPSHOT-server-embedded.tar.gz
[INFO] Installing <https://builds.apache.org/job/Any23-trunk/ws/service/target/apache-any23-service-0.9.1-SNAPSHOT-server-embedded.zip>
to /home/jenkins/jenkins-slave/maven-repositories/1/org/apache/any23/apache-any23-service/0.9.1-SNAPSHOT/apache-any23-service-0.9.1-SNAPSHOT-server-embedded.zip
[INFO] [deploy:deploy {execution: default-deploy}]
[INFO] Retrieving previous build number from apache.snapshots.https
[WARNING] *** CHECKSUM FAILED - Checksum failed on download: local = 'a918989e11416520603fbaf2bae5bddb0955c99b';
remote = 'a374773c60d5c430c5d1a34e119f61cc6a94ea0d' - RETRYING
[WARNING] *** CHECKSUM FAILED - Checksum failed on download: local = 'a918989e11416520603fbaf2bae5bddb0955c99b';
remote = 'a374773c60d5c430c5d1a34e119f61cc6a94ea0d' - IGNORING
Uploading: https://repository.apache.org/content/repositories/snapshots/org/apache/any23/apache-any23-service/0.9.1-SNAPSHOT/apache-any23-service-0.9.1-20131231.070835-95.war
27322K uploaded  (apache-any23-service-0.9.1-20131231.070835-95.war)
[INFO] Retrieving previous metadata from apache.snapshots.https
[WARNING] *** CHECKSUM FAILED - Checksum failed on download: local = '2f433de99d225c6abdb609dddddb9ba802b10dcc';
remote = '08fbfdc871880043c935fad80b9c35ff560dbda8' - RETRYING
[WARNING] *** CHECKSUM FAILED - Checksum failed on download: local = '2f433de99d225c6abdb609dddddb9ba802b10dcc';
remote = '08fbfdc871880043c935fad80b9c35ff560dbda8' - IGNORING
[INFO] Uploading repository metadata for: 'artifact org.apache.any23:apache-any23-service'
[INFO] Uploading project information for apache-any23-service 0.9.1-20131231.070835-95
[INFO] Retrieving previous metadata from apache.snapshots.https
[WARNING] *** CHECKSUM FAILED - Checksum failed on download: local = 'a918989e11416520603fbaf2bae5bddb0955c99b';
remote = 'a374773c60d5c430c5d1a34e119f61cc6a94ea0d' - RETRYING
[WARNING] *** CHECKSUM FAILED - Checksum failed on download: local = 'a918989e11416520603fbaf2bae5bddb0955c99b';
remote = 'a374773c60d5c430c5d1a34e119f61cc6a94ea0d' - IGNORING
[INFO] Uploading repository metadata for: 'snapshot org.apache.any23:apache-any23-service:0.9.1-SNAPSHOT'
[INFO] Retrieving previous build number from apache.snapshots.https
Uploading: https://repository.apache.org/content/repositories/snapshots/org/apache/any23/apache-any23-service/0.9.1-SNAPSHOT/apache-any23-service-0.9.1-20131231.070835-95-without-deps.war
121K uploaded  (apache-any23-service-0.9.1-20131231.070835-95-without-deps.war)
[INFO] Retrieving previous build number from apache.snapshots.https
Uploading: https://repository.apache.org/content/repositories/snapshots/org/apache/any23/apache-any23-service/0.9.1-SNAPSHOT/apache-any23-service-0.9.1-20131231.070835-95-with-deps.tar.gz
27334K uploaded  (apache-any23-service-0.9.1-20131231.070835-95-with-deps.tar.gz)
[INFO] Retrieving previous build number from apache.snapshots.https
Uploading: https://repository.apache.org/content/repositories/snapshots/org/apache/any23/apache-any23-service/0.9.1-SNAPSHOT/apache-any23-service-0.9.1-20131231.070835-95-with-deps.zip
27334K uploaded  (apache-any23-service-0.9.1-20131231.070835-95-with-deps.zip)
[INFO] Retrieving previous build number from apache.snapshots.https
Uploading: https://repository.apache.org/content/repositories/snapshots/org/apache/any23/apache-any23-service/0.9.1-SNAPSHOT/apache-any23-service-0.9.1-20131231.070835-95-without-deps.tar.gz
127K uploaded  (apache-any23-service-0.9.1-20131231.070835-95-without-deps.tar.gz)
[INFO] Retrieving previous build number from apache.snapshots.https
Uploading: https://repository.apache.org/content/repositories/snapshots/org/apache/any23/apache-any23-service/0.9.1-SNAPSHOT/apache-any23-service-0.9.1-20131231.070835-95-without-deps.zip
127K uploaded  (apache-any23-service-0.9.1-20131231.070835-95-without-deps.zip)
[INFO] Retrieving previous build number from apache.snapshots.https
Uploading: https://repository.apache.org/content/repositories/snapshots/org/apache/any23/apache-any23-service/0.9.1-SNAPSHOT/apache-any23-service-0.9.1-20131231.070835-95-server-embedded.tar.gz
31725K uploaded  (apache-any23-service-0.9.1-20131231.070835-95-server-embedded.tar.gz)
[INFO] Retrieving previous build number from apache.snapshots.https
Uploading: https://repository.apache.org/content/repositories/snapshots/org/apache/any23/apache-any23-service/0.9.1-SNAPSHOT/apache-any23-service-0.9.1-20131231.070835-95-server-embedded.zip
31727K uploaded  (apache-any23-service-0.9.1-20131231.070835-95-server-embedded.zip)
[INFO] 
[INFO] 
[INFO] ------------------------------------------------------------------------
[INFO] Reactor Summary:
[INFO] ------------------------------------------------------------------------
[INFO] Apache Any23 .......................................... SUCCESS [1:20.071s]
[INFO] Apache Any23 :: Base API .............................. SUCCESS [34.536s]
[INFO] Apache Any23 :: Test Resources ........................ SUCCESS [29.496s]
[INFO] Apache Any23 :: NQuads Parser and Writer .............. SUCCESS [26.832s]
[INFO] Apache Any23 :: CSV Utilities ......................... SUCCESS [1:29.243s]
[INFO] Apache Any23 :: Mime Type Detection ................... SUCCESS [1:24.355s]
[INFO] Apache Any23 :: Encoding Detection .................... SUCCESS [28.084s]
[INFO] Apache Any23 :: Core .................................. SUCCESS [1:24.273s]
[INFO] Apache Any23 :: Plugins :: Basic Crawler .............. SUCCESS [1:01.316s]
[INFO] Apache Any23 :: Plugins :: HTML Scraper ............... SUCCESS [36.429s]
[INFO] Apache Any23 :: Plugins :: Office Scraper ............. SUCCESS [1:22.955s]
[INFO] Apache Any23 :: Plugins :: Integration Test ........... SUCCESS [3:21.372s]
[INFO] Apache Any23 :: Service ............................... SUCCESS [1:39.349s]
[INFO] ------------------------------------------------------------------------
[INFO] ------------------------------------------------------------------------
[INFO] BUILD SUCCESSFUL
[INFO] ------------------------------------------------------------------------
[INFO] Total time: 20 minutes 27 seconds
[INFO] Finished at: Tue Dec 31 07:27:47 UTC 2013
[INFO] Final Memory: 79M/312M
[INFO] ------------------------------------------------------------------------
Waiting for Jenkins to finish collecting data
[JENKINS] Archiving <https://builds.apache.org/job/Any23-trunk/ws/core/pom.xml> to org.apache.any23/apache-any23-core/0.9.1-SNAPSHOT/apache-any23-core-0.9.1-SNAPSHOT.pom
[JENKINS] Archiving <https://builds.apache.org/job/Any23-trunk/ws/core/target/apache-any23-core-0.9.1-SNAPSHOT.jar>
to org.apache.any23/apache-any23-core/0.9.1-20131231.070835-79/apache-any23-core-0.9.1-20131231.070835-79.jar
[JENKINS] Archiving <https://builds.apache.org/job/Any23-trunk/ws/core/target/apache-any23-core-0.9.1-SNAPSHOT.tar.gz>
to org.apache.any23/apache-any23-core/0.9.1-20131231.070835-79/apache-any23-core-0.9.1-20131231.070835-79.tar.gz
[JENKINS] Archiving <https://builds.apache.org/job/Any23-trunk/ws/core/target/apache-any23-core-0.9.1-SNAPSHOT.zip>
to org.apache.any23/apache-any23-core/0.9.1-20131231.070835-79/apache-any23-core-0.9.1-20131231.070835-79.zip
[JENKINS] Archiving <https://builds.apache.org/job/Any23-trunk/ws/core/target/apache-any23-core-0.9.1-SNAPSHOT-tests.jar>
to org.apache.any23/apache-any23-core/0.9.1-20131231.070835-79/apache-any23-core-0.9.1-20131231.070835-79-tests.jar
[JENKINS] Archiving <https://builds.apache.org/job/Any23-trunk/ws/test-resources/pom.xml>
to org.apache.any23/apache-any23-test-resources/0.9.1-SNAPSHOT/apache-any23-test-resources-0.9.1-SNAPSHOT.pom
[JENKINS] Archiving <https://builds.apache.org/job/Any23-trunk/ws/test-resources/target/apache-any23-test-resources-0.9.1-SNAPSHOT.jar>
to org.apache.any23/apache-any23-test-resources/0.9.1-20131231.070835-70/apache-any23-test-resources-0.9.1-20131231.070835-70.jar
[JENKINS] Archiving <https://builds.apache.org/job/Any23-trunk/ws/test-resources/target/apache-any23-test-resources-0.9.1-SNAPSHOT-tests.jar>
to org.apache.any23/apache-any23-test-resources/0.9.1-20131231.070835-70/apache-any23-test-resources-0.9.1-20131231.070835-70-tests.jar
[JENKINS] Archiving <https://builds.apache.org/job/Any23-trunk/ws/plugins/office-scraper/pom.xml>
to org.apache.any23.plugins/apache-any23-office-scraper/1.0.4-SNAPSHOT/apache-any23-office-scraper-1.0.4-SNAPSHOT.pom
[JENKINS] Archiving <https://builds.apache.org/job/Any23-trunk/ws/plugins/office-scraper/target/apache-any23-office-scraper-1.0.4-SNAPSHOT.jar>
to org.apache.any23.plugins/apache-any23-office-scraper/1.0.4-20131231.070835-69/apache-any23-office-scraper-1.0.4-20131231.070835-69.jar
[JENKINS] Archiving <https://builds.apache.org/job/Any23-trunk/ws/plugins/office-scraper/target/apache-any23-office-scraper-1.0.4-SNAPSHOT.tar.gz>
to org.apache.any23.plugins/apache-any23-office-scraper/1.0.4-20131231.070835-69/apache-any23-office-scraper-1.0.4-20131231.070835-69.tar.gz
[JENKINS] Archiving <https://builds.apache.org/job/Any23-trunk/ws/plugins/office-scraper/target/apache-any23-office-scraper-1.0.4-SNAPSHOT.zip>
to org.apache.any23.plugins/apache-any23-office-scraper/1.0.4-20131231.070835-69/apache-any23-office-scraper-1.0.4-20131231.070835-69.zip
[JENKINS] Archiving <https://builds.apache.org/job/Any23-trunk/ws/plugins/html-scraper/pom.xml>
to org.apache.any23.plugins/apache-any23-html-scraper/1.0.5-SNAPSHOT/apache-any23-html-scraper-1.0.5-SNAPSHOT.pom
[JENKINS] Archiving <https://builds.apache.org/job/Any23-trunk/ws/plugins/html-scraper/target/apache-any23-html-scraper-1.0.5-SNAPSHOT.jar>
to org.apache.any23.plugins/apache-any23-html-scraper/1.0.5-20131231.070835-72/apache-any23-html-scraper-1.0.5-20131231.070835-72.jar
[JENKINS] Archiving <https://builds.apache.org/job/Any23-trunk/ws/plugins/html-scraper/target/apache-any23-html-scraper-1.0.5-SNAPSHOT.tar.gz>
to org.apache.any23.plugins/apache-any23-html-scraper/1.0.5-20131231.070835-72/apache-any23-html-scraper-1.0.5-20131231.070835-72.tar.gz
[JENKINS] Archiving <https://builds.apache.org/job/Any23-trunk/ws/plugins/html-scraper/target/apache-any23-html-scraper-1.0.5-SNAPSHOT.zip>
to org.apache.any23.plugins/apache-any23-html-scraper/1.0.5-20131231.070835-72/apache-any23-html-scraper-1.0.5-20131231.070835-72.zip
[JENKINS] Archiving <https://builds.apache.org/job/Any23-trunk/ws/service/pom.xml> to
org.apache.any23/apache-any23-service/0.9.1-SNAPSHOT/apache-any23-service-0.9.1-SNAPSHOT.pom
[JENKINS] Archiving <https://builds.apache.org/job/Any23-trunk/ws/service/target/apache-any23-service-0.9.1-SNAPSHOT.war>
to org.apache.any23/apache-any23-service/0.9.1-20131231.070835-95/apache-any23-service-0.9.1-20131231.070835-95.war
[JENKINS] Archiving <https://builds.apache.org/job/Any23-trunk/ws/service/target/apache-any23-service-0.9.1-SNAPSHOT-without-deps.war>
to org.apache.any23/apache-any23-service/0.9.1-20131231.070835-95/apache-any23-service-0.9.1-20131231.070835-95-without-deps.war
[JENKINS] Archiving <https://builds.apache.org/job/Any23-trunk/ws/service/target/apache-any23-service-0.9.1-SNAPSHOT-with-deps.tar.gz>
to org.apache.any23/apache-any23-service/0.9.1-20131231.070835-95/apache-any23-service-0.9.1-20131231.070835-95-with-deps.tar.gz
[JENKINS] Archiving <https://builds.apache.org/job/Any23-trunk/ws/service/target/apache-any23-service-0.9.1-SNAPSHOT-with-deps.zip>
to org.apache.any23/apache-any23-service/0.9.1-20131231.070835-95/apache-any23-service-0.9.1-20131231.070835-95-with-deps.zip
[JENKINS] Archiving <https://builds.apache.org/job/Any23-trunk/ws/service/target/apache-any23-service-0.9.1-SNAPSHOT-without-deps.tar.gz>
to org.apache.any23/apache-any23-service/0.9.1-20131231.070835-95/apache-any23-service-0.9.1-20131231.070835-95-without-deps.tar.gz
[JENKINS] Archiving <https://builds.apache.org/job/Any23-trunk/ws/service/target/apache-any23-service-0.9.1-SNAPSHOT-without-deps.zip>
to org.apache.any23/apache-any23-service/0.9.1-20131231.070835-95/apache-any23-service-0.9.1-20131231.070835-95-without-deps.zip
[JENKINS] Archiving <https://builds.apache.org/job/Any23-trunk/ws/service/target/apache-any23-service-0.9.1-SNAPSHOT-server-embedded.tar.gz>
to org.apache.any23/apache-any23-service/0.9.1-20131231.070835-95/apache-any23-service-0.9.1-20131231.070835-95-server-embedded.tar.gz
[JENKINS] Archiving <https://builds.apache.org/job/Any23-trunk/ws/service/target/apache-any23-service-0.9.1-SNAPSHOT-server-embedded.zip>
to org.apache.any23/apache-any23-service/0.9.1-20131231.070835-95/apache-any23-service-0.9.1-20131231.070835-95-server-embedded.zip
[JENKINS] Archiving <https://builds.apache.org/job/Any23-trunk/ws/api/pom.xml> to org.apache.any23/apache-any23-api/0.9.1-SNAPSHOT/apache-any23-api-0.9.1-SNAPSHOT.pom
[JENKINS] Archiving <https://builds.apache.org/job/Any23-trunk/ws/api/target/apache-any23-api-0.9.1-SNAPSHOT.jar>
to org.apache.any23/apache-any23-api/0.9.1-20131231.070835-65/apache-any23-api-0.9.1-20131231.070835-65.jar
[JENKINS] Archiving <https://builds.apache.org/job/Any23-trunk/ws/csvutils/pom.xml>
to org.apache.any23/apache-any23-csvutils/0.9.1-SNAPSHOT/apache-any23-csvutils-0.9.1-SNAPSHOT.pom
[JENKINS] Archiving <https://builds.apache.org/job/Any23-trunk/ws/csvutils/target/apache-any23-csvutils-0.9.1-SNAPSHOT.jar>
to org.apache.any23/apache-any23-csvutils/0.9.1-20131231.070835-65/apache-any23-csvutils-0.9.1-20131231.070835-65.jar
[JENKINS] Archiving <https://builds.apache.org/job/Any23-trunk/ws/plugins/integration-test/pom.xml>
to org.apache.any23.plugins/apache-any23-integration-test/0.9.1-SNAPSHOT/apache-any23-integration-test-0.9.1-SNAPSHOT.pom
[JENKINS] Archiving <https://builds.apache.org/job/Any23-trunk/ws/plugins/integration-test/target/apache-any23-integration-test-0.9.1-SNAPSHOT.jar>
to org.apache.any23.plugins/apache-any23-integration-test/0.9.1-20131231.070835-59/apache-any23-integration-test-0.9.1-20131231.070835-59.jar
[JENKINS] Archiving <https://builds.apache.org/job/Any23-trunk/ws/pom.xml> to org.apache.any23/apache-any23/0.9.1-SNAPSHOT/apache-any23-0.9.1-SNAPSHOT.pom
[JENKINS] Archiving /home/jenkins/jenkins-slave/maven-repositories/1/org/apache/any23/apache-any23/0.9.1-SNAPSHOT/apache-any23-0.9.1-SNAPSHOT.pom
to org.apache.any23/apache-any23/0.9.1-20131231.070835-80/apache-any23-0.9.1-20131231.070835-80.pom
[JENKINS] Archiving <https://builds.apache.org/job/Any23-trunk/ws/target/apache-any23-0.9.1-SNAPSHOT-site.xml>
to org.apache.any23/apache-any23/0.9.1-20131231.070835-80/apache-any23-0.9.1-20131231.070835-80-site.xml
[JENKINS] Archiving <https://builds.apache.org/job/Any23-trunk/ws/target/apache-any23-0.9.1-SNAPSHOT-src.tar.gz>
to org.apache.any23/apache-any23/0.9.1-20131231.070835-80/apache-any23-0.9.1-20131231.070835-80-src.tar.gz
[JENKINS] Archiving <https://builds.apache.org/job/Any23-trunk/ws/target/apache-any23-0.9.1-SNAPSHOT-src.zip>
to org.apache.any23/apache-any23/0.9.1-20131231.070835-80/apache-any23-0.9.1-20131231.070835-80-src.zip
/home/jenkins/jenkins-slave/maven-repositories/1/org/apache/any23/apache-any23/0.9.1-SNAPSHOT/apache-any23-0.9.1-SNAPSHOT.pom
is not inside <https://builds.apache.org/job/Any23-trunk/ws/;> will archive in a separate
pass
[JENKINS] Archiving <https://builds.apache.org/job/Any23-trunk/ws/plugins/basic-crawler/pom.xml>
to org.apache.any23.plugins/apache-any23-basic-crawler/1.0.4-SNAPSHOT/apache-any23-basic-crawler-1.0.4-SNAPSHOT.pom
[JENKINS] Archiving <https://builds.apache.org/job/Any23-trunk/ws/plugins/basic-crawler/target/apache-any23-basic-crawler-1.0.4-SNAPSHOT.jar>
to org.apache.any23.plugins/apache-any23-basic-crawler/1.0.4-20131231.070835-78/apache-any23-basic-crawler-1.0.4-20131231.070835-78.jar
[JENKINS] Archiving <https://builds.apache.org/job/Any23-trunk/ws/plugins/basic-crawler/target/apache-any23-basic-crawler-1.0.4-SNAPSHOT.tar.gz>
to org.apache.any23.plugins/apache-any23-basic-crawler/1.0.4-20131231.070835-78/apache-any23-basic-crawler-1.0.4-20131231.070835-78.tar.gz
[JENKINS] Archiving <https://builds.apache.org/job/Any23-trunk/ws/plugins/basic-crawler/target/apache-any23-basic-crawler-1.0.4-SNAPSHOT.zip>
to org.apache.any23.plugins/apache-any23-basic-crawler/1.0.4-20131231.070835-78/apache-any23-basic-crawler-1.0.4-20131231.070835-78.zip
[JENKINS] Archiving <https://builds.apache.org/job/Any23-trunk/ws/plugins/basic-crawler/target/apache-any23-basic-crawler-1.0.4-SNAPSHOT-tests.jar>
to org.apache.any23.plugins/apache-any23-basic-crawler/1.0.4-20131231.070835-78/apache-any23-basic-crawler-1.0.4-20131231.070835-78-tests.jar
[JENKINS] Archiving <https://builds.apache.org/job/Any23-trunk/ws/encoding/pom.xml>
to org.apache.any23/apache-any23-encoding/0.9.1-SNAPSHOT/apache-any23-encoding-0.9.1-SNAPSHOT.pom
[JENKINS] Archiving <https://builds.apache.org/job/Any23-trunk/ws/encoding/target/apache-any23-encoding-0.9.1-SNAPSHOT.jar>
to org.apache.any23/apache-any23-encoding/0.9.1-20131231.070835-64/apache-any23-encoding-0.9.1-20131231.070835-64.jar
[JENKINS] Archiving <https://builds.apache.org/job/Any23-trunk/ws/nquads/pom.xml> to
org.apache.any23/apache-any23-nquads/0.9.1-SNAPSHOT/apache-any23-nquads-0.9.1-SNAPSHOT.pom
[JENKINS] Archiving <https://builds.apache.org/job/Any23-trunk/ws/nquads/target/apache-any23-nquads-0.9.1-SNAPSHOT.jar>
to org.apache.any23/apache-any23-nquads/0.9.1-20131231.070835-65/apache-any23-nquads-0.9.1-20131231.070835-65.jar
[JENKINS] Archiving <https://builds.apache.org/job/Any23-trunk/ws/mime/pom.xml> to org.apache.any23/apache-any23-mime/0.9.1-SNAPSHOT/apache-any23-mime-0.9.1-SNAPSHOT.pom
[JENKINS] Archiving <https://builds.apache.org/job/Any23-trunk/ws/mime/target/apache-any23-mime-0.9.1-SNAPSHOT.jar>
to org.apache.any23/apache-any23-mime/0.9.1-20131231.070835-64/apache-any23-mime-0.9.1-20131231.070835-64.jar
channel stopped
Maven RedeployPublisher use remote ubuntu6 maven settings from : /home/jenkins/.m2/settings.xml
[INFO] Deployment in https://repository.apache.org/content/repositories/snapshots (id=apache.snapshots.https,uniqueVersion=false)
Deploying the main artifact jenkins-811297618607819128apache-any23-0.9.1-20131231.070835-80.pom
Deploying the main artifact jenkins-5434132850326044278apache-any23-0.9.1-20131231.070835-80-site.xml
Deploying the main artifact jenkins-3362612763898560244apache-any23-0.9.1-20131231.070835-80-src.tar.gz
Deploying the main artifact jenkins-1254613167745655371apache-any23-0.9.1-20131231.070835-80-src.zip
[INFO] Deployment in https://repository.apache.org/content/repositories/snapshots (id=apache.snapshots.https,uniqueVersion=false)
Deploying the main artifact jenkins-8239273589296503186apache-any23-api-0.9.1-20131231.070835-65.jar
[INFO] Deployment in https://repository.apache.org/content/repositories/snapshots (id=apache.snapshots.https,uniqueVersion=false)
Deploying the main artifact jenkins-1190931274789379157apache-any23-core-0.9.1-20131231.070835-79.jar
Deploying the main artifact jenkins-8799967909696471218apache-any23-core-0.9.1-20131231.070835-79.tar.gz
Deploying the main artifact jenkins-7871291278037721116apache-any23-core-0.9.1-20131231.070835-79.zip
Deploying the main artifact jenkins-1953178616997670421apache-any23-core-0.9.1-20131231.070835-79-tests.jar
[INFO] Deployment in https://repository.apache.org/content/repositories/snapshots (id=apache.snapshots.https,uniqueVersion=false)
Deploying the main artifact jenkins-1676609345199111242apache-any23-csvutils-0.9.1-20131231.070835-65.jar
[INFO] Deployment in https://repository.apache.org/content/repositories/snapshots (id=apache.snapshots.https,uniqueVersion=false)
Deploying the main artifact jenkins-4924562158675871102apache-any23-encoding-0.9.1-20131231.070835-64.jar
[INFO] Deployment in https://repository.apache.org/content/repositories/snapshots (id=apache.snapshots.https,uniqueVersion=false)
Deploying the main artifact jenkins-4574897010003716212apache-any23-mime-0.9.1-20131231.070835-64.jar
[INFO] Deployment in https://repository.apache.org/content/repositories/snapshots (id=apache.snapshots.https,uniqueVersion=false)
Deploying the main artifact jenkins-3796440960985045983apache-any23-nquads-0.9.1-20131231.070835-65.jar
[INFO] Deployment in https://repository.apache.org/content/repositories/snapshots (id=apache.snapshots.https,uniqueVersion=false)
Deploying the main artifact jenkins-4078848724193438911apache-any23-service-0.9.1-20131231.070835-95.war
Deploying the main artifact jenkins-3833043012725311775apache-any23-service-0.9.1-20131231.070835-95-without-deps.war
Deploying the main artifact jenkins-6954112514729057131apache-any23-service-0.9.1-20131231.070835-95-with-deps.tar.gz
Deploying the main artifact jenkins-2143343004382000437apache-any23-service-0.9.1-20131231.070835-95-with-deps.zip
Deploying the main artifact jenkins-8135785000992819551apache-any23-service-0.9.1-20131231.070835-95-without-deps.tar.gz
Deploying the main artifact jenkins-7145119903331492934apache-any23-service-0.9.1-20131231.070835-95-without-deps.zip
Deploying the main artifact jenkins-2554868833177759958apache-any23-service-0.9.1-20131231.070835-95-server-embedded.tar.gz
Deploying the main artifact jenkins-5484905471382025391apache-any23-service-0.9.1-20131231.070835-95-server-embedded.zip
[INFO] Deployment in https://repository.apache.org/content/repositories/snapshots (id=apache.snapshots.https,uniqueVersion=false)
Deploying the main artifact jenkins-1938582098345160383apache-any23-test-resources-0.9.1-20131231.070835-70.jar
ERROR: Error installing artifact's metadata: Error while deploying metadata: The target server
failed to respond
org.apache.maven.artifact.deployer.ArtifactDeploymentException: Error installing artifact's
metadata: Error while deploying metadata: The target server failed to respond
	at hudson.maven.artifact.deployer.DefaultArtifactDeployer.deploy(DefaultArtifactDeployer.java:183)
	at hudson.maven.reporters.MavenArtifactRecord.deploy(MavenArtifactRecord.java:191)
	at hudson.maven.RedeployPublisher.perform(RedeployPublisher.java:176)
	at hudson.tasks.BuildStepMonitor$1.perform(BuildStepMonitor.java:20)
	at hudson.model.AbstractBuild$AbstractBuildExecution.perform(AbstractBuild.java:785)
	at hudson.model.AbstractBuild$AbstractBuildExecution.performAllBuildSteps(AbstractBuild.java:757)
	at hudson.maven.MavenModuleSetBuild$MavenModuleSetBuildExecution.post2(MavenModuleSetBuild.java:1020)
	at hudson.model.AbstractBuild$AbstractBuildExecution.post(AbstractBuild.java:706)
	at hudson.model.Run.execute(Run.java:1703)
	at hudson.maven.MavenModuleSetBuild.run(MavenModuleSetBuild.java:509)
	at hudson.model.ResourceController.execute(ResourceController.java:88)
	at hudson.model.Executor.run(Executor.java:231)
Caused by: org.apache.maven.artifact.repository.metadata.RepositoryMetadataDeploymentException:
Error while deploying metadata: The target server failed to respond
	at org.apache.maven.artifact.repository.metadata.DefaultRepositoryMetadataManager.deploy(DefaultRepositoryMetadataManager.java:492)
	at hudson.maven.artifact.deployer.DefaultArtifactDeployer.deploy(DefaultArtifactDeployer.java:167)
	... 11 more
Caused by: org.apache.maven.wagon.TransferFailedException: The target server failed to respond
	at org.apache.maven.wagon.shared.http4.AbstractHttpClientWagon.put(AbstractHttpClientWagon.java:580)
	at org.apache.maven.wagon.shared.http4.AbstractHttpClientWagon.put(AbstractHttpClientWagon.java:524)
	at org.apache.maven.wagon.shared.http4.AbstractHttpClientWagon.put(AbstractHttpClientWagon.java:505)
	at org.apache.maven.wagon.shared.http4.AbstractHttpClientWagon.put(AbstractHttpClientWagon.java:485)
	at org.apache.maven.repository.legacy.DefaultWagonManager.putRemoteFile(DefaultWagonManager.java:569)
	at org.apache.maven.repository.legacy.DefaultWagonManager.putArtifactMetadata(DefaultWagonManager.java:501)
	at org.apache.maven.artifact.repository.metadata.DefaultRepositoryMetadataManager.deploy(DefaultRepositoryMetadataManager.java:488)
	... 12 more
Caused by: org.apache.http.NoHttpResponseException: The target server failed to respond
	at org.apache.http.impl.conn.DefaultHttpResponseParser.parseHead(DefaultHttpResponseParser.java:95)
	at org.apache.http.impl.conn.DefaultHttpResponseParser.parseHead(DefaultHttpResponseParser.java:62)
	at org.apache.http.impl.io.AbstractMessageParser.parse(AbstractMessageParser.java:254)
	at org.apache.http.impl.AbstractHttpClientConnection.receiveResponseHeader(AbstractHttpClientConnection.java:289)
	at org.apache.http.impl.conn.DefaultClientConnection.receiveResponseHeader(DefaultClientConnection.java:252)
	at org.apache.http.impl.conn.ManagedClientConnectionImpl.receiveResponseHeader(ManagedClientConnectionImpl.java:191)
	at org.apache.http.protocol.HttpRequestExecutor.doReceiveResponse(HttpRequestExecutor.java:300)
	at org.apache.http.protocol.HttpRequestExecutor.execute(HttpRequestExecutor.java:127)
	at org.apache.http.impl.client.DefaultRequestDirector.tryExecute(DefaultRequestDirector.java:715)
	at org.apache.http.impl.client.DefaultRequestDirector.execute(DefaultRequestDirector.java:520)
	at org.apache.http.impl.client.AbstractHttpClient.execute(AbstractHttpClient.java:906)
	at org.apache.http.impl.client.AbstractHttpClient.execute(AbstractHttpClient.java:805)
	at org.apache.maven.wagon.shared.http4.AbstractHttpClientWagon.execute(AbstractHttpClientWagon.java:746)
	at org.apache.maven.wagon.shared.http4.AbstractHttpClientWagon.put(AbstractHttpClientWagon.java:574)
	... 18 more
[INFO] Deployment failed after 30 min
Build step 'Deploy artifacts to Maven repository' changed build result to FAILURE

Mime
View raw message