any23-dev mailing list archives

Site index · List index
Message view « Date » · « Thread »
Top « Date » · « Thread »
From Apache Jenkins Server <jenk...@builds.apache.org>
Subject Build failed in Jenkins: Any23-trunk #840
Date Sat, 09 Nov 2013 16:26:50 GMT
See <https://builds.apache.org/job/Any23-trunk/840/>

------------------------------------------
[...truncated 6697 lines...]
any23.extraction.head.meta=off
any23.extraction.csv.field=,
any23.extraction.rdfa.programmatic=on
any23.microdata.strict=off
any23.http.client.timeout=10000
any23.extraction.metadata.nesting=on
any23.core.version=0.9.1-SNAPSHOT (UNKNOWN@r${buildNumber}; 2013-11-09 16:13:02+0000)
any23.http.user.agent.default=Any23-CLI
any23.extraction.context.uri=?
any23.extraction.metadata.domain.per.entity=off
any23.plugin.dirs=./plugins
any23.microdata.ns.default=http://rdf.data-vocabulary.org/
========================================================================

  [2013-11-09 16:20:19,632] INFO  4786[qtp31-1 - Acceptor0 LocalConnector@0.0.0.0:1] - sun.reflect.GeneratedMethodAccessor8.invoke(?:?)
- org.apache.any23.servlet.ServletTest$TestableServlet-21357990: Attempting conversion to
'turtle' from POST body
  [2013-11-09 16:20:19,632] INFO  4786[qtp31-1 - Acceptor0 LocalConnector@0.0.0.0:1] - org.apache.any23.extractor.SingleDocumentExtraction.run(SingleDocumentExtraction.java:221)
- Processing http://any23.org/tmp/
  [2013-11-09 16:20:19,663] INFO  4817[qtp31-1 - Acceptor0 LocalConnector@0.0.0.0:1] - sun.reflect.GeneratedMethodAccessor8.invoke(?:?)
- org.apache.any23.servlet.ServletTest$TestableServlet-21357990: Extraction complete, 6 triples
  Tests run: 35, Failures: 0, Errors: 0, Skipped: 3, Time elapsed: 5.112 sec - in org.apache.any23.servlet.ServletTest

Results :

Tests run: 35, Failures: 0, Errors: 0, Skipped: 3

[JENKINS] Recording test results
[INFO] [assembly:single {execution: prepare-package}]
[INFO] Reading assembly descriptor: <https://builds.apache.org/job/Any23-trunk/ws/service/src/main/assembly/prepare-war-legals.xml>
[INFO] Copying files to <https://builds.apache.org/job/Any23-trunk/ws/service/target/war-legals>
[INFO] [war:war {execution: default-war}]
[INFO] Packaging webapp
[INFO] Assembling webapp [apache-any23-service] in [<https://builds.apache.org/job/Any23-trunk/ws/service/target/apache-any23-service-0.9.1-SNAPSHOT]>
[INFO] Processing war project
[INFO] Copying webapp webResources [<https://builds.apache.org/job/Any23-trunk/ws/service/src/main/resources/]>
to [<https://builds.apache.org/job/Any23-trunk/ws/service/target/apache-any23-service-0.9.1-SNAPSHOT]>
[INFO] Copying webapp resources [<https://builds.apache.org/job/Any23-trunk/ws/service/src/main/webapp]>
[INFO] Webapp assembled in [163 msecs]
[INFO] Building war: <https://builds.apache.org/job/Any23-trunk/ws/service/target/apache-any23-service-0.9.1-SNAPSHOT.war>
[INFO] WEB-INF/web.xml already added, skipping
[INFO] [war:war {execution: self-contained-war}]
[INFO] Packaging webapp
[INFO] Assembling webapp [apache-any23-service] in [<https://builds.apache.org/job/Any23-trunk/ws/service/target/apache-any23-service-0.9.1-SNAPSHOT]>
[INFO] Processing war project
[INFO] Copying webapp webResources [<https://builds.apache.org/job/Any23-trunk/ws/service/target/war-legals/with-deps/]>
to [<https://builds.apache.org/job/Any23-trunk/ws/service/target/apache-any23-service-0.9.1-SNAPSHOT]>
[INFO] Copying webapp resources [<https://builds.apache.org/job/Any23-trunk/ws/service/src/main/webapp]>
[INFO] Webapp assembled in [83 msecs]
[INFO] Building war: <https://builds.apache.org/job/Any23-trunk/ws/service/target/apache-any23-service-0.9.1-SNAPSHOT.war>
[INFO] WEB-INF/web.xml already added, skipping
[INFO] [war:war {execution: war-without-deps}]
[INFO] Packaging webapp
[INFO] Assembling webapp [apache-any23-service] in [<https://builds.apache.org/job/Any23-trunk/ws/service/target/apache-any23-service-0.9.1-SNAPSHOT]>
[INFO] Processing war project
[INFO] Copying webapp webResources [<https://builds.apache.org/job/Any23-trunk/ws/service/target/war-legals/without-deps/]>
to [<https://builds.apache.org/job/Any23-trunk/ws/service/target/apache-any23-service-0.9.1-SNAPSHOT]>
[INFO] Copying webapp resources [<https://builds.apache.org/job/Any23-trunk/ws/service/src/main/webapp]>
[INFO] Webapp assembled in [99 msecs]
[INFO] Building war: <https://builds.apache.org/job/Any23-trunk/ws/service/target/apache-any23-service-0.9.1-SNAPSHOT-without-deps.war>
[INFO] WEB-INF/web.xml already added, skipping
[INFO] [assembly:single {execution: assembly}]
[INFO] Reading assembly descriptor: <https://builds.apache.org/job/Any23-trunk/ws/service/src/main/assembly/with-deps.xml>
[INFO] Reading assembly descriptor: <https://builds.apache.org/job/Any23-trunk/ws/service/src/main/assembly/without-deps.xml>
[INFO] Reading assembly descriptor: <https://builds.apache.org/job/Any23-trunk/ws/service/src/main/assembly/server-embedded.xml>
[INFO] Building tar: <https://builds.apache.org/job/Any23-trunk/ws/service/target/apache-any23-service-0.9.1-SNAPSHOT-with-deps.tar.gz>
[INFO] Building zip: <https://builds.apache.org/job/Any23-trunk/ws/service/target/apache-any23-service-0.9.1-SNAPSHOT-with-deps.zip>
[INFO] Building tar: <https://builds.apache.org/job/Any23-trunk/ws/service/target/apache-any23-service-0.9.1-SNAPSHOT-without-deps.tar.gz>
[INFO] Building zip: <https://builds.apache.org/job/Any23-trunk/ws/service/target/apache-any23-service-0.9.1-SNAPSHOT-without-deps.zip>
[INFO] Building tar: <https://builds.apache.org/job/Any23-trunk/ws/service/target/apache-any23-service-0.9.1-SNAPSHOT-server-embedded.tar.gz>
[INFO] Building zip: <https://builds.apache.org/job/Any23-trunk/ws/service/target/apache-any23-service-0.9.1-SNAPSHOT-server-embedded.zip>
[INFO] [install:install {execution: default-install}]
[INFO] Installing <https://builds.apache.org/job/Any23-trunk/ws/service/target/apache-any23-service-0.9.1-SNAPSHOT.war>
to /home/jenkins/jenkins-slave/maven-repositories/0/org/apache/any23/apache-any23-service/0.9.1-SNAPSHOT/apache-any23-service-0.9.1-SNAPSHOT.war
[INFO] Installing <https://builds.apache.org/job/Any23-trunk/ws/service/target/apache-any23-service-0.9.1-SNAPSHOT-without-deps.war>
to /home/jenkins/jenkins-slave/maven-repositories/0/org/apache/any23/apache-any23-service/0.9.1-SNAPSHOT/apache-any23-service-0.9.1-SNAPSHOT-without-deps.war
[INFO] Installing <https://builds.apache.org/job/Any23-trunk/ws/service/target/apache-any23-service-0.9.1-SNAPSHOT-with-deps.tar.gz>
to /home/jenkins/jenkins-slave/maven-repositories/0/org/apache/any23/apache-any23-service/0.9.1-SNAPSHOT/apache-any23-service-0.9.1-SNAPSHOT-with-deps.tar.gz
[INFO] Installing <https://builds.apache.org/job/Any23-trunk/ws/service/target/apache-any23-service-0.9.1-SNAPSHOT-with-deps.zip>
to /home/jenkins/jenkins-slave/maven-repositories/0/org/apache/any23/apache-any23-service/0.9.1-SNAPSHOT/apache-any23-service-0.9.1-SNAPSHOT-with-deps.zip
[INFO] Installing <https://builds.apache.org/job/Any23-trunk/ws/service/target/apache-any23-service-0.9.1-SNAPSHOT-without-deps.tar.gz>
to /home/jenkins/jenkins-slave/maven-repositories/0/org/apache/any23/apache-any23-service/0.9.1-SNAPSHOT/apache-any23-service-0.9.1-SNAPSHOT-without-deps.tar.gz
[INFO] Installing <https://builds.apache.org/job/Any23-trunk/ws/service/target/apache-any23-service-0.9.1-SNAPSHOT-without-deps.zip>
to /home/jenkins/jenkins-slave/maven-repositories/0/org/apache/any23/apache-any23-service/0.9.1-SNAPSHOT/apache-any23-service-0.9.1-SNAPSHOT-without-deps.zip
[INFO] Installing <https://builds.apache.org/job/Any23-trunk/ws/service/target/apache-any23-service-0.9.1-SNAPSHOT-server-embedded.tar.gz>
to /home/jenkins/jenkins-slave/maven-repositories/0/org/apache/any23/apache-any23-service/0.9.1-SNAPSHOT/apache-any23-service-0.9.1-SNAPSHOT-server-embedded.tar.gz
[INFO] Installing <https://builds.apache.org/job/Any23-trunk/ws/service/target/apache-any23-service-0.9.1-SNAPSHOT-server-embedded.zip>
to /home/jenkins/jenkins-slave/maven-repositories/0/org/apache/any23/apache-any23-service/0.9.1-SNAPSHOT/apache-any23-service-0.9.1-SNAPSHOT-server-embedded.zip
[INFO] [deploy:deploy {execution: default-deploy}]
[INFO] Retrieving previous build number from apache.snapshots.https
[WARNING] *** CHECKSUM FAILED - Checksum failed on download: local = '8f596edc04bc0ddeddb2760e00265935639af978';
remote = '4441f119cf52ef5112928d03b585cf8c35384497' - RETRYING
[WARNING] *** CHECKSUM FAILED - Checksum failed on download: local = '8f596edc04bc0ddeddb2760e00265935639af978';
remote = '4441f119cf52ef5112928d03b585cf8c35384497' - IGNORING
Uploading: https://repository.apache.org/content/repositories/snapshots/org/apache/any23/apache-any23-service/0.9.1-SNAPSHOT/apache-any23-service-0.9.1-20131109.161342-10.war
27322K uploaded  (apache-any23-service-0.9.1-20131109.161342-10.war)
[INFO] Retrieving previous metadata from apache.snapshots.https
[WARNING] *** CHECKSUM FAILED - Checksum failed on download: local = '16985bc1f8c292e8cd5b32184d330313312ed64f';
remote = '49702f655483aff1cab5a79e74a403df728d9bdb' - RETRYING
[WARNING] *** CHECKSUM FAILED - Checksum failed on download: local = '16985bc1f8c292e8cd5b32184d330313312ed64f';
remote = '49702f655483aff1cab5a79e74a403df728d9bdb' - IGNORING
[INFO] Uploading repository metadata for: 'artifact org.apache.any23:apache-any23-service'
[INFO] Uploading project information for apache-any23-service 0.9.1-20131109.161342-10
[INFO] Retrieving previous metadata from apache.snapshots.https
[WARNING] *** CHECKSUM FAILED - Checksum failed on download: local = '8f596edc04bc0ddeddb2760e00265935639af978';
remote = '4441f119cf52ef5112928d03b585cf8c35384497' - RETRYING
[WARNING] *** CHECKSUM FAILED - Checksum failed on download: local = '8f596edc04bc0ddeddb2760e00265935639af978';
remote = '4441f119cf52ef5112928d03b585cf8c35384497' - IGNORING
[INFO] Uploading repository metadata for: 'snapshot org.apache.any23:apache-any23-service:0.9.1-SNAPSHOT'
[INFO] Retrieving previous build number from apache.snapshots.https
Uploading: https://repository.apache.org/content/repositories/snapshots/org/apache/any23/apache-any23-service/0.9.1-SNAPSHOT/apache-any23-service-0.9.1-20131109.161342-10-without-deps.war
121K uploaded  (apache-any23-service-0.9.1-20131109.161342-10-without-deps.war)
[INFO] Retrieving previous build number from apache.snapshots.https
Uploading: https://repository.apache.org/content/repositories/snapshots/org/apache/any23/apache-any23-service/0.9.1-SNAPSHOT/apache-any23-service-0.9.1-20131109.161342-10-with-deps.tar.gz
27334K uploaded  (apache-any23-service-0.9.1-20131109.161342-10-with-deps.tar.gz)
[INFO] Retrieving previous build number from apache.snapshots.https
Uploading: https://repository.apache.org/content/repositories/snapshots/org/apache/any23/apache-any23-service/0.9.1-SNAPSHOT/apache-any23-service-0.9.1-20131109.161342-10-with-deps.zip
27334K uploaded  (apache-any23-service-0.9.1-20131109.161342-10-with-deps.zip)
[INFO] Retrieving previous build number from apache.snapshots.https
Uploading: https://repository.apache.org/content/repositories/snapshots/org/apache/any23/apache-any23-service/0.9.1-SNAPSHOT/apache-any23-service-0.9.1-20131109.161342-10-without-deps.tar.gz
127K uploaded  (apache-any23-service-0.9.1-20131109.161342-10-without-deps.tar.gz)
[INFO] Retrieving previous build number from apache.snapshots.https
Uploading: https://repository.apache.org/content/repositories/snapshots/org/apache/any23/apache-any23-service/0.9.1-SNAPSHOT/apache-any23-service-0.9.1-20131109.161342-10-without-deps.zip
127K uploaded  (apache-any23-service-0.9.1-20131109.161342-10-without-deps.zip)
[INFO] Retrieving previous build number from apache.snapshots.https
Uploading: https://repository.apache.org/content/repositories/snapshots/org/apache/any23/apache-any23-service/0.9.1-SNAPSHOT/apache-any23-service-0.9.1-20131109.161342-10-server-embedded.tar.gz
31725K uploaded  (apache-any23-service-0.9.1-20131109.161342-10-server-embedded.tar.gz)
[INFO] Retrieving previous build number from apache.snapshots.https
Uploading: https://repository.apache.org/content/repositories/snapshots/org/apache/any23/apache-any23-service/0.9.1-SNAPSHOT/apache-any23-service-0.9.1-20131109.161342-10-server-embedded.zip
31727K uploaded  (apache-any23-service-0.9.1-20131109.161342-10-server-embedded.zip)
[INFO] 
[INFO] 
[INFO] ------------------------------------------------------------------------
[INFO] Reactor Summary:
[INFO] ------------------------------------------------------------------------
[INFO] Apache Any23 .......................................... SUCCESS [41.886s]
[INFO] Apache Any23 :: Base API .............................. SUCCESS [17.450s]
[INFO] Apache Any23 :: Test Resources ........................ SUCCESS [27.720s]
[INFO] Apache Any23 :: NQuads Parser and Writer .............. SUCCESS [16.799s]
[INFO] Apache Any23 :: CSV Utilities ......................... SUCCESS [17.638s]
[INFO] Apache Any23 :: Mime Type Detection ................... SUCCESS [17.366s]
[INFO] Apache Any23 :: Encoding Detection .................... SUCCESS [18.323s]
[INFO] Apache Any23 :: Core .................................. SUCCESS [36.929s]
[INFO] Apache Any23 :: Plugins :: Basic Crawler .............. SUCCESS [44.297s]
[INFO] Apache Any23 :: Plugins :: HTML Scraper ............... SUCCESS [32.438s]
[INFO] Apache Any23 :: Plugins :: Office Scraper ............. SUCCESS [32.715s]
[INFO] Apache Any23 :: Plugins :: Integration Test ........... SUCCESS [1:00.059s]
[INFO] Apache Any23 :: Service ............................... SUCCESS [43.917s]
[INFO] ------------------------------------------------------------------------
[INFO] ------------------------------------------------------------------------
[INFO] BUILD SUCCESSFUL
[INFO] ------------------------------------------------------------------------
[INFO] Total time: 7 minutes 40 seconds
[INFO] Finished at: Sat Nov 09 16:20:43 UTC 2013
[INFO] Final Memory: 83M/408M
[INFO] ------------------------------------------------------------------------
Waiting for Jenkins to finish collecting data
[JENKINS] Archiving <https://builds.apache.org/job/Any23-trunk/ws/core/pom.xml> to org.apache.any23/apache-any23-core/0.9.1-SNAPSHOT/apache-any23-core-0.9.1-SNAPSHOT.pom
[JENKINS] Archiving <https://builds.apache.org/job/Any23-trunk/ws/core/target/apache-any23-core-0.9.1-SNAPSHOT.jar>
to org.apache.any23/apache-any23-core/0.9.1-20131109.161342-11/apache-any23-core-0.9.1-20131109.161342-11.jar
[JENKINS] Archiving <https://builds.apache.org/job/Any23-trunk/ws/core/target/apache-any23-core-0.9.1-SNAPSHOT.tar.gz>
to org.apache.any23/apache-any23-core/0.9.1-20131109.161342-11/apache-any23-core-0.9.1-20131109.161342-11.tar.gz
[JENKINS] Archiving <https://builds.apache.org/job/Any23-trunk/ws/core/target/apache-any23-core-0.9.1-SNAPSHOT.zip>
to org.apache.any23/apache-any23-core/0.9.1-20131109.161342-11/apache-any23-core-0.9.1-20131109.161342-11.zip
[JENKINS] Archiving <https://builds.apache.org/job/Any23-trunk/ws/core/target/apache-any23-core-0.9.1-SNAPSHOT-tests.jar>
to org.apache.any23/apache-any23-core/0.9.1-20131109.161342-11/apache-any23-core-0.9.1-20131109.161342-11-tests.jar
[JENKINS] Archiving <https://builds.apache.org/job/Any23-trunk/ws/test-resources/pom.xml>
to org.apache.any23/apache-any23-test-resources/0.9.1-SNAPSHOT/apache-any23-test-resources-0.9.1-SNAPSHOT.pom
[JENKINS] Archiving <https://builds.apache.org/job/Any23-trunk/ws/test-resources/target/apache-any23-test-resources-0.9.1-SNAPSHOT.jar>
to org.apache.any23/apache-any23-test-resources/0.9.1-20131109.161342-11/apache-any23-test-resources-0.9.1-20131109.161342-11.jar
[JENKINS] Archiving <https://builds.apache.org/job/Any23-trunk/ws/test-resources/target/apache-any23-test-resources-0.9.1-SNAPSHOT-tests.jar>
to org.apache.any23/apache-any23-test-resources/0.9.1-20131109.161342-11/apache-any23-test-resources-0.9.1-20131109.161342-11-tests.jar
[JENKINS] Archiving <https://builds.apache.org/job/Any23-trunk/ws/plugins/office-scraper/pom.xml>
to org.apache.any23.plugins/apache-any23-office-scraper/1.0.4-SNAPSHOT/apache-any23-office-scraper-1.0.4-SNAPSHOT.pom
[JENKINS] Archiving <https://builds.apache.org/job/Any23-trunk/ws/plugins/office-scraper/target/apache-any23-office-scraper-1.0.4-SNAPSHOT.jar>
to org.apache.any23.plugins/apache-any23-office-scraper/1.0.4-20131109.161342-11/apache-any23-office-scraper-1.0.4-20131109.161342-11.jar
[JENKINS] Archiving <https://builds.apache.org/job/Any23-trunk/ws/plugins/office-scraper/target/apache-any23-office-scraper-1.0.4-SNAPSHOT.tar.gz>
to org.apache.any23.plugins/apache-any23-office-scraper/1.0.4-20131109.161342-11/apache-any23-office-scraper-1.0.4-20131109.161342-11.tar.gz
[JENKINS] Archiving <https://builds.apache.org/job/Any23-trunk/ws/plugins/office-scraper/target/apache-any23-office-scraper-1.0.4-SNAPSHOT.zip>
to org.apache.any23.plugins/apache-any23-office-scraper/1.0.4-20131109.161342-11/apache-any23-office-scraper-1.0.4-20131109.161342-11.zip
[JENKINS] Archiving <https://builds.apache.org/job/Any23-trunk/ws/plugins/html-scraper/pom.xml>
to org.apache.any23.plugins/apache-any23-html-scraper/1.0.5-SNAPSHOT/apache-any23-html-scraper-1.0.5-SNAPSHOT.pom
[JENKINS] Archiving <https://builds.apache.org/job/Any23-trunk/ws/plugins/html-scraper/target/apache-any23-html-scraper-1.0.5-SNAPSHOT.jar>
to org.apache.any23.plugins/apache-any23-html-scraper/1.0.5-20131109.161342-11/apache-any23-html-scraper-1.0.5-20131109.161342-11.jar
[JENKINS] Archiving <https://builds.apache.org/job/Any23-trunk/ws/plugins/html-scraper/target/apache-any23-html-scraper-1.0.5-SNAPSHOT.tar.gz>
to org.apache.any23.plugins/apache-any23-html-scraper/1.0.5-20131109.161342-11/apache-any23-html-scraper-1.0.5-20131109.161342-11.tar.gz
[JENKINS] Archiving <https://builds.apache.org/job/Any23-trunk/ws/plugins/html-scraper/target/apache-any23-html-scraper-1.0.5-SNAPSHOT.zip>
to org.apache.any23.plugins/apache-any23-html-scraper/1.0.5-20131109.161342-11/apache-any23-html-scraper-1.0.5-20131109.161342-11.zip
[JENKINS] Archiving <https://builds.apache.org/job/Any23-trunk/ws/service/pom.xml> to
org.apache.any23/apache-any23-service/0.9.1-SNAPSHOT/apache-any23-service-0.9.1-SNAPSHOT.pom
[JENKINS] Archiving <https://builds.apache.org/job/Any23-trunk/ws/service/target/apache-any23-service-0.9.1-SNAPSHOT.war>
to org.apache.any23/apache-any23-service/0.9.1-20131109.161342-10/apache-any23-service-0.9.1-20131109.161342-10.war
[JENKINS] Archiving <https://builds.apache.org/job/Any23-trunk/ws/service/target/apache-any23-service-0.9.1-SNAPSHOT-without-deps.war>
to org.apache.any23/apache-any23-service/0.9.1-20131109.161342-10/apache-any23-service-0.9.1-20131109.161342-10-without-deps.war
[JENKINS] Archiving <https://builds.apache.org/job/Any23-trunk/ws/service/target/apache-any23-service-0.9.1-SNAPSHOT-with-deps.tar.gz>
to org.apache.any23/apache-any23-service/0.9.1-20131109.161342-10/apache-any23-service-0.9.1-20131109.161342-10-with-deps.tar.gz
[JENKINS] Archiving <https://builds.apache.org/job/Any23-trunk/ws/service/target/apache-any23-service-0.9.1-SNAPSHOT-with-deps.zip>
to org.apache.any23/apache-any23-service/0.9.1-20131109.161342-10/apache-any23-service-0.9.1-20131109.161342-10-with-deps.zip
[JENKINS] Archiving <https://builds.apache.org/job/Any23-trunk/ws/service/target/apache-any23-service-0.9.1-SNAPSHOT-without-deps.tar.gz>
to org.apache.any23/apache-any23-service/0.9.1-20131109.161342-10/apache-any23-service-0.9.1-20131109.161342-10-without-deps.tar.gz
[JENKINS] Archiving <https://builds.apache.org/job/Any23-trunk/ws/service/target/apache-any23-service-0.9.1-SNAPSHOT-without-deps.zip>
to org.apache.any23/apache-any23-service/0.9.1-20131109.161342-10/apache-any23-service-0.9.1-20131109.161342-10-without-deps.zip
[JENKINS] Archiving <https://builds.apache.org/job/Any23-trunk/ws/service/target/apache-any23-service-0.9.1-SNAPSHOT-server-embedded.tar.gz>
to org.apache.any23/apache-any23-service/0.9.1-20131109.161342-10/apache-any23-service-0.9.1-20131109.161342-10-server-embedded.tar.gz
[JENKINS] Archiving <https://builds.apache.org/job/Any23-trunk/ws/service/target/apache-any23-service-0.9.1-SNAPSHOT-server-embedded.zip>
to org.apache.any23/apache-any23-service/0.9.1-20131109.161342-10/apache-any23-service-0.9.1-20131109.161342-10-server-embedded.zip
[JENKINS] Archiving <https://builds.apache.org/job/Any23-trunk/ws/api/pom.xml> to org.apache.any23/apache-any23-api/0.9.1-SNAPSHOT/apache-any23-api-0.9.1-SNAPSHOT.pom
[JENKINS] Archiving <https://builds.apache.org/job/Any23-trunk/ws/api/target/apache-any23-api-0.9.1-SNAPSHOT.jar>
to org.apache.any23/apache-any23-api/0.9.1-20131109.161342-11/apache-any23-api-0.9.1-20131109.161342-11.jar
[JENKINS] Archiving <https://builds.apache.org/job/Any23-trunk/ws/csvutils/pom.xml>
to org.apache.any23/apache-any23-csvutils/0.9.1-SNAPSHOT/apache-any23-csvutils-0.9.1-SNAPSHOT.pom
[JENKINS] Archiving <https://builds.apache.org/job/Any23-trunk/ws/csvutils/target/apache-any23-csvutils-0.9.1-SNAPSHOT.jar>
to org.apache.any23/apache-any23-csvutils/0.9.1-20131109.161342-11/apache-any23-csvutils-0.9.1-20131109.161342-11.jar
[JENKINS] Archiving <https://builds.apache.org/job/Any23-trunk/ws/plugins/integration-test/pom.xml>
to org.apache.any23.plugins/apache-any23-integration-test/0.9.1-SNAPSHOT/apache-any23-integration-test-0.9.1-SNAPSHOT.pom
[JENKINS] Archiving <https://builds.apache.org/job/Any23-trunk/ws/plugins/integration-test/target/apache-any23-integration-test-0.9.1-SNAPSHOT.jar>
to org.apache.any23.plugins/apache-any23-integration-test/0.9.1-20131109.161342-10/apache-any23-integration-test-0.9.1-20131109.161342-10.jar
[JENKINS] Archiving <https://builds.apache.org/job/Any23-trunk/ws/pom.xml> to org.apache.any23/apache-any23/0.9.1-SNAPSHOT/apache-any23-0.9.1-SNAPSHOT.pom
[JENKINS] Archiving /home/jenkins/jenkins-slave/maven-repositories/0/org/apache/any23/apache-any23/0.9.1-SNAPSHOT/apache-any23-0.9.1-SNAPSHOT.pom
to org.apache.any23/apache-any23/0.9.1-20131109.161342-11/apache-any23-0.9.1-20131109.161342-11.pom
[JENKINS] Archiving <https://builds.apache.org/job/Any23-trunk/ws/target/apache-any23-0.9.1-SNAPSHOT-site.xml>
to org.apache.any23/apache-any23/0.9.1-20131109.161342-11/apache-any23-0.9.1-20131109.161342-11-site.xml
[JENKINS] Archiving <https://builds.apache.org/job/Any23-trunk/ws/target/apache-any23-0.9.1-SNAPSHOT-src.tar.gz>
to org.apache.any23/apache-any23/0.9.1-20131109.161342-11/apache-any23-0.9.1-20131109.161342-11-src.tar.gz
[JENKINS] Archiving <https://builds.apache.org/job/Any23-trunk/ws/target/apache-any23-0.9.1-SNAPSHOT-src.zip>
to org.apache.any23/apache-any23/0.9.1-20131109.161342-11/apache-any23-0.9.1-20131109.161342-11-src.zip
/x1/jenkins/jenkins-slave/maven-repositories/0/org/apache/any23/apache-any23/0.9.1-SNAPSHOT/apache-any23-0.9.1-SNAPSHOT.pom
is not inside /x1/jenkins/jenkins-slave/workspace/Any23-trunk/; will archive in a separate
pass
[JENKINS] Archiving <https://builds.apache.org/job/Any23-trunk/ws/plugins/basic-crawler/pom.xml>
to org.apache.any23.plugins/apache-any23-basic-crawler/1.0.4-SNAPSHOT/apache-any23-basic-crawler-1.0.4-SNAPSHOT.pom
[JENKINS] Archiving <https://builds.apache.org/job/Any23-trunk/ws/plugins/basic-crawler/target/apache-any23-basic-crawler-1.0.4-SNAPSHOT.jar>
to org.apache.any23.plugins/apache-any23-basic-crawler/1.0.4-20131109.161342-11/apache-any23-basic-crawler-1.0.4-20131109.161342-11.jar
[JENKINS] Archiving <https://builds.apache.org/job/Any23-trunk/ws/plugins/basic-crawler/target/apache-any23-basic-crawler-1.0.4-SNAPSHOT.tar.gz>
to org.apache.any23.plugins/apache-any23-basic-crawler/1.0.4-20131109.161342-11/apache-any23-basic-crawler-1.0.4-20131109.161342-11.tar.gz
[JENKINS] Archiving <https://builds.apache.org/job/Any23-trunk/ws/plugins/basic-crawler/target/apache-any23-basic-crawler-1.0.4-SNAPSHOT.zip>
to org.apache.any23.plugins/apache-any23-basic-crawler/1.0.4-20131109.161342-11/apache-any23-basic-crawler-1.0.4-20131109.161342-11.zip
[JENKINS] Archiving <https://builds.apache.org/job/Any23-trunk/ws/plugins/basic-crawler/target/apache-any23-basic-crawler-1.0.4-SNAPSHOT-tests.jar>
to org.apache.any23.plugins/apache-any23-basic-crawler/1.0.4-20131109.161342-11/apache-any23-basic-crawler-1.0.4-20131109.161342-11-tests.jar
[JENKINS] Archiving <https://builds.apache.org/job/Any23-trunk/ws/encoding/pom.xml>
to org.apache.any23/apache-any23-encoding/0.9.1-SNAPSHOT/apache-any23-encoding-0.9.1-SNAPSHOT.pom
[JENKINS] Archiving <https://builds.apache.org/job/Any23-trunk/ws/encoding/target/apache-any23-encoding-0.9.1-SNAPSHOT.jar>
to org.apache.any23/apache-any23-encoding/0.9.1-20131109.161342-11/apache-any23-encoding-0.9.1-20131109.161342-11.jar
[JENKINS] Archiving <https://builds.apache.org/job/Any23-trunk/ws/nquads/pom.xml> to
org.apache.any23/apache-any23-nquads/0.9.1-SNAPSHOT/apache-any23-nquads-0.9.1-SNAPSHOT.pom
[JENKINS] Archiving <https://builds.apache.org/job/Any23-trunk/ws/nquads/target/apache-any23-nquads-0.9.1-SNAPSHOT.jar>
to org.apache.any23/apache-any23-nquads/0.9.1-20131109.161342-11/apache-any23-nquads-0.9.1-20131109.161342-11.jar
[JENKINS] Archiving <https://builds.apache.org/job/Any23-trunk/ws/mime/pom.xml> to org.apache.any23/apache-any23-mime/0.9.1-SNAPSHOT/apache-any23-mime-0.9.1-SNAPSHOT.pom
[JENKINS] Archiving <https://builds.apache.org/job/Any23-trunk/ws/mime/target/apache-any23-mime-0.9.1-SNAPSHOT.jar>
to org.apache.any23/apache-any23-mime/0.9.1-20131109.161342-11/apache-any23-mime-0.9.1-20131109.161342-11.jar
channel stopped
Maven RedeployPublisher use remote ubuntu3 maven settings from : /home/jenkins/.m2/settings.xml
[INFO] Deployment in https://repository.apache.org/content/repositories/snapshots (id=apache.snapshots.https,uniqueVersion=false)
Deploying the main artifact jenkins-6310098222347603727apache-any23-0.9.1-20131109.161342-11.pom
Deploying the main artifact jenkins-9118042975130729655apache-any23-0.9.1-20131109.161342-11-site.xml
Deploying the main artifact jenkins-6310666867367952896apache-any23-0.9.1-20131109.161342-11-src.tar.gz
Deploying the main artifact jenkins-3169387770607822518apache-any23-0.9.1-20131109.161342-11-src.zip
[INFO] Deployment in https://repository.apache.org/content/repositories/snapshots (id=apache.snapshots.https,uniqueVersion=false)
Deploying the main artifact jenkins-8453158163992533643apache-any23-api-0.9.1-20131109.161342-11.jar
[INFO] Deployment in https://repository.apache.org/content/repositories/snapshots (id=apache.snapshots.https,uniqueVersion=false)
Deploying the main artifact jenkins-3250113895904029563apache-any23-core-0.9.1-20131109.161342-11.jar
Deploying the main artifact jenkins-9106659593931544633apache-any23-core-0.9.1-20131109.161342-11.tar.gz
Deploying the main artifact jenkins-4598107305553128343apache-any23-core-0.9.1-20131109.161342-11.zip
Deploying the main artifact jenkins-1335504398221350344apache-any23-core-0.9.1-20131109.161342-11-tests.jar
[INFO] Deployment in https://repository.apache.org/content/repositories/snapshots (id=apache.snapshots.https,uniqueVersion=false)
Deploying the main artifact jenkins-5624656805293186294apache-any23-csvutils-0.9.1-20131109.161342-11.jar
[INFO] Deployment in https://repository.apache.org/content/repositories/snapshots (id=apache.snapshots.https,uniqueVersion=false)
Deploying the main artifact jenkins-3489635126260822425apache-any23-encoding-0.9.1-20131109.161342-11.jar
[INFO] Deployment in https://repository.apache.org/content/repositories/snapshots (id=apache.snapshots.https,uniqueVersion=false)
Deploying the main artifact jenkins-4442441464761596369apache-any23-mime-0.9.1-20131109.161342-11.jar
ERROR: Error installing artifact's metadata: Error while deploying metadata: The target server
failed to respond
org.apache.maven.artifact.deployer.ArtifactDeploymentException: Error installing artifact's
metadata: Error while deploying metadata: The target server failed to respond
	at hudson.maven.artifact.deployer.DefaultArtifactDeployer.deploy(DefaultArtifactDeployer.java:183)
	at hudson.maven.reporters.MavenArtifactRecord.deploy(MavenArtifactRecord.java:191)
	at hudson.maven.RedeployPublisher.perform(RedeployPublisher.java:176)
	at hudson.tasks.BuildStepMonitor$1.perform(BuildStepMonitor.java:20)
	at hudson.model.AbstractBuild$AbstractBuildExecution.perform(AbstractBuild.java:781)
	at hudson.model.AbstractBuild$AbstractBuildExecution.performAllBuildSteps(AbstractBuild.java:753)
	at hudson.maven.MavenModuleSetBuild$MavenModuleSetBuildExecution.post2(MavenModuleSetBuild.java:1020)
	at hudson.model.AbstractBuild$AbstractBuildExecution.post(AbstractBuild.java:706)
	at hudson.model.Run.execute(Run.java:1690)
	at hudson.maven.MavenModuleSetBuild.run(MavenModuleSetBuild.java:509)
	at hudson.model.ResourceController.execute(ResourceController.java:88)
	at hudson.model.Executor.run(Executor.java:230)
Caused by: org.apache.maven.artifact.repository.metadata.RepositoryMetadataDeploymentException:
Error while deploying metadata: The target server failed to respond
	at org.apache.maven.artifact.repository.metadata.DefaultRepositoryMetadataManager.deploy(DefaultRepositoryMetadataManager.java:492)
	at hudson.maven.artifact.deployer.DefaultArtifactDeployer.deploy(DefaultArtifactDeployer.java:167)
	... 11 more
Caused by: org.apache.maven.wagon.TransferFailedException: The target server failed to respond
	at org.apache.maven.wagon.shared.http4.AbstractHttpClientWagon.put(AbstractHttpClientWagon.java:580)
	at org.apache.maven.wagon.shared.http4.AbstractHttpClientWagon.put(AbstractHttpClientWagon.java:524)
	at org.apache.maven.wagon.shared.http4.AbstractHttpClientWagon.put(AbstractHttpClientWagon.java:505)
	at org.apache.maven.wagon.shared.http4.AbstractHttpClientWagon.put(AbstractHttpClientWagon.java:485)
	at org.apache.maven.repository.legacy.DefaultWagonManager.putRemoteFile(DefaultWagonManager.java:543)
	at org.apache.maven.repository.legacy.DefaultWagonManager.putArtifactMetadata(DefaultWagonManager.java:501)
	at org.apache.maven.artifact.repository.metadata.DefaultRepositoryMetadataManager.deploy(DefaultRepositoryMetadataManager.java:488)
	... 12 more
Caused by: org.apache.http.NoHttpResponseException: The target server failed to respond
	at org.apache.http.impl.conn.DefaultHttpResponseParser.parseHead(DefaultHttpResponseParser.java:95)
	at org.apache.http.impl.conn.DefaultHttpResponseParser.parseHead(DefaultHttpResponseParser.java:62)
	at org.apache.http.impl.io.AbstractMessageParser.parse(AbstractMessageParser.java:254)
	at org.apache.http.impl.AbstractHttpClientConnection.receiveResponseHeader(AbstractHttpClientConnection.java:289)
	at org.apache.http.impl.conn.DefaultClientConnection.receiveResponseHeader(DefaultClientConnection.java:252)
	at org.apache.http.impl.conn.ManagedClientConnectionImpl.receiveResponseHeader(ManagedClientConnectionImpl.java:191)
	at org.apache.http.protocol.HttpRequestExecutor.doReceiveResponse(HttpRequestExecutor.java:300)
	at org.apache.http.protocol.HttpRequestExecutor.execute(HttpRequestExecutor.java:127)
	at org.apache.http.impl.client.DefaultRequestDirector.tryExecute(DefaultRequestDirector.java:715)
	at org.apache.http.impl.client.DefaultRequestDirector.execute(DefaultRequestDirector.java:520)
	at org.apache.http.impl.client.AbstractHttpClient.execute(AbstractHttpClient.java:906)
	at org.apache.http.impl.client.AbstractHttpClient.execute(AbstractHttpClient.java:805)
	at org.apache.maven.wagon.shared.http4.AbstractHttpClientWagon.execute(AbstractHttpClientWagon.java:746)
	at org.apache.maven.wagon.shared.http4.AbstractHttpClientWagon.put(AbstractHttpClientWagon.java:574)
	... 18 more
[INFO] Deployment failed after 5 min 1 sec
Build step 'Deploy artifacts to Maven repository' changed build result to FAILURE

Mime
View raw message