any23-dev mailing list archives

Site index · List index
Message view « Date » · « Thread »
Top « Date » · « Thread »
From Apache Jenkins Server <jenk...@builds.apache.org>
Subject Build failed in Jenkins: Any23-trunk #678
Date Sun, 02 Jun 2013 07:04:48 GMT
See <https://builds.apache.org/job/Any23-trunk/678/>

------------------------------------------
[...truncated 4573 lines...]
  [2013-06-02 07:04:16,379] INFO  8407[main] - org.apache.any23.extractor.SingleDocumentExtraction.run(SingleDocumentExtraction.java:221)
- Processing http://bob.example.com/
  [2013-06-02 07:04:16,408] INFO  8436[main] - org.apache.any23.extractor.SingleDocumentExtraction.run(SingleDocumentExtraction.java:221)
- Processing http://bob.example.com/
  Tests run: 5, Failures: 0, Errors: 0, Skipped: 0, Time elapsed: 0.159 sec
Running org.apache.any23.extractor.html.HListingExtractorTest
[2013-06-02 07:04:16,472] INFO  8500[main] - org.apache.any23.extractor.SingleDocumentExtraction.run(SingleDocumentExtraction.java:221)
- Processing http://bob.example.com/
  [2013-06-02 07:04:16,477] INFO  8505[main] - org.apache.any23.extractor.SingleDocumentExtraction.run(SingleDocumentExtraction.java:221)
- Processing http://bob.example.com/
  [2013-06-02 07:04:16,484] INFO  8512[main] - org.apache.any23.extractor.SingleDocumentExtraction.run(SingleDocumentExtraction.java:221)
- Processing http://bob.example.com/
  [2013-06-02 07:04:16,492] INFO  8520[main] - org.apache.any23.extractor.SingleDocumentExtraction.run(SingleDocumentExtraction.java:221)
- Processing http://bob.example.com/
  [2013-06-02 07:04:16,545] INFO  8573[main] - org.apache.any23.extractor.SingleDocumentExtraction.run(SingleDocumentExtraction.java:221)
- Processing http://bob.example.com/
  [2013-06-02 07:04:16,553] INFO  8581[main] - org.apache.any23.extractor.SingleDocumentExtraction.run(SingleDocumentExtraction.java:221)
- Processing http://bob.example.com/
  [2013-06-02 07:04:16,612] INFO  8640[main] - org.apache.any23.extractor.SingleDocumentExtraction.run(SingleDocumentExtraction.java:221)
- Processing http://bob.example.com/
  [2013-06-02 07:04:16,660] INFO  8688[main] - org.apache.any23.extractor.SingleDocumentExtraction.run(SingleDocumentExtraction.java:221)
- Processing http://bob.example.com/
  [2013-06-02 07:04:16,700] INFO  8728[main] - org.apache.any23.extractor.SingleDocumentExtraction.run(SingleDocumentExtraction.java:221)
- Processing http://bob.example.com/
  [2013-06-02 07:04:16,755] INFO  8783[main] - org.apache.any23.extractor.SingleDocumentExtraction.run(SingleDocumentExtraction.java:221)
- Processing http://bob.example.com/
  [2013-06-02 07:04:16,812] INFO  8840[main] - org.apache.any23.extractor.SingleDocumentExtraction.run(SingleDocumentExtraction.java:221)
- Processing http://bob.example.com/
  [2013-06-02 07:04:16,854] INFO  8882[main] - org.apache.any23.extractor.SingleDocumentExtraction.run(SingleDocumentExtraction.java:221)
- Processing http://bob.example.com/
  [2013-06-02 07:04:16,902] INFO  8930[main] - org.apache.any23.extractor.SingleDocumentExtraction.run(SingleDocumentExtraction.java:221)
- Processing http://bob.example.com/
  [2013-06-02 07:04:16,934] INFO  8962[main] - org.apache.any23.extractor.SingleDocumentExtraction.run(SingleDocumentExtraction.java:221)
- Processing http://bob.example.com/
  [2013-06-02 07:04:16,969] INFO  8997[main] - org.apache.any23.extractor.SingleDocumentExtraction.run(SingleDocumentExtraction.java:221)
- Processing http://bob.example.com/
  [2013-06-02 07:04:16,979] INFO  9007[main] - org.apache.any23.extractor.SingleDocumentExtraction.run(SingleDocumentExtraction.java:221)
- Processing http://bob.example.com/
  [2013-06-02 07:04:16,988] INFO  9016[main] - org.apache.any23.extractor.SingleDocumentExtraction.run(SingleDocumentExtraction.java:221)
- Processing http://bob.example.com/
  [2013-06-02 07:04:16,996] INFO  9024[main] - org.apache.any23.extractor.SingleDocumentExtraction.run(SingleDocumentExtraction.java:221)
- Processing http://bob.example.com/
  [2013-06-02 07:04:17,008] INFO  9036[main] - org.apache.any23.extractor.SingleDocumentExtraction.run(SingleDocumentExtraction.java:221)
- Processing http://bob.example.com/
  [2013-06-02 07:04:17,021] INFO  9049[main] - org.apache.any23.extractor.SingleDocumentExtraction.run(SingleDocumentExtraction.java:221)
- Processing http://bob.example.com/
  [2013-06-02 07:04:17,030] INFO  9058[main] - org.apache.any23.extractor.SingleDocumentExtraction.run(SingleDocumentExtraction.java:221)
- Processing http://bob.example.com/
  [2013-06-02 07:04:17,042] INFO  9070[main] - org.apache.any23.extractor.SingleDocumentExtraction.run(SingleDocumentExtraction.java:221)
- Processing http://bob.example.com/
  [2013-06-02 07:04:17,050] INFO  9078[main] - org.apache.any23.extractor.SingleDocumentExtraction.run(SingleDocumentExtraction.java:221)
- Processing http://bob.example.com/
  [2013-06-02 07:04:17,062] INFO  9090[main] - org.apache.any23.extractor.SingleDocumentExtraction.run(SingleDocumentExtraction.java:221)
- Processing http://bob.example.com/
  [2013-06-02 07:04:17,075] INFO  9103[main] - org.apache.any23.extractor.SingleDocumentExtraction.run(SingleDocumentExtraction.java:221)
- Processing http://bob.example.com/
  [2013-06-02 07:04:17,083] INFO  9111[main] - org.apache.any23.extractor.SingleDocumentExtraction.run(SingleDocumentExtraction.java:221)
- Processing http://bob.example.com/
  Tests run: 26, Failures: 2, Errors: 0, Skipped: 0, Time elapsed: 0.67 sec <<< FAILURE!
Running org.apache.any23.extractor.html.HeadLinkExtractorTest
[2013-06-02 07:04:17,091] INFO  9119[main] - org.apache.any23.extractor.SingleDocumentExtraction.run(SingleDocumentExtraction.java:221)
- Processing http://bob.example.com/
  Tests run: 1, Failures: 0, Errors: 0, Skipped: 0, Time elapsed: 0.013 sec
Running org.apache.any23.extractor.html.TurtleHTMLExtractorTest
[2013-06-02 07:04:17,105] INFO  9133[main] - org.apache.any23.extractor.SingleDocumentExtraction.run(SingleDocumentExtraction.java:221)
- Processing http://bob.example.com/
  Tests run: 1, Failures: 0, Errors: 0, Skipped: 0, Time elapsed: 0.014 sec
Running org.apache.any23.extractor.html.HTMLDocumentTest
Tests run: 1, Failures: 0, Errors: 0, Skipped: 0, Time elapsed: 0.001 sec
Running org.apache.any23.extractor.html.HTMLMetaExtractorTest
[2013-06-02 07:04:17,123] INFO  9151[main] - org.apache.any23.extractor.SingleDocumentExtraction.run(SingleDocumentExtraction.java:221)
- Processing http://bob.example.com/
  [2013-06-02 07:04:17,136] INFO  9164[main] - org.apache.any23.extractor.SingleDocumentExtraction.run(SingleDocumentExtraction.java:221)
- Processing http://bob.example.com/
  Tests run: 2, Failures: 0, Errors: 0, Skipped: 0, Time elapsed: 0.022 sec
Running org.apache.any23.extractor.html.SpeciesExtractorTest
[2013-06-02 07:04:17,147] INFO  9175[main] - org.apache.any23.extractor.SingleDocumentExtraction.run(SingleDocumentExtraction.java:221)
- Processing http://bob.example.com/
  Tests run: 1, Failures: 0, Errors: 0, Skipped: 0, Time elapsed: 0.016 sec
Running org.apache.any23.extractor.html.SpanCloserInputStreamTest
Tests run: 7, Failures: 0, Errors: 0, Skipped: 0, Time elapsed: 0.02 sec
Running org.apache.any23.extractor.html.RDFMergerTest
Tests run: 10, Failures: 0, Errors: 0, Skipped: 0, Time elapsed: 0.136 sec
Running org.apache.any23.extractor.html.LicenseExtractorTest
[2013-06-02 07:04:17,322] INFO  9350[main] - org.apache.any23.extractor.SingleDocumentExtraction.run(SingleDocumentExtraction.java:221)
- Processing http://bob.example.com/
  [2013-06-02 07:04:17,329] INFO  9357[main] - org.apache.any23.extractor.SingleDocumentExtraction.run(SingleDocumentExtraction.java:221)
- Processing http://bob.example.com/
  [2013-06-02 07:04:17,336] INFO  9364[main] - org.apache.any23.extractor.SingleDocumentExtraction.run(SingleDocumentExtraction.java:221)
- Processing http://bob.example.com/
  [2013-06-02 07:04:17,342] INFO  9370[main] - org.apache.any23.extractor.SingleDocumentExtraction.run(SingleDocumentExtraction.java:221)
- Processing http://bob.example.com/
  [2013-06-02 07:04:17,349] INFO  9377[main] - org.apache.any23.extractor.SingleDocumentExtraction.run(SingleDocumentExtraction.java:221)
- Processing http://bob.example.com/
  [2013-06-02 07:04:17,355] INFO  9383[main] - org.apache.any23.extractor.SingleDocumentExtraction.run(SingleDocumentExtraction.java:221)
- Processing http://bob.example.com/
  Tests run: 6, Failures: 0, Errors: 0, Skipped: 0, Time elapsed: 0.039 sec
Running org.apache.any23.extractor.html.XFNExtractorTest
[2013-06-02 07:04:17,363] INFO  9391[main] - org.apache.any23.extractor.SingleDocumentExtraction.run(SingleDocumentExtraction.java:221)
- Processing http://bob.example.com/
  [2013-06-02 07:04:17,369] INFO  9397[main] - org.apache.any23.extractor.SingleDocumentExtraction.run(SingleDocumentExtraction.java:221)
- Processing http://bob.example.com/
  [2013-06-02 07:04:17,375] INFO  9403[main] - org.apache.any23.extractor.SingleDocumentExtraction.run(SingleDocumentExtraction.java:221)
- Processing http://bob.example.com/
  [2013-06-02 07:04:17,380] INFO  9408[main] - org.apache.any23.extractor.SingleDocumentExtraction.run(SingleDocumentExtraction.java:221)
- Processing http://bob.example.com/
  [2013-06-02 07:04:17,386] INFO  9414[main] - org.apache.any23.extractor.SingleDocumentExtraction.run(SingleDocumentExtraction.java:221)
- Processing http://bob.example.com/
  [2013-06-02 07:04:17,393] INFO  9421[main] - org.apache.any23.extractor.SingleDocumentExtraction.run(SingleDocumentExtraction.java:221)
- Processing http://bob.example.com/
  [2013-06-02 07:04:17,399] INFO  9427[main] - org.apache.any23.extractor.SingleDocumentExtraction.run(SingleDocumentExtraction.java:221)
- Processing http://bob.example.com/
  [2013-06-02 07:04:17,406] INFO  9434[main] - org.apache.any23.extractor.SingleDocumentExtraction.run(SingleDocumentExtraction.java:221)
- Processing http://bob.example.com/
  [2013-06-02 07:04:17,413] INFO  9441[main] - org.apache.any23.extractor.SingleDocumentExtraction.run(SingleDocumentExtraction.java:221)
- Processing http://bob.example.com/
  [2013-06-02 07:04:17,420] INFO  9448[main] - org.apache.any23.extractor.SingleDocumentExtraction.run(SingleDocumentExtraction.java:221)
- Processing http://bob.example.com/
  [2013-06-02 07:04:17,428] INFO  9456[main] - org.apache.any23.extractor.SingleDocumentExtraction.run(SingleDocumentExtraction.java:221)
- Processing http://bob.example.com/
  [2013-06-02 07:04:17,435] INFO  9463[main] - org.apache.any23.extractor.SingleDocumentExtraction.run(SingleDocumentExtraction.java:221)
- Processing http://bob.example.com/
  [2013-06-02 07:04:17,440] INFO  9468[main] - org.apache.any23.extractor.SingleDocumentExtraction.run(SingleDocumentExtraction.java:221)
- Processing http://bob.example.com/
  [2013-06-02 07:04:17,446] INFO  9474[main] - org.apache.any23.extractor.SingleDocumentExtraction.run(SingleDocumentExtraction.java:221)
- Processing http://bob.example.com/
  [2013-06-02 07:04:17,453] INFO  9481[main] - org.apache.any23.extractor.SingleDocumentExtraction.run(SingleDocumentExtraction.java:221)
- Processing http://bob.example.com/
  Tests run: 15, Failures: 0, Errors: 0, Skipped: 0, Time elapsed: 0.092 sec
Running org.apache.any23.extractor.html.HCardExtractorTest
[2013-06-02 07:04:17,462] INFO  9490[main] - org.apache.any23.extractor.SingleDocumentExtraction.run(SingleDocumentExtraction.java:221)
- Processing http://bob.example.com/
  [2013-06-02 07:04:17,534] INFO  9562[main] - org.apache.any23.extractor.SingleDocumentExtraction.run(SingleDocumentExtraction.java:221)
- Processing http://bob.example.com/
  [2013-06-02 07:04:17,586] INFO  9614[main] - org.apache.any23.extractor.SingleDocumentExtraction.run(SingleDocumentExtraction.java:221)
- Processing http://bob.example.com/
  [2013-06-02 07:04:17,675] INFO  9703[main] - org.apache.any23.extractor.SingleDocumentExtraction.run(SingleDocumentExtraction.java:221)
- Processing http://bob.example.com/
  [2013-06-02 07:04:17,685] INFO  9713[main] - org.apache.any23.extractor.SingleDocumentExtraction.run(SingleDocumentExtraction.java:221)
- Processing http://bob.example.com/
  [2013-06-02 07:04:17,693] INFO  9721[main] - org.apache.any23.extractor.SingleDocumentExtraction.run(SingleDocumentExtraction.java:221)
- Processing http://bob.example.com/
  [2013-06-02 07:04:17,708] INFO  9736[main] - org.apache.any23.extractor.SingleDocumentExtraction.run(SingleDocumentExtraction.java:221)
- Processing http://bob.example.com/
  [2013-06-02 07:04:17,718] INFO  9746[main] - org.apache.any23.extractor.SingleDocumentExtraction.run(SingleDocumentExtraction.java:221)
- Processing http://bob.example.com/
  [2013-06-02 07:04:17,725] INFO  9753[main] - org.apache.any23.extractor.SingleDocumentExtraction.run(SingleDocumentExtraction.java:221)
- Processing http://bob.example.com/
  [2013-06-02 07:04:18,100] INFO 10128[main] - org.apache.any23.extractor.SingleDocumentExtraction.run(SingleDocumentExtraction.java:221)
- Processing http://bob.example.com/
  [2013-06-02 07:04:18,111] INFO 10139[main] - org.apache.any23.extractor.SingleDocumentExtraction.run(SingleDocumentExtraction.java:221)
- Processing http://bob.example.com/
  [2013-06-02 07:04:18,134] INFO 10162[main] - org.apache.any23.extractor.SingleDocumentExtraction.run(SingleDocumentExtraction.java:221)
- Processing http://bob.example.com/
  [2013-06-02 07:04:18,148] INFO 10176[main] - org.apache.any23.extractor.SingleDocumentExtraction.run(SingleDocumentExtraction.java:221)
- Processing http://bob.example.com/
  [2013-06-02 07:04:18,162] INFO 10190[main] - org.apache.any23.extractor.SingleDocumentExtraction.run(SingleDocumentExtraction.java:221)
- Processing http://bob.example.com/
  [2013-06-02 07:04:18,183] INFO 10211[main] - org.apache.any23.extractor.SingleDocumentExtraction.run(SingleDocumentExtraction.java:221)
- Processing http://bob.example.com/
  [2013-06-02 07:04:18,197] INFO 10225[main] - org.apache.any23.extractor.SingleDocumentExtraction.run(SingleDocumentExtraction.java:221)
- Processing http://bob.example.com/
  [2013-06-02 07:04:18,211] INFO 10239[main] - org.apache.any23.extractor.SingleDocumentExtraction.run(SingleDocumentExtraction.java:221)
- Processing http://bob.example.com/
  [2013-06-02 07:04:18,221] INFO 10249[main] - org.apache.any23.extractor.SingleDocumentExtraction.run(SingleDocumentExtraction.java:221)
- Processing http://bob.example.com/
  [2013-06-02 07:04:18,239] INFO 10267[main] - org.apache.any23.extractor.SingleDocumentExtraction.run(SingleDocumentExtraction.java:221)
- Processing http://bob.example.com/
  [2013-06-02 07:04:18,246] INFO 10274[main] - org.apache.any23.extractor.SingleDocumentExtraction.run(SingleDocumentExtraction.java:221)
- Processing http://bob.example.com/
  [2013-06-02 07:04:18,253] INFO 10281[main] - org.apache.any23.extractor.SingleDocumentExtraction.run(SingleDocumentExtraction.java:221)
- Processing http://bob.example.com/
  [2013-06-02 07:04:18,259] INFO 10287[main] - org.apache.any23.extractor.SingleDocumentExtraction.run(SingleDocumentExtraction.java:221)
- Processing http://bob.example.com/
  [2013-06-02 07:04:18,266] INFO 10294[main] - org.apache.any23.extractor.SingleDocumentExtraction.run(SingleDocumentExtraction.java:221)
- Processing http://bob.example.com/
  [2013-06-02 07:04:18,273] INFO 10301[main] - org.apache.any23.extractor.SingleDocumentExtraction.run(SingleDocumentExtraction.java:221)
- Processing http://bob.example.com/
  [2013-06-02 07:04:18,280] INFO 10308[main] - org.apache.any23.extractor.SingleDocumentExtraction.run(SingleDocumentExtraction.java:221)
- Processing http://bob.example.com/
  [2013-06-02 07:04:18,287] INFO 10315[main] - org.apache.any23.extractor.SingleDocumentExtraction.run(SingleDocumentExtraction.java:221)
- Processing http://bob.example.com/
  [2013-06-02 07:04:18,294] INFO 10322[main] - org.apache.any23.extractor.SingleDocumentExtraction.run(SingleDocumentExtraction.java:221)
- Processing http://bob.example.com/
  [2013-06-02 07:04:18,302] INFO 10330[main] - org.apache.any23.extractor.SingleDocumentExtraction.run(SingleDocumentExtraction.java:221)
- Processing http://bob.example.com/
  [2013-06-02 07:04:18,310] INFO 10338[main] - org.apache.any23.extractor.SingleDocumentExtraction.run(SingleDocumentExtraction.java:221)
- Processing http://bob.example.com/
  [2013-06-02 07:04:18,319] INFO 10347[main] - org.apache.any23.extractor.SingleDocumentExtraction.run(SingleDocumentExtraction.java:221)
- Processing http://bob.example.com/
  [2013-06-02 07:04:18,326] INFO 10354[main] - org.apache.any23.extractor.SingleDocumentExtraction.run(SingleDocumentExtraction.java:221)
- Processing http://bob.example.com/
  [2013-06-02 07:04:18,335] INFO 10363[main] - org.apache.any23.extractor.SingleDocumentExtraction.run(SingleDocumentExtraction.java:221)
- Processing http://bob.example.com/
  [2013-06-02 07:04:18,342] INFO 10370[main] - org.apache.any23.extractor.SingleDocumentExtraction.run(SingleDocumentExtraction.java:221)
- Processing http://bob.example.com/
  [2013-06-02 07:04:18,349] INFO 10377[main] - org.apache.any23.extractor.SingleDocumentExtraction.run(SingleDocumentExtraction.java:221)
- Processing http://bob.example.com/
  [2013-06-02 07:04:18,357] INFO 10385[main] - org.apache.any23.extractor.SingleDocumentExtraction.run(SingleDocumentExtraction.java:221)
- Processing http://bob.example.com/
  [2013-06-02 07:04:18,363] INFO 10391[main] - org.apache.any23.extractor.SingleDocumentExtraction.run(SingleDocumentExtraction.java:221)
- Processing http://bob.example.com/
  [2013-06-02 07:04:18,370] INFO 10398[main] - org.apache.any23.extractor.SingleDocumentExtraction.run(SingleDocumentExtraction.java:221)
- Processing http://bob.example.com/
  [2013-06-02 07:04:18,376] INFO 10404[main] - org.apache.any23.extractor.SingleDocumentExtraction.run(SingleDocumentExtraction.java:221)
- Processing http://bob.example.com/
  [2013-06-02 07:04:18,391] INFO 10419[main] - org.apache.any23.extractor.SingleDocumentExtraction.run(SingleDocumentExtraction.java:221)
- Processing http://bob.example.com/
  [2013-06-02 07:04:18,399] INFO 10427[main] - org.apache.any23.extractor.SingleDocumentExtraction.run(SingleDocumentExtraction.java:221)
- Processing http://bob.example.com/
  [2013-06-02 07:04:18,411] INFO 10439[main] - org.apache.any23.extractor.SingleDocumentExtraction.run(SingleDocumentExtraction.java:221)
- Processing http://bob.example.com/
  [2013-06-02 07:04:18,421] INFO 10449[main] - org.apache.any23.extractor.SingleDocumentExtraction.run(SingleDocumentExtraction.java:221)
- Processing http://bob.example.com/
  [2013-06-02 07:04:18,432] INFO 10460[main] - org.apache.any23.extractor.SingleDocumentExtraction.run(SingleDocumentExtraction.java:221)
- Processing http://bob.example.com/
  [2013-06-02 07:04:18,500] INFO 10528[main] - org.apache.any23.extractor.SingleDocumentExtraction.run(SingleDocumentExtraction.java:221)
- Processing http://bob.example.com/
  Tests run: 46, Failures: 0, Errors: 0, Skipped: 2, Time elapsed: 1.248 sec
Running org.apache.any23.extractor.html.HResumeExtractorTest
[2013-06-02 07:04:18,708] INFO 10736[main] - org.apache.any23.extractor.SingleDocumentExtraction.run(SingleDocumentExtraction.java:221)
- Processing http://bob.example.com/
  [2013-06-02 07:04:18,714] INFO 10742[main] - org.apache.any23.extractor.SingleDocumentExtraction.run(SingleDocumentExtraction.java:221)
- Processing http://bob.example.com/
  [2013-06-02 07:04:18,745] INFO 10773[main] - org.apache.any23.extractor.SingleDocumentExtraction.run(SingleDocumentExtraction.java:221)
- Processing http://bob.example.com/
  [2013-06-02 07:04:18,786] INFO 10814[main] - org.apache.any23.extractor.SingleDocumentExtraction.run(SingleDocumentExtraction.java:221)
- Processing http://bob.example.com/
  Tests run: 4, Failures: 0, Errors: 0, Skipped: 0, Time elapsed: 0.106 sec
Running org.apache.any23.extractor.html.TagSoupParserTest
Tests run: 4, Failures: 0, Errors: 0, Skipped: 0, Time elapsed: 0.016 sec
Running org.apache.any23.extractor.ExtractionResultImplTest
Tests run: 1, Failures: 0, Errors: 0, Skipped: 0, Time elapsed: 0.002 sec
Running org.apache.any23.http.AcceptHeaderBuilderTest
Tests run: 12, Failures: 0, Errors: 0, Skipped: 0, Time elapsed: 0.002 sec
Running org.apache.any23.writer.WriterRegistryTest
Tests run: 7, Failures: 0, Errors: 0, Skipped: 0, Time elapsed: 0.004 sec
Running org.apache.any23.writer.JSONWriterTest
Tests run: 1, Failures: 0, Errors: 0, Skipped: 0, Time elapsed: 0 sec

Results :

Failed tests:   testKelkoo(org.apache.any23.extractor.html.HListingExtractorTest): Assertion
failed! Extracted triples:
  testKelkooFull(org.apache.any23.extractor.html.HListingExtractorTest): Assertion failed!
Extracted triples:

Tests run: 391, Failures: 2, Errors: 0, Skipped: 7

[ERROR] There are test failures.

Please refer to <https://builds.apache.org/job/Any23-trunk/ws/core/target/surefire-reports>
for the individual test results.
[JENKINS] Recording test results
[INFO] [jar:jar {execution: default-jar}]
[INFO] Building jar: <https://builds.apache.org/job/Any23-trunk/ws/core/target/apache-any23-core-0.8.0-SNAPSHOT.jar>
[INFO] [appassembler:assemble {execution: default}]
[INFO] Installing artifact <https://builds.apache.org/job/Any23-trunk/ws/api/target/apache-any23-api-0.8.0-SNAPSHOT.jar>
to <https://builds.apache.org/job/Any23-trunk/ws/core/target/appassembler/lib/apache-any23-api-0.8.0-SNAPSHOT.jar>
[INFO] Installing artifact /home/jenkins/jenkins-slave/maven-repositories/1/org/slf4j/slf4j-api/1.6.6/slf4j-api-1.6.6.jar
to <https://builds.apache.org/job/Any23-trunk/ws/core/target/appassembler/lib/slf4j-api-1.6.6.jar>
[INFO] Installing artifact /home/jenkins/jenkins-slave/maven-repositories/1/org/openrdf/sesame/sesame-model/2.6.9/sesame-model-2.6.9.jar
to <https://builds.apache.org/job/Any23-trunk/ws/core/target/appassembler/lib/sesame-model-2.6.9.jar>
[INFO] Installing artifact /home/jenkins/jenkins-slave/maven-repositories/1/org/openrdf/sesame/sesame-util/2.6.9/sesame-util-2.6.9.jar
to <https://builds.apache.org/job/Any23-trunk/ws/core/target/appassembler/lib/sesame-util-2.6.9.jar>
[INFO] Installing artifact /home/jenkins/jenkins-slave/maven-repositories/1/org/openrdf/sesame/sesame-rio-api/2.6.9/sesame-rio-api-2.6.9.jar
to <https://builds.apache.org/job/Any23-trunk/ws/core/target/appassembler/lib/sesame-rio-api-2.6.9.jar>
[INFO] Installing artifact <https://builds.apache.org/job/Any23-trunk/ws/csvutils/target/apache-any23-csvutils-0.8.0-SNAPSHOT.jar>
to <https://builds.apache.org/job/Any23-trunk/ws/core/target/appassembler/lib/apache-any23-csvutils-0.8.0-SNAPSHOT.jar>
[INFO] Installing artifact /home/jenkins/jenkins-slave/maven-repositories/1/org/apache/commons/commons-csv/1.0-SNAPSHOT-rev1148315/commons-csv-1.0-SNAPSHOT-rev1148315.jar
to <https://builds.apache.org/job/Any23-trunk/ws/core/target/appassembler/lib/commons-csv-1.0-SNAPSHOT-rev1148315.jar>
[INFO] Installing artifact <https://builds.apache.org/job/Any23-trunk/ws/mime/target/apache-any23-mime-0.8.0-SNAPSHOT.jar>
to <https://builds.apache.org/job/Any23-trunk/ws/core/target/appassembler/lib/apache-any23-mime-0.8.0-SNAPSHOT.jar>
[INFO] Installing artifact /home/jenkins/jenkins-slave/maven-repositories/1/commons-io/commons-io/2.4/commons-io-2.4.jar
to <https://builds.apache.org/job/Any23-trunk/ws/core/target/appassembler/lib/commons-io-2.4.jar>
[INFO] Installing artifact /home/jenkins/jenkins-slave/maven-repositories/1/org/apache/tika/tika-core/1.2/tika-core-1.2.jar
to <https://builds.apache.org/job/Any23-trunk/ws/core/target/appassembler/lib/tika-core-1.2.jar>
[INFO] Installing artifact /home/jenkins/jenkins-slave/maven-repositories/1/org/apache/tika/tika-parsers/1.2/tika-parsers-1.2.jar
to <https://builds.apache.org/job/Any23-trunk/ws/core/target/appassembler/lib/tika-parsers-1.2.jar>
[INFO] Installing artifact /home/jenkins/jenkins-slave/maven-repositories/1/org/gagravarr/vorbis-java-tika/0.1/vorbis-java-tika-0.1.jar
to <https://builds.apache.org/job/Any23-trunk/ws/core/target/appassembler/lib/vorbis-java-tika-0.1.jar>
[INFO] Installing artifact /home/jenkins/jenkins-slave/maven-repositories/1/org/gagravarr/vorbis-java-core/0.1/vorbis-java-core-0.1-tests.jar
to <https://builds.apache.org/job/Any23-trunk/ws/core/target/appassembler/lib/vorbis-java-core-0.1-tests.jar>
[INFO] Installing artifact /home/jenkins/jenkins-slave/maven-repositories/1/edu/ucar/netcdf/4.2-min/netcdf-4.2-min.jar
to <https://builds.apache.org/job/Any23-trunk/ws/core/target/appassembler/lib/netcdf-4.2-min.jar>
[INFO] Installing artifact /home/jenkins/jenkins-slave/maven-repositories/1/org/apache/james/apache-mime4j-core/0.7.2/apache-mime4j-core-0.7.2.jar
to <https://builds.apache.org/job/Any23-trunk/ws/core/target/appassembler/lib/apache-mime4j-core-0.7.2.jar>
[INFO] Installing artifact /home/jenkins/jenkins-slave/maven-repositories/1/org/apache/james/apache-mime4j-dom/0.7.2/apache-mime4j-dom-0.7.2.jar
to <https://builds.apache.org/job/Any23-trunk/ws/core/target/appassembler/lib/apache-mime4j-dom-0.7.2.jar>
[INFO] Installing artifact /home/jenkins/jenkins-slave/maven-repositories/1/org/apache/commons/commons-compress/1.4.1/commons-compress-1.4.1.jar
to <https://builds.apache.org/job/Any23-trunk/ws/core/target/appassembler/lib/commons-compress-1.4.1.jar>
[INFO] Installing artifact /home/jenkins/jenkins-slave/maven-repositories/1/org/tukaani/xz/1.0/xz-1.0.jar
to <https://builds.apache.org/job/Any23-trunk/ws/core/target/appassembler/lib/xz-1.0.jar>
[INFO] Installing artifact /home/jenkins/jenkins-slave/maven-repositories/1/commons-codec/commons-codec/1.6/commons-codec-1.6.jar
to <https://builds.apache.org/job/Any23-trunk/ws/core/target/appassembler/lib/commons-codec-1.6.jar>
[INFO] Installing artifact /home/jenkins/jenkins-slave/maven-repositories/1/org/apache/pdfbox/pdfbox/1.7.0/pdfbox-1.7.0.jar
to <https://builds.apache.org/job/Any23-trunk/ws/core/target/appassembler/lib/pdfbox-1.7.0.jar>
[INFO] Installing artifact /home/jenkins/jenkins-slave/maven-repositories/1/org/apache/pdfbox/fontbox/1.7.0/fontbox-1.7.0.jar
to <https://builds.apache.org/job/Any23-trunk/ws/core/target/appassembler/lib/fontbox-1.7.0.jar>
[INFO] Installing artifact /home/jenkins/jenkins-slave/maven-repositories/1/org/apache/pdfbox/jempbox/1.7.0/jempbox-1.7.0.jar
to <https://builds.apache.org/job/Any23-trunk/ws/core/target/appassembler/lib/jempbox-1.7.0.jar>
[INFO] Installing artifact /home/jenkins/jenkins-slave/maven-repositories/1/commons-logging/commons-logging/1.0.4/commons-logging-1.0.4.jar
to <https://builds.apache.org/job/Any23-trunk/ws/core/target/appassembler/lib/commons-logging-1.0.4.jar>
[INFO] Installing artifact /home/jenkins/jenkins-slave/maven-repositories/1/org/bouncycastle/bcmail-jdk15/1.45/bcmail-jdk15-1.45.jar
to <https://builds.apache.org/job/Any23-trunk/ws/core/target/appassembler/lib/bcmail-jdk15-1.45.jar>
[INFO] Installing artifact /home/jenkins/jenkins-slave/maven-repositories/1/org/bouncycastle/bcprov-jdk15/1.45/bcprov-jdk15-1.45.jar
to <https://builds.apache.org/job/Any23-trunk/ws/core/target/appassembler/lib/bcprov-jdk15-1.45.jar>
[INFO] Installing artifact /home/jenkins/jenkins-slave/maven-repositories/1/org/apache/poi/poi/3.8/poi-3.8.jar
to <https://builds.apache.org/job/Any23-trunk/ws/core/target/appassembler/lib/poi-3.8.jar>
[INFO] Installing artifact /home/jenkins/jenkins-slave/maven-repositories/1/org/apache/poi/poi-scratchpad/3.8/poi-scratchpad-3.8.jar
to <https://builds.apache.org/job/Any23-trunk/ws/core/target/appassembler/lib/poi-scratchpad-3.8.jar>
[INFO] Installing artifact /home/jenkins/jenkins-slave/maven-repositories/1/org/apache/poi/poi-ooxml/3.8/poi-ooxml-3.8.jar
to <https://builds.apache.org/job/Any23-trunk/ws/core/target/appassembler/lib/poi-ooxml-3.8.jar>
[INFO] Installing artifact /home/jenkins/jenkins-slave/maven-repositories/1/org/apache/poi/poi-ooxml-schemas/3.8/poi-ooxml-schemas-3.8.jar
to <https://builds.apache.org/job/Any23-trunk/ws/core/target/appassembler/lib/poi-ooxml-schemas-3.8.jar>
[INFO] Installing artifact /home/jenkins/jenkins-slave/maven-repositories/1/org/apache/xmlbeans/xmlbeans/2.3.0/xmlbeans-2.3.0.jar
to <https://builds.apache.org/job/Any23-trunk/ws/core/target/appassembler/lib/xmlbeans-2.3.0.jar>
[INFO] Installing artifact /home/jenkins/jenkins-slave/maven-repositories/1/dom4j/dom4j/1.6.1/dom4j-1.6.1.jar
to <https://builds.apache.org/job/Any23-trunk/ws/core/target/appassembler/lib/dom4j-1.6.1.jar>
[INFO] Installing artifact /home/jenkins/jenkins-slave/maven-repositories/1/org/apache/geronimo/specs/geronimo-stax-api_1.0_spec/1.0.1/geronimo-stax-api_1.0_spec-1.0.1.jar
to <https://builds.apache.org/job/Any23-trunk/ws/core/target/appassembler/lib/geronimo-stax-api_1.0_spec-1.0.1.jar>
[INFO] Installing artifact /home/jenkins/jenkins-slave/maven-repositories/1/org/ccil/cowan/tagsoup/tagsoup/1.2.1/tagsoup-1.2.1.jar
to <https://builds.apache.org/job/Any23-trunk/ws/core/target/appassembler/lib/tagsoup-1.2.1.jar>
[INFO] Installing artifact /home/jenkins/jenkins-slave/maven-repositories/1/asm/asm/3.1/asm-3.1.jar
to <https://builds.apache.org/job/Any23-trunk/ws/core/target/appassembler/lib/asm-3.1.jar>
[INFO] Installing artifact /home/jenkins/jenkins-slave/maven-repositories/1/com/googlecode/mp4parser/isoparser/1.0-RC-1/isoparser-1.0-RC-1.jar
to <https://builds.apache.org/job/Any23-trunk/ws/core/target/appassembler/lib/isoparser-1.0-RC-1.jar>
[INFO] Installing artifact /home/jenkins/jenkins-slave/maven-repositories/1/org/aspectj/aspectjrt/1.6.11/aspectjrt-1.6.11.jar
to <https://builds.apache.org/job/Any23-trunk/ws/core/target/appassembler/lib/aspectjrt-1.6.11.jar>
[INFO] Installing artifact /home/jenkins/jenkins-slave/maven-repositories/1/com/drewnoakes/metadata-extractor/2.4.0-beta-1/metadata-extractor-2.4.0-beta-1.jar
to <https://builds.apache.org/job/Any23-trunk/ws/core/target/appassembler/lib/metadata-extractor-2.4.0-beta-1.jar>
[INFO] Installing artifact /home/jenkins/jenkins-slave/maven-repositories/1/de/l3s/boilerpipe/boilerpipe/1.1.0/boilerpipe-1.1.0.jar
to <https://builds.apache.org/job/Any23-trunk/ws/core/target/appassembler/lib/boilerpipe-1.1.0.jar>
[INFO] Installing artifact /home/jenkins/jenkins-slave/maven-repositories/1/rome/rome/0.9/rome-0.9.jar
to <https://builds.apache.org/job/Any23-trunk/ws/core/target/appassembler/lib/rome-0.9.jar>
[INFO] Installing artifact /home/jenkins/jenkins-slave/maven-repositories/1/jdom/jdom/1.0/jdom-1.0.jar
to <https://builds.apache.org/job/Any23-trunk/ws/core/target/appassembler/lib/jdom-1.0.jar>
[INFO] Installing artifact /home/jenkins/jenkins-slave/maven-repositories/1/org/gagravarr/vorbis-java-core/0.1/vorbis-java-core-0.1.jar
to <https://builds.apache.org/job/Any23-trunk/ws/core/target/appassembler/lib/vorbis-java-core-0.1.jar>
[INFO] Installing artifact /home/jenkins/jenkins-slave/maven-repositories/1/com/googlecode/juniversalchardet/juniversalchardet/1.0.3/juniversalchardet-1.0.3.jar
to <https://builds.apache.org/job/Any23-trunk/ws/core/target/appassembler/lib/juniversalchardet-1.0.3.jar>
[INFO] Installing artifact /home/jenkins/jenkins-slave/maven-repositories/1/org/openrdf/sesame/sesame-rio-turtle/2.6.9/sesame-rio-turtle-2.6.9.jar
to <https://builds.apache.org/job/Any23-trunk/ws/core/target/appassembler/lib/sesame-rio-turtle-2.6.9.jar>
[INFO] Installing artifact /home/jenkins/jenkins-slave/maven-repositories/1/org/openrdf/sesame/sesame-rio-ntriples/2.6.9/sesame-rio-ntriples-2.6.9.jar
to <https://builds.apache.org/job/Any23-trunk/ws/core/target/appassembler/lib/sesame-rio-ntriples-2.6.9.jar>
[INFO] Installing artifact /home/jenkins/jenkins-slave/maven-repositories/1/org/openrdf/sesame/sesame-rio-n3/2.6.9/sesame-rio-n3-2.6.9.jar
to <https://builds.apache.org/job/Any23-trunk/ws/core/target/appassembler/lib/sesame-rio-n3-2.6.9.jar>
[INFO] Installing artifact <https://builds.apache.org/job/Any23-trunk/ws/encoding/target/apache-any23-encoding-0.8.0-SNAPSHOT.jar>
to <https://builds.apache.org/job/Any23-trunk/ws/core/target/appassembler/lib/apache-any23-encoding-0.8.0-SNAPSHOT.jar>
[INFO] Installing artifact /home/jenkins/jenkins-slave/maven-repositories/1/commons-lang/commons-lang/2.4/commons-lang-2.4.jar
to <https://builds.apache.org/job/Any23-trunk/ws/core/target/appassembler/lib/commons-lang-2.4.jar>
[INFO] Installing artifact /home/jenkins/jenkins-slave/maven-repositories/1/commons-httpclient/commons-httpclient/3.1/commons-httpclient-3.1.jar
to <https://builds.apache.org/job/Any23-trunk/ws/core/target/appassembler/lib/commons-httpclient-3.1.jar>
[INFO] Installing artifact /home/jenkins/jenkins-slave/maven-repositories/1/net/sourceforge/nekohtml/nekohtml/1.9.15/nekohtml-1.9.15.jar
to <https://builds.apache.org/job/Any23-trunk/ws/core/target/appassembler/lib/nekohtml-1.9.15.jar>
[INFO] Installing artifact /home/jenkins/jenkins-slave/maven-repositories/1/xerces/xercesImpl/2.9.1/xercesImpl-2.9.1.jar
to <https://builds.apache.org/job/Any23-trunk/ws/core/target/appassembler/lib/xercesImpl-2.9.1.jar>
[INFO] Installing artifact /home/jenkins/jenkins-slave/maven-repositories/1/xml-apis/xml-apis/1.3.04/xml-apis-1.3.04.jar
to <https://builds.apache.org/job/Any23-trunk/ws/core/target/appassembler/lib/xml-apis-1.3.04.jar>
[INFO] Installing artifact /home/jenkins/jenkins-slave/maven-repositories/1/com/beust/jcommander/1.23/jcommander-1.23.jar
to <https://builds.apache.org/job/Any23-trunk/ws/core/target/appassembler/lib/jcommander-1.23.jar>
[INFO] Installing artifact /home/jenkins/jenkins-slave/maven-repositories/1/org/openrdf/sesame/sesame-rio-rdfxml/2.6.9/sesame-rio-rdfxml-2.6.9.jar
to <https://builds.apache.org/job/Any23-trunk/ws/core/target/appassembler/lib/sesame-rio-rdfxml-2.6.9.jar>
[INFO] Installing artifact /home/jenkins/jenkins-slave/maven-repositories/1/org/openrdf/sesame/sesame-rio-trix/2.6.9/sesame-rio-trix-2.6.9.jar
to <https://builds.apache.org/job/Any23-trunk/ws/core/target/appassembler/lib/sesame-rio-trix-2.6.9.jar>
[INFO] Installing artifact /home/jenkins/jenkins-slave/maven-repositories/1/org/openrdf/sesame/sesame-repository-sail/2.6.9/sesame-repository-sail-2.6.9.jar
to <https://builds.apache.org/job/Any23-trunk/ws/core/target/appassembler/lib/sesame-repository-sail-2.6.9.jar>
[INFO] Installing artifact /home/jenkins/jenkins-slave/maven-repositories/1/org/openrdf/sesame/sesame-repository-api/2.6.9/sesame-repository-api-2.6.9.jar
to <https://builds.apache.org/job/Any23-trunk/ws/core/target/appassembler/lib/sesame-repository-api-2.6.9.jar>
[INFO] Installing artifact /home/jenkins/jenkins-slave/maven-repositories/1/org/openrdf/sesame/sesame-query/2.6.9/sesame-query-2.6.9.jar
to <https://builds.apache.org/job/Any23-trunk/ws/core/target/appassembler/lib/sesame-query-2.6.9.jar>
[INFO] Installing artifact /home/jenkins/jenkins-slave/maven-repositories/1/org/openrdf/sesame/sesame-sail-api/2.6.9/sesame-sail-api-2.6.9.jar
to <https://builds.apache.org/job/Any23-trunk/ws/core/target/appassembler/lib/sesame-sail-api-2.6.9.jar>
[INFO] Installing artifact /home/jenkins/jenkins-slave/maven-repositories/1/org/openrdf/sesame/sesame-queryalgebra-model/2.6.9/sesame-queryalgebra-model-2.6.9.jar
to <https://builds.apache.org/job/Any23-trunk/ws/core/target/appassembler/lib/sesame-queryalgebra-model-2.6.9.jar>
[INFO] Installing artifact /home/jenkins/jenkins-slave/maven-repositories/1/org/openrdf/sesame/sesame-queryparser-api/2.6.9/sesame-queryparser-api-2.6.9.jar
to <https://builds.apache.org/job/Any23-trunk/ws/core/target/appassembler/lib/sesame-queryparser-api-2.6.9.jar>
[INFO] Installing artifact /home/jenkins/jenkins-slave/maven-repositories/1/org/openrdf/sesame/sesame-sail-memory/2.6.9/sesame-sail-memory-2.6.9.jar
to <https://builds.apache.org/job/Any23-trunk/ws/core/target/appassembler/lib/sesame-sail-memory-2.6.9.jar>
[INFO] Installing artifact /home/jenkins/jenkins-slave/maven-repositories/1/org/openrdf/sesame/sesame-sail-inferencer/2.6.9/sesame-sail-inferencer-2.6.9.jar
to <https://builds.apache.org/job/Any23-trunk/ws/core/target/appassembler/lib/sesame-sail-inferencer-2.6.9.jar>
[INFO] Installing artifact /home/jenkins/jenkins-slave/maven-repositories/1/org/openrdf/sesame/sesame-queryparser-serql/2.6.9/sesame-queryparser-serql-2.6.9.jar
to <https://builds.apache.org/job/Any23-trunk/ws/core/target/appassembler/lib/sesame-queryparser-serql-2.6.9.jar>
[INFO] Installing artifact /home/jenkins/jenkins-slave/maven-repositories/1/org/openrdf/sesame/sesame-queryalgebra-evaluation/2.6.9/sesame-queryalgebra-evaluation-2.6.9.jar
to <https://builds.apache.org/job/Any23-trunk/ws/core/target/appassembler/lib/sesame-queryalgebra-evaluation-2.6.9.jar>
[INFO] Installing artifact /home/jenkins/jenkins-slave/maven-repositories/1/org/openrdf/sesame/sesame-repository-sparql/2.6.9/sesame-repository-sparql-2.6.9.jar
to <https://builds.apache.org/job/Any23-trunk/ws/core/target/appassembler/lib/sesame-repository-sparql-2.6.9.jar>
[INFO] Installing artifact /home/jenkins/jenkins-slave/maven-repositories/1/org/openrdf/sesame/sesame-http-client/2.6.9/sesame-http-client-2.6.9.jar
to <https://builds.apache.org/job/Any23-trunk/ws/core/target/appassembler/lib/sesame-http-client-2.6.9.jar>
[INFO] Installing artifact /home/jenkins/jenkins-slave/maven-repositories/1/org/openrdf/sesame/sesame-http-protocol/2.6.9/sesame-http-protocol-2.6.9.jar
to <https://builds.apache.org/job/Any23-trunk/ws/core/target/appassembler/lib/sesame-http-protocol-2.6.9.jar>
[INFO] Installing artifact /home/jenkins/jenkins-slave/maven-repositories/1/org/openrdf/sesame/sesame-queryresultio-api/2.6.9/sesame-queryresultio-api-2.6.9.jar
to <https://builds.apache.org/job/Any23-trunk/ws/core/target/appassembler/lib/sesame-queryresultio-api-2.6.9.jar>
[INFO] Installing artifact /home/jenkins/jenkins-slave/maven-repositories/1/org/openrdf/sesame/sesame-queryresultio-sparqlxml/2.6.9/sesame-queryresultio-sparqlxml-2.6.9.jar
to <https://builds.apache.org/job/Any23-trunk/ws/core/target/appassembler/lib/sesame-queryresultio-sparqlxml-2.6.9.jar>
[INFO] Installing artifact /home/jenkins/jenkins-slave/maven-repositories/1/info/aduna/commons/aduna-commons-xml/2.7.0/aduna-commons-xml-2.7.0.jar
to <https://builds.apache.org/job/Any23-trunk/ws/core/target/appassembler/lib/aduna-commons-xml-2.7.0.jar>
[INFO] Installing artifact /home/jenkins/jenkins-slave/maven-repositories/1/info/aduna/commons/aduna-commons-text/2.7.0/aduna-commons-text-2.7.0.jar
to <https://builds.apache.org/job/Any23-trunk/ws/core/target/appassembler/lib/aduna-commons-text-2.7.0.jar>
[INFO] Installing artifact /home/jenkins/jenkins-slave/maven-repositories/1/info/aduna/commons/aduna-commons-net/2.7.0/aduna-commons-net-2.7.0.jar
to <https://builds.apache.org/job/Any23-trunk/ws/core/target/appassembler/lib/aduna-commons-net-2.7.0.jar>
[INFO] Installing artifact /home/jenkins/jenkins-slave/maven-repositories/1/info/aduna/commons/aduna-commons-lang/2.9.0/aduna-commons-lang-2.9.0.jar
to <https://builds.apache.org/job/Any23-trunk/ws/core/target/appassembler/lib/aduna-commons-lang-2.9.0.jar>
[INFO] Installing artifact /home/jenkins/jenkins-slave/maven-repositories/1/info/aduna/commons/aduna-commons-iteration/2.10.0/aduna-commons-iteration-2.10.0.jar
to <https://builds.apache.org/job/Any23-trunk/ws/core/target/appassembler/lib/aduna-commons-iteration-2.10.0.jar>
[INFO] Installing artifact /home/jenkins/jenkins-slave/maven-repositories/1/info/aduna/commons/aduna-commons-concurrent/2.7.0/aduna-commons-concurrent-2.7.0.jar
to <https://builds.apache.org/job/Any23-trunk/ws/core/target/appassembler/lib/aduna-commons-concurrent-2.7.0.jar>
[INFO] Installing artifact /home/jenkins/jenkins-slave/maven-repositories/1/info/aduna/commons/aduna-commons-io/2.10.0/aduna-commons-io-2.10.0.jar
to <https://builds.apache.org/job/Any23-trunk/ws/core/target/appassembler/lib/aduna-commons-io-2.10.0.jar>
[INFO] Installing artifact /home/jenkins/jenkins-slave/maven-repositories/1/org/kohsuke/metainf-services/metainf-services/1.4/metainf-services-1.4.jar
to <https://builds.apache.org/job/Any23-trunk/ws/core/target/appassembler/lib/metainf-services-1.4.jar>
[INFO] Installing artifact <https://builds.apache.org/job/Any23-trunk/ws/core/target/apache-any23-core-0.8.0-SNAPSHOT.jar>
to <https://builds.apache.org/job/Any23-trunk/ws/core/target/appassembler/lib/apache-any23-core-0.8.0-SNAPSHOT.jar>
[INFO] [assembly:single {execution: assembly}]
[INFO] Reading assembly descriptor: <https://builds.apache.org/job/Any23-trunk/ws/core/src/main/assembly/bin.xml>
[JENKINS] Archiving <https://builds.apache.org/job/Any23-trunk/ws/core/pom.xml> to /home/hudson/hudson/jobs/Any23-trunk/modules/org.apache.any23$apache-any23-core/builds/2013-06-02_07-01-18/archive/org.apache.any23/apache-any23-core/0.8.0-SNAPSHOT/apache-any23-core-0.8.0-SNAPSHOT.pom
[JENKINS] Archiving <https://builds.apache.org/job/Any23-trunk/ws/core/target/apache-any23-core-0.8.0-SNAPSHOT.jar>
to /home/hudson/hudson/jobs/Any23-trunk/modules/org.apache.any23$apache-any23-core/builds/2013-06-02_07-01-18/archive/org.apache.any23/apache-any23-core/0.8.0-SNAPSHOT/apache-any23-core-0.8.0-SNAPSHOT.jar
[INFO] ------------------------------------------------------------------------
[ERROR] BUILD ERROR
[INFO] ------------------------------------------------------------------------
[INFO] Failed to create assembly: Error adding file to archive: <https://builds.apache.org/job/Any23-trunk/ws/core/./../DISCLAIMER.txt>
isn't a file.

[INFO] ------------------------------------------------------------------------
[INFO] For more information, run Maven with the -e switch
[INFO] ------------------------------------------------------------------------
[INFO] Total time: 2 minutes 27 seconds
[INFO] Finished at: Sun Jun 02 07:04:25 UTC 2013
[INFO] Final Memory: 66M/141M
[INFO] ------------------------------------------------------------------------
Waiting for Jenkins to finish collecting data
Maven failed with error.
channel stopped

Mime
View raw message