any23-dev mailing list archives

Site index · List index
Message view « Date » · « Thread »
Top « Date » · « Thread »
From Apache Jenkins Server <jenk...@builds.apache.org>
Subject Build failed in Jenkins: Any23-trunk #677
Date Sat, 01 Jun 2013 12:26:04 GMT
See <https://builds.apache.org/job/Any23-trunk/677/>

------------------------------------------
[...truncated 4615 lines...]
  [2013-06-01 12:25:34,776] INFO  7996[main] - org.apache.any23.extractor.SingleDocumentExtraction.run(SingleDocumentExtraction.java:221)
- Processing http://bob.example.com/
  [2013-06-01 12:25:34,836] INFO  8056[main] - org.apache.any23.extractor.SingleDocumentExtraction.run(SingleDocumentExtraction.java:221)
- Processing http://bob.example.com/
  Tests run: 5, Failures: 0, Errors: 0, Skipped: 0, Time elapsed: 0.089 sec
Running org.apache.any23.extractor.html.HListingExtractorTest
[2013-06-01 12:25:34,886] INFO  8106[main] - org.apache.any23.extractor.SingleDocumentExtraction.run(SingleDocumentExtraction.java:221)
- Processing http://bob.example.com/
  [2013-06-01 12:25:34,916] INFO  8136[main] - org.apache.any23.extractor.SingleDocumentExtraction.run(SingleDocumentExtraction.java:221)
- Processing http://bob.example.com/
  [2013-06-01 12:25:34,944] INFO  8164[main] - org.apache.any23.extractor.SingleDocumentExtraction.run(SingleDocumentExtraction.java:221)
- Processing http://bob.example.com/
  [2013-06-01 12:25:34,953] INFO  8173[main] - org.apache.any23.extractor.SingleDocumentExtraction.run(SingleDocumentExtraction.java:221)
- Processing http://bob.example.com/
  [2013-06-01 12:25:34,961] INFO  8181[main] - org.apache.any23.extractor.SingleDocumentExtraction.run(SingleDocumentExtraction.java:221)
- Processing http://bob.example.com/
  [2013-06-01 12:25:34,969] INFO  8189[main] - org.apache.any23.extractor.SingleDocumentExtraction.run(SingleDocumentExtraction.java:221)
- Processing http://bob.example.com/
  [2013-06-01 12:25:34,976] INFO  8196[main] - org.apache.any23.extractor.SingleDocumentExtraction.run(SingleDocumentExtraction.java:221)
- Processing http://bob.example.com/
  [2013-06-01 12:25:34,988] INFO  8208[main] - org.apache.any23.extractor.SingleDocumentExtraction.run(SingleDocumentExtraction.java:221)
- Processing http://bob.example.com/
  [2013-06-01 12:25:34,997] INFO  8217[main] - org.apache.any23.extractor.SingleDocumentExtraction.run(SingleDocumentExtraction.java:221)
- Processing http://bob.example.com/
  [2013-06-01 12:25:35,009] INFO  8229[main] - org.apache.any23.extractor.SingleDocumentExtraction.run(SingleDocumentExtraction.java:221)
- Processing http://bob.example.com/
  [2013-06-01 12:25:35,021] INFO  8241[main] - org.apache.any23.extractor.SingleDocumentExtraction.run(SingleDocumentExtraction.java:221)
- Processing http://bob.example.com/
  [2013-06-01 12:25:35,035] INFO  8255[main] - org.apache.any23.extractor.SingleDocumentExtraction.run(SingleDocumentExtraction.java:221)
- Processing http://bob.example.com/
  [2013-06-01 12:25:35,048] INFO  8268[main] - org.apache.any23.extractor.SingleDocumentExtraction.run(SingleDocumentExtraction.java:221)
- Processing http://bob.example.com/
  [2013-06-01 12:25:35,061] INFO  8281[main] - org.apache.any23.extractor.SingleDocumentExtraction.run(SingleDocumentExtraction.java:221)
- Processing http://bob.example.com/
  [2013-06-01 12:25:35,095] INFO  8315[main] - org.apache.any23.extractor.SingleDocumentExtraction.run(SingleDocumentExtraction.java:221)
- Processing http://bob.example.com/
  [2013-06-01 12:25:35,104] INFO  8324[main] - org.apache.any23.extractor.SingleDocumentExtraction.run(SingleDocumentExtraction.java:221)
- Processing http://bob.example.com/
  [2013-06-01 12:25:35,113] INFO  8333[main] - org.apache.any23.extractor.SingleDocumentExtraction.run(SingleDocumentExtraction.java:221)
- Processing http://bob.example.com/
  [2013-06-01 12:25:35,122] INFO  8342[main] - org.apache.any23.extractor.SingleDocumentExtraction.run(SingleDocumentExtraction.java:221)
- Processing http://bob.example.com/
  [2013-06-01 12:25:35,134] INFO  8354[main] - org.apache.any23.extractor.SingleDocumentExtraction.run(SingleDocumentExtraction.java:221)
- Processing http://bob.example.com/
  [2013-06-01 12:25:35,146] INFO  8366[main] - org.apache.any23.extractor.SingleDocumentExtraction.run(SingleDocumentExtraction.java:221)
- Processing http://bob.example.com/
  [2013-06-01 12:25:35,154] INFO  8374[main] - org.apache.any23.extractor.SingleDocumentExtraction.run(SingleDocumentExtraction.java:221)
- Processing http://bob.example.com/
  [2013-06-01 12:25:35,166] INFO  8386[main] - org.apache.any23.extractor.SingleDocumentExtraction.run(SingleDocumentExtraction.java:221)
- Processing http://bob.example.com/
  [2013-06-01 12:25:35,174] INFO  8394[main] - org.apache.any23.extractor.SingleDocumentExtraction.run(SingleDocumentExtraction.java:221)
- Processing http://bob.example.com/
  [2013-06-01 12:25:35,187] INFO  8407[main] - org.apache.any23.extractor.SingleDocumentExtraction.run(SingleDocumentExtraction.java:221)
- Processing http://bob.example.com/
  [2013-06-01 12:25:35,200] INFO  8420[main] - org.apache.any23.extractor.SingleDocumentExtraction.run(SingleDocumentExtraction.java:221)
- Processing http://bob.example.com/
  [2013-06-01 12:25:35,207] INFO  8427[main] - org.apache.any23.extractor.SingleDocumentExtraction.run(SingleDocumentExtraction.java:221)
- Processing http://bob.example.com/
  Tests run: 26, Failures: 2, Errors: 0, Skipped: 0, Time elapsed: 0.366 sec <<<
FAILURE!
Running org.apache.any23.extractor.html.HeadLinkExtractorTest
[2013-06-01 12:25:35,216] INFO  8436[main] - org.apache.any23.extractor.SingleDocumentExtraction.run(SingleDocumentExtraction.java:221)
- Processing http://bob.example.com/
  Tests run: 1, Failures: 0, Errors: 0, Skipped: 0, Time elapsed: 0.013 sec
Running org.apache.any23.extractor.html.TurtleHTMLExtractorTest
[2013-06-01 12:25:35,230] INFO  8450[main] - org.apache.any23.extractor.SingleDocumentExtraction.run(SingleDocumentExtraction.java:221)
- Processing http://bob.example.com/
  Tests run: 1, Failures: 0, Errors: 0, Skipped: 0, Time elapsed: 0.018 sec
Running org.apache.any23.extractor.html.HTMLDocumentTest
Tests run: 1, Failures: 0, Errors: 0, Skipped: 0, Time elapsed: 0.001 sec
Running org.apache.any23.extractor.html.HTMLMetaExtractorTest
[2013-06-01 12:25:35,249] INFO  8469[main] - org.apache.any23.extractor.SingleDocumentExtraction.run(SingleDocumentExtraction.java:221)
- Processing http://bob.example.com/
  [2013-06-01 12:25:35,262] INFO  8482[main] - org.apache.any23.extractor.SingleDocumentExtraction.run(SingleDocumentExtraction.java:221)
- Processing http://bob.example.com/
  Tests run: 2, Failures: 0, Errors: 0, Skipped: 0, Time elapsed: 0.023 sec
Running org.apache.any23.extractor.html.SpeciesExtractorTest
[2013-06-01 12:25:35,274] INFO  8494[main] - org.apache.any23.extractor.SingleDocumentExtraction.run(SingleDocumentExtraction.java:221)
- Processing http://bob.example.com/
  Tests run: 1, Failures: 0, Errors: 0, Skipped: 0, Time elapsed: 0.016 sec
Running org.apache.any23.extractor.html.SpanCloserInputStreamTest
Tests run: 7, Failures: 0, Errors: 0, Skipped: 0, Time elapsed: 0.021 sec
Running org.apache.any23.extractor.html.RDFMergerTest
Tests run: 10, Failures: 0, Errors: 0, Skipped: 0, Time elapsed: 0.135 sec
Running org.apache.any23.extractor.html.LicenseExtractorTest
[2013-06-01 12:25:35,449] INFO  8669[main] - org.apache.any23.extractor.SingleDocumentExtraction.run(SingleDocumentExtraction.java:221)
- Processing http://bob.example.com/
  [2013-06-01 12:25:35,456] INFO  8676[main] - org.apache.any23.extractor.SingleDocumentExtraction.run(SingleDocumentExtraction.java:221)
- Processing http://bob.example.com/
  [2013-06-01 12:25:35,462] INFO  8682[main] - org.apache.any23.extractor.SingleDocumentExtraction.run(SingleDocumentExtraction.java:221)
- Processing http://bob.example.com/
  [2013-06-01 12:25:35,469] INFO  8689[main] - org.apache.any23.extractor.SingleDocumentExtraction.run(SingleDocumentExtraction.java:221)
- Processing http://bob.example.com/
  [2013-06-01 12:25:35,475] INFO  8695[main] - org.apache.any23.extractor.SingleDocumentExtraction.run(SingleDocumentExtraction.java:221)
- Processing http://bob.example.com/
  [2013-06-01 12:25:35,482] INFO  8702[main] - org.apache.any23.extractor.SingleDocumentExtraction.run(SingleDocumentExtraction.java:221)
- Processing http://bob.example.com/
  Tests run: 6, Failures: 0, Errors: 0, Skipped: 0, Time elapsed: 0.039 sec
Running org.apache.any23.extractor.html.XFNExtractorTest
[2013-06-01 12:25:35,489] INFO  8709[main] - org.apache.any23.extractor.SingleDocumentExtraction.run(SingleDocumentExtraction.java:221)
- Processing http://bob.example.com/
  [2013-06-01 12:25:35,495] INFO  8715[main] - org.apache.any23.extractor.SingleDocumentExtraction.run(SingleDocumentExtraction.java:221)
- Processing http://bob.example.com/
  [2013-06-01 12:25:35,500] INFO  8720[main] - org.apache.any23.extractor.SingleDocumentExtraction.run(SingleDocumentExtraction.java:221)
- Processing http://bob.example.com/
  [2013-06-01 12:25:35,506] INFO  8726[main] - org.apache.any23.extractor.SingleDocumentExtraction.run(SingleDocumentExtraction.java:221)
- Processing http://bob.example.com/
  [2013-06-01 12:25:35,512] INFO  8732[main] - org.apache.any23.extractor.SingleDocumentExtraction.run(SingleDocumentExtraction.java:221)
- Processing http://bob.example.com/
  [2013-06-01 12:25:35,518] INFO  8738[main] - org.apache.any23.extractor.SingleDocumentExtraction.run(SingleDocumentExtraction.java:221)
- Processing http://bob.example.com/
  [2013-06-01 12:25:35,524] INFO  8744[main] - org.apache.any23.extractor.SingleDocumentExtraction.run(SingleDocumentExtraction.java:221)
- Processing http://bob.example.com/
  [2013-06-01 12:25:35,535] INFO  8755[main] - org.apache.any23.extractor.SingleDocumentExtraction.run(SingleDocumentExtraction.java:221)
- Processing http://bob.example.com/
  [2013-06-01 12:25:35,548] INFO  8768[main] - org.apache.any23.extractor.SingleDocumentExtraction.run(SingleDocumentExtraction.java:221)
- Processing http://bob.example.com/
  [2013-06-01 12:25:35,557] INFO  8777[main] - org.apache.any23.extractor.SingleDocumentExtraction.run(SingleDocumentExtraction.java:221)
- Processing http://bob.example.com/
  [2013-06-01 12:25:35,567] INFO  8787[main] - org.apache.any23.extractor.SingleDocumentExtraction.run(SingleDocumentExtraction.java:221)
- Processing http://bob.example.com/
  [2013-06-01 12:25:35,576] INFO  8796[main] - org.apache.any23.extractor.SingleDocumentExtraction.run(SingleDocumentExtraction.java:221)
- Processing http://bob.example.com/
  [2013-06-01 12:25:35,581] INFO  8801[main] - org.apache.any23.extractor.SingleDocumentExtraction.run(SingleDocumentExtraction.java:221)
- Processing http://bob.example.com/
  [2013-06-01 12:25:35,588] INFO  8808[main] - org.apache.any23.extractor.SingleDocumentExtraction.run(SingleDocumentExtraction.java:221)
- Processing http://bob.example.com/
  [2013-06-01 12:25:35,594] INFO  8814[main] - org.apache.any23.extractor.SingleDocumentExtraction.run(SingleDocumentExtraction.java:221)
- Processing http://bob.example.com/
  Tests run: 15, Failures: 0, Errors: 0, Skipped: 0, Time elapsed: 0.111 sec
Running org.apache.any23.extractor.html.HCardExtractorTest
[2013-06-01 12:25:35,603] INFO  8823[main] - org.apache.any23.extractor.SingleDocumentExtraction.run(SingleDocumentExtraction.java:221)
- Processing http://bob.example.com/
  [2013-06-01 12:25:35,611] INFO  8831[main] - org.apache.any23.extractor.SingleDocumentExtraction.run(SingleDocumentExtraction.java:221)
- Processing http://bob.example.com/
  [2013-06-01 12:25:35,616] INFO  8836[main] - org.apache.any23.extractor.SingleDocumentExtraction.run(SingleDocumentExtraction.java:221)
- Processing http://bob.example.com/
  [2013-06-01 12:25:35,631] INFO  8851[main] - org.apache.any23.extractor.SingleDocumentExtraction.run(SingleDocumentExtraction.java:221)
- Processing http://bob.example.com/
  [2013-06-01 12:25:35,640] INFO  8860[main] - org.apache.any23.extractor.SingleDocumentExtraction.run(SingleDocumentExtraction.java:221)
- Processing http://bob.example.com/
  [2013-06-01 12:25:35,647] INFO  8867[main] - org.apache.any23.extractor.SingleDocumentExtraction.run(SingleDocumentExtraction.java:221)
- Processing http://bob.example.com/
  [2013-06-01 12:25:35,662] INFO  8882[main] - org.apache.any23.extractor.SingleDocumentExtraction.run(SingleDocumentExtraction.java:221)
- Processing http://bob.example.com/
  [2013-06-01 12:25:35,673] INFO  8893[main] - org.apache.any23.extractor.SingleDocumentExtraction.run(SingleDocumentExtraction.java:221)
- Processing http://bob.example.com/
  [2013-06-01 12:25:35,679] INFO  8899[main] - org.apache.any23.extractor.SingleDocumentExtraction.run(SingleDocumentExtraction.java:221)
- Processing http://bob.example.com/
  [2013-06-01 12:25:35,698] INFO  8918[main] - org.apache.any23.extractor.SingleDocumentExtraction.run(SingleDocumentExtraction.java:221)
- Processing http://bob.example.com/
  [2013-06-01 12:25:35,708] INFO  8928[main] - org.apache.any23.extractor.SingleDocumentExtraction.run(SingleDocumentExtraction.java:221)
- Processing http://bob.example.com/
  [2013-06-01 12:25:35,722] INFO  8942[main] - org.apache.any23.extractor.SingleDocumentExtraction.run(SingleDocumentExtraction.java:221)
- Processing http://bob.example.com/
  [2013-06-01 12:25:35,736] INFO  8956[main] - org.apache.any23.extractor.SingleDocumentExtraction.run(SingleDocumentExtraction.java:221)
- Processing http://bob.example.com/
  [2013-06-01 12:25:35,750] INFO  8970[main] - org.apache.any23.extractor.SingleDocumentExtraction.run(SingleDocumentExtraction.java:221)
- Processing http://bob.example.com/
  [2013-06-01 12:25:35,763] INFO  8983[main] - org.apache.any23.extractor.SingleDocumentExtraction.run(SingleDocumentExtraction.java:221)
- Processing http://bob.example.com/
  [2013-06-01 12:25:35,775] INFO  8995[main] - org.apache.any23.extractor.SingleDocumentExtraction.run(SingleDocumentExtraction.java:221)
- Processing http://bob.example.com/
  [2013-06-01 12:25:35,843] INFO  9063[main] - org.apache.any23.extractor.SingleDocumentExtraction.run(SingleDocumentExtraction.java:221)
- Processing http://bob.example.com/
  [2013-06-01 12:25:35,876] INFO  9096[main] - org.apache.any23.extractor.SingleDocumentExtraction.run(SingleDocumentExtraction.java:221)
- Processing http://bob.example.com/
  [2013-06-01 12:25:35,926] INFO  9146[main] - org.apache.any23.extractor.SingleDocumentExtraction.run(SingleDocumentExtraction.java:221)
- Processing http://bob.example.com/
  [2013-06-01 12:25:35,959] INFO  9179[main] - org.apache.any23.extractor.SingleDocumentExtraction.run(SingleDocumentExtraction.java:221)
- Processing http://bob.example.com/
  [2013-06-01 12:25:35,977] INFO  9197[main] - org.apache.any23.extractor.SingleDocumentExtraction.run(SingleDocumentExtraction.java:221)
- Processing http://bob.example.com/
  [2013-06-01 12:25:35,985] INFO  9205[main] - org.apache.any23.extractor.SingleDocumentExtraction.run(SingleDocumentExtraction.java:221)
- Processing http://bob.example.com/
  [2013-06-01 12:25:35,993] INFO  9213[main] - org.apache.any23.extractor.SingleDocumentExtraction.run(SingleDocumentExtraction.java:221)
- Processing http://bob.example.com/
  [2013-06-01 12:25:36,000] INFO  9220[main] - org.apache.any23.extractor.SingleDocumentExtraction.run(SingleDocumentExtraction.java:221)
- Processing http://bob.example.com/
  [2013-06-01 12:25:36,008] INFO  9228[main] - org.apache.any23.extractor.SingleDocumentExtraction.run(SingleDocumentExtraction.java:221)
- Processing http://bob.example.com/
  [2013-06-01 12:25:36,015] INFO  9235[main] - org.apache.any23.extractor.SingleDocumentExtraction.run(SingleDocumentExtraction.java:221)
- Processing http://bob.example.com/
  [2013-06-01 12:25:36,022] INFO  9242[main] - org.apache.any23.extractor.SingleDocumentExtraction.run(SingleDocumentExtraction.java:221)
- Processing http://bob.example.com/
  [2013-06-01 12:25:36,029] INFO  9249[main] - org.apache.any23.extractor.SingleDocumentExtraction.run(SingleDocumentExtraction.java:221)
- Processing http://bob.example.com/
  [2013-06-01 12:25:36,037] INFO  9257[main] - org.apache.any23.extractor.SingleDocumentExtraction.run(SingleDocumentExtraction.java:221)
- Processing http://bob.example.com/
  [2013-06-01 12:25:36,045] INFO  9265[main] - org.apache.any23.extractor.SingleDocumentExtraction.run(SingleDocumentExtraction.java:221)
- Processing http://bob.example.com/
  [2013-06-01 12:25:36,053] INFO  9273[main] - org.apache.any23.extractor.SingleDocumentExtraction.run(SingleDocumentExtraction.java:221)
- Processing http://bob.example.com/
  [2013-06-01 12:25:36,061] INFO  9281[main] - org.apache.any23.extractor.SingleDocumentExtraction.run(SingleDocumentExtraction.java:221)
- Processing http://bob.example.com/
  [2013-06-01 12:25:36,068] INFO  9288[main] - org.apache.any23.extractor.SingleDocumentExtraction.run(SingleDocumentExtraction.java:221)
- Processing http://bob.example.com/
  [2013-06-01 12:25:36,075] INFO  9295[main] - org.apache.any23.extractor.SingleDocumentExtraction.run(SingleDocumentExtraction.java:221)
- Processing http://bob.example.com/
  [2013-06-01 12:25:36,082] INFO  9302[main] - org.apache.any23.extractor.SingleDocumentExtraction.run(SingleDocumentExtraction.java:221)
- Processing http://bob.example.com/
  [2013-06-01 12:25:36,089] INFO  9309[main] - org.apache.any23.extractor.SingleDocumentExtraction.run(SingleDocumentExtraction.java:221)
- Processing http://bob.example.com/
  [2013-06-01 12:25:36,096] INFO  9316[main] - org.apache.any23.extractor.SingleDocumentExtraction.run(SingleDocumentExtraction.java:221)
- Processing http://bob.example.com/
  [2013-06-01 12:25:36,102] INFO  9322[main] - org.apache.any23.extractor.SingleDocumentExtraction.run(SingleDocumentExtraction.java:221)
- Processing http://bob.example.com/
  [2013-06-01 12:25:36,118] INFO  9338[main] - org.apache.any23.extractor.SingleDocumentExtraction.run(SingleDocumentExtraction.java:221)
- Processing http://bob.example.com/
  [2013-06-01 12:25:36,125] INFO  9345[main] - org.apache.any23.extractor.SingleDocumentExtraction.run(SingleDocumentExtraction.java:221)
- Processing http://bob.example.com/
  [2013-06-01 12:25:36,137] INFO  9357[main] - org.apache.any23.extractor.SingleDocumentExtraction.run(SingleDocumentExtraction.java:221)
- Processing http://bob.example.com/
  [2013-06-01 12:25:36,148] INFO  9368[main] - org.apache.any23.extractor.SingleDocumentExtraction.run(SingleDocumentExtraction.java:221)
- Processing http://bob.example.com/
  [2013-06-01 12:25:36,159] INFO  9379[main] - org.apache.any23.extractor.SingleDocumentExtraction.run(SingleDocumentExtraction.java:221)
- Processing http://bob.example.com/
  [2013-06-01 12:25:36,223] INFO  9443[main] - org.apache.any23.extractor.SingleDocumentExtraction.run(SingleDocumentExtraction.java:221)
- Processing http://bob.example.com/
  Tests run: 46, Failures: 0, Errors: 0, Skipped: 2, Time elapsed: 0.861 sec
Running org.apache.any23.extractor.html.HResumeExtractorTest
[2013-06-01 12:25:36,462] INFO  9682[main] - org.apache.any23.extractor.SingleDocumentExtraction.run(SingleDocumentExtraction.java:221)
- Processing http://bob.example.com/
  [2013-06-01 12:25:36,468] INFO  9688[main] - org.apache.any23.extractor.SingleDocumentExtraction.run(SingleDocumentExtraction.java:221)
- Processing http://bob.example.com/
  [2013-06-01 12:25:36,508] INFO  9728[main] - org.apache.any23.extractor.SingleDocumentExtraction.run(SingleDocumentExtraction.java:221)
- Processing http://bob.example.com/
  [2013-06-01 12:25:36,540] INFO  9760[main] - org.apache.any23.extractor.SingleDocumentExtraction.run(SingleDocumentExtraction.java:221)
- Processing http://bob.example.com/
  Tests run: 4, Failures: 0, Errors: 0, Skipped: 0, Time elapsed: 0.108 sec
Running org.apache.any23.extractor.html.TagSoupParserTest
Tests run: 4, Failures: 0, Errors: 0, Skipped: 0, Time elapsed: 0.016 sec
Running org.apache.any23.extractor.ExtractionResultImplTest
Tests run: 1, Failures: 0, Errors: 0, Skipped: 0, Time elapsed: 0.002 sec
Running org.apache.any23.http.AcceptHeaderBuilderTest
Tests run: 12, Failures: 0, Errors: 0, Skipped: 0, Time elapsed: 0.002 sec
Running org.apache.any23.writer.WriterRegistryTest
Tests run: 7, Failures: 0, Errors: 0, Skipped: 0, Time elapsed: 0.004 sec
Running org.apache.any23.writer.JSONWriterTest
Tests run: 1, Failures: 0, Errors: 0, Skipped: 0, Time elapsed: 0 sec

Results :

Failed tests:   testKelkoo(org.apache.any23.extractor.html.HListingExtractorTest): Assertion
failed! Extracted triples:
  testKelkooFull(org.apache.any23.extractor.html.HListingExtractorTest): Assertion failed!
Extracted triples:

Tests run: 391, Failures: 2, Errors: 0, Skipped: 7

[ERROR] There are test failures.

Please refer to <https://builds.apache.org/job/Any23-trunk/ws/core/target/surefire-reports>
for the individual test results.
[JENKINS] Recording test results
[INFO] [jar:jar {execution: default-jar}]
[INFO] Building jar: <https://builds.apache.org/job/Any23-trunk/ws/core/target/apache-any23-core-0.8.0-SNAPSHOT.jar>
[INFO] [appassembler:assemble {execution: default}]
[INFO] Installing artifact <https://builds.apache.org/job/Any23-trunk/ws/api/target/apache-any23-api-0.8.0-SNAPSHOT.jar>
to <https://builds.apache.org/job/Any23-trunk/ws/core/target/appassembler/lib/apache-any23-api-0.8.0-SNAPSHOT.jar>
[INFO] Installing artifact /home/jenkins/jenkins-slave/maven-repositories/0/org/slf4j/slf4j-api/1.6.6/slf4j-api-1.6.6.jar
to <https://builds.apache.org/job/Any23-trunk/ws/core/target/appassembler/lib/slf4j-api-1.6.6.jar>
[INFO] Installing artifact /home/jenkins/jenkins-slave/maven-repositories/0/org/openrdf/sesame/sesame-model/2.6.9/sesame-model-2.6.9.jar
to <https://builds.apache.org/job/Any23-trunk/ws/core/target/appassembler/lib/sesame-model-2.6.9.jar>
[INFO] Installing artifact /home/jenkins/jenkins-slave/maven-repositories/0/org/openrdf/sesame/sesame-util/2.6.9/sesame-util-2.6.9.jar
to <https://builds.apache.org/job/Any23-trunk/ws/core/target/appassembler/lib/sesame-util-2.6.9.jar>
[INFO] Installing artifact /home/jenkins/jenkins-slave/maven-repositories/0/org/openrdf/sesame/sesame-rio-api/2.6.9/sesame-rio-api-2.6.9.jar
to <https://builds.apache.org/job/Any23-trunk/ws/core/target/appassembler/lib/sesame-rio-api-2.6.9.jar>
[INFO] Installing artifact <https://builds.apache.org/job/Any23-trunk/ws/csvutils/target/apache-any23-csvutils-0.8.0-SNAPSHOT.jar>
to <https://builds.apache.org/job/Any23-trunk/ws/core/target/appassembler/lib/apache-any23-csvutils-0.8.0-SNAPSHOT.jar>
[INFO] Installing artifact /home/jenkins/jenkins-slave/maven-repositories/0/org/apache/commons/commons-csv/1.0-SNAPSHOT-rev1148315/commons-csv-1.0-SNAPSHOT-rev1148315.jar
to <https://builds.apache.org/job/Any23-trunk/ws/core/target/appassembler/lib/commons-csv-1.0-SNAPSHOT-rev1148315.jar>
[INFO] Installing artifact <https://builds.apache.org/job/Any23-trunk/ws/mime/target/apache-any23-mime-0.8.0-SNAPSHOT.jar>
to <https://builds.apache.org/job/Any23-trunk/ws/core/target/appassembler/lib/apache-any23-mime-0.8.0-SNAPSHOT.jar>
[INFO] Installing artifact /home/jenkins/jenkins-slave/maven-repositories/0/commons-io/commons-io/2.4/commons-io-2.4.jar
to <https://builds.apache.org/job/Any23-trunk/ws/core/target/appassembler/lib/commons-io-2.4.jar>
[INFO] Installing artifact /home/jenkins/jenkins-slave/maven-repositories/0/org/apache/tika/tika-core/1.2/tika-core-1.2.jar
to <https://builds.apache.org/job/Any23-trunk/ws/core/target/appassembler/lib/tika-core-1.2.jar>
[INFO] Installing artifact /home/jenkins/jenkins-slave/maven-repositories/0/org/apache/tika/tika-parsers/1.2/tika-parsers-1.2.jar
to <https://builds.apache.org/job/Any23-trunk/ws/core/target/appassembler/lib/tika-parsers-1.2.jar>
[INFO] Installing artifact /home/jenkins/jenkins-slave/maven-repositories/0/org/gagravarr/vorbis-java-tika/0.1/vorbis-java-tika-0.1.jar
to <https://builds.apache.org/job/Any23-trunk/ws/core/target/appassembler/lib/vorbis-java-tika-0.1.jar>
[INFO] Installing artifact /home/jenkins/jenkins-slave/maven-repositories/0/org/gagravarr/vorbis-java-core/0.1/vorbis-java-core-0.1-tests.jar
to <https://builds.apache.org/job/Any23-trunk/ws/core/target/appassembler/lib/vorbis-java-core-0.1-tests.jar>
[INFO] Installing artifact /home/jenkins/jenkins-slave/maven-repositories/0/edu/ucar/netcdf/4.2-min/netcdf-4.2-min.jar
to <https://builds.apache.org/job/Any23-trunk/ws/core/target/appassembler/lib/netcdf-4.2-min.jar>
[INFO] Installing artifact /home/jenkins/jenkins-slave/maven-repositories/0/org/apache/james/apache-mime4j-core/0.7.2/apache-mime4j-core-0.7.2.jar
to <https://builds.apache.org/job/Any23-trunk/ws/core/target/appassembler/lib/apache-mime4j-core-0.7.2.jar>
[INFO] Installing artifact /home/jenkins/jenkins-slave/maven-repositories/0/org/apache/james/apache-mime4j-dom/0.7.2/apache-mime4j-dom-0.7.2.jar
to <https://builds.apache.org/job/Any23-trunk/ws/core/target/appassembler/lib/apache-mime4j-dom-0.7.2.jar>
[INFO] Installing artifact /home/jenkins/jenkins-slave/maven-repositories/0/org/apache/commons/commons-compress/1.4.1/commons-compress-1.4.1.jar
to <https://builds.apache.org/job/Any23-trunk/ws/core/target/appassembler/lib/commons-compress-1.4.1.jar>
[INFO] Installing artifact /home/jenkins/jenkins-slave/maven-repositories/0/org/tukaani/xz/1.0/xz-1.0.jar
to <https://builds.apache.org/job/Any23-trunk/ws/core/target/appassembler/lib/xz-1.0.jar>
[INFO] Installing artifact /home/jenkins/jenkins-slave/maven-repositories/0/commons-codec/commons-codec/1.6/commons-codec-1.6.jar
to <https://builds.apache.org/job/Any23-trunk/ws/core/target/appassembler/lib/commons-codec-1.6.jar>
[INFO] Installing artifact /home/jenkins/jenkins-slave/maven-repositories/0/org/apache/pdfbox/pdfbox/1.7.0/pdfbox-1.7.0.jar
to <https://builds.apache.org/job/Any23-trunk/ws/core/target/appassembler/lib/pdfbox-1.7.0.jar>
[INFO] Installing artifact /home/jenkins/jenkins-slave/maven-repositories/0/org/apache/pdfbox/fontbox/1.7.0/fontbox-1.7.0.jar
to <https://builds.apache.org/job/Any23-trunk/ws/core/target/appassembler/lib/fontbox-1.7.0.jar>
[INFO] Installing artifact /home/jenkins/jenkins-slave/maven-repositories/0/org/apache/pdfbox/jempbox/1.7.0/jempbox-1.7.0.jar
to <https://builds.apache.org/job/Any23-trunk/ws/core/target/appassembler/lib/jempbox-1.7.0.jar>
[INFO] Installing artifact /home/jenkins/jenkins-slave/maven-repositories/0/commons-logging/commons-logging/1.0.4/commons-logging-1.0.4.jar
to <https://builds.apache.org/job/Any23-trunk/ws/core/target/appassembler/lib/commons-logging-1.0.4.jar>
[INFO] Installing artifact /home/jenkins/jenkins-slave/maven-repositories/0/org/bouncycastle/bcmail-jdk15/1.45/bcmail-jdk15-1.45.jar
to <https://builds.apache.org/job/Any23-trunk/ws/core/target/appassembler/lib/bcmail-jdk15-1.45.jar>
[INFO] Installing artifact /home/jenkins/jenkins-slave/maven-repositories/0/org/bouncycastle/bcprov-jdk15/1.45/bcprov-jdk15-1.45.jar
to <https://builds.apache.org/job/Any23-trunk/ws/core/target/appassembler/lib/bcprov-jdk15-1.45.jar>
[INFO] Installing artifact /home/jenkins/jenkins-slave/maven-repositories/0/org/apache/poi/poi/3.8/poi-3.8.jar
to <https://builds.apache.org/job/Any23-trunk/ws/core/target/appassembler/lib/poi-3.8.jar>
[INFO] Installing artifact /home/jenkins/jenkins-slave/maven-repositories/0/org/apache/poi/poi-scratchpad/3.8/poi-scratchpad-3.8.jar
to <https://builds.apache.org/job/Any23-trunk/ws/core/target/appassembler/lib/poi-scratchpad-3.8.jar>
[INFO] Installing artifact /home/jenkins/jenkins-slave/maven-repositories/0/org/apache/poi/poi-ooxml/3.8/poi-ooxml-3.8.jar
to <https://builds.apache.org/job/Any23-trunk/ws/core/target/appassembler/lib/poi-ooxml-3.8.jar>
[INFO] Installing artifact /home/jenkins/jenkins-slave/maven-repositories/0/org/apache/poi/poi-ooxml-schemas/3.8/poi-ooxml-schemas-3.8.jar
to <https://builds.apache.org/job/Any23-trunk/ws/core/target/appassembler/lib/poi-ooxml-schemas-3.8.jar>
[INFO] Installing artifact /home/jenkins/jenkins-slave/maven-repositories/0/org/apache/xmlbeans/xmlbeans/2.3.0/xmlbeans-2.3.0.jar
to <https://builds.apache.org/job/Any23-trunk/ws/core/target/appassembler/lib/xmlbeans-2.3.0.jar>
[INFO] Installing artifact /home/jenkins/jenkins-slave/maven-repositories/0/dom4j/dom4j/1.6.1/dom4j-1.6.1.jar
to <https://builds.apache.org/job/Any23-trunk/ws/core/target/appassembler/lib/dom4j-1.6.1.jar>
[INFO] Installing artifact /home/jenkins/jenkins-slave/maven-repositories/0/org/apache/geronimo/specs/geronimo-stax-api_1.0_spec/1.0.1/geronimo-stax-api_1.0_spec-1.0.1.jar
to <https://builds.apache.org/job/Any23-trunk/ws/core/target/appassembler/lib/geronimo-stax-api_1.0_spec-1.0.1.jar>
[INFO] Installing artifact /home/jenkins/jenkins-slave/maven-repositories/0/org/ccil/cowan/tagsoup/tagsoup/1.2.1/tagsoup-1.2.1.jar
to <https://builds.apache.org/job/Any23-trunk/ws/core/target/appassembler/lib/tagsoup-1.2.1.jar>
[INFO] Installing artifact /home/jenkins/jenkins-slave/maven-repositories/0/asm/asm/3.1/asm-3.1.jar
to <https://builds.apache.org/job/Any23-trunk/ws/core/target/appassembler/lib/asm-3.1.jar>
[INFO] Installing artifact /home/jenkins/jenkins-slave/maven-repositories/0/com/googlecode/mp4parser/isoparser/1.0-RC-1/isoparser-1.0-RC-1.jar
to <https://builds.apache.org/job/Any23-trunk/ws/core/target/appassembler/lib/isoparser-1.0-RC-1.jar>
[INFO] Installing artifact /home/jenkins/jenkins-slave/maven-repositories/0/org/aspectj/aspectjrt/1.6.11/aspectjrt-1.6.11.jar
to <https://builds.apache.org/job/Any23-trunk/ws/core/target/appassembler/lib/aspectjrt-1.6.11.jar>
[INFO] Installing artifact /home/jenkins/jenkins-slave/maven-repositories/0/com/drewnoakes/metadata-extractor/2.4.0-beta-1/metadata-extractor-2.4.0-beta-1.jar
to <https://builds.apache.org/job/Any23-trunk/ws/core/target/appassembler/lib/metadata-extractor-2.4.0-beta-1.jar>
[INFO] Installing artifact /home/jenkins/jenkins-slave/maven-repositories/0/de/l3s/boilerpipe/boilerpipe/1.1.0/boilerpipe-1.1.0.jar
to <https://builds.apache.org/job/Any23-trunk/ws/core/target/appassembler/lib/boilerpipe-1.1.0.jar>
[INFO] Installing artifact /home/jenkins/jenkins-slave/maven-repositories/0/rome/rome/0.9/rome-0.9.jar
to <https://builds.apache.org/job/Any23-trunk/ws/core/target/appassembler/lib/rome-0.9.jar>
[INFO] Installing artifact /home/jenkins/jenkins-slave/maven-repositories/0/jdom/jdom/1.0/jdom-1.0.jar
to <https://builds.apache.org/job/Any23-trunk/ws/core/target/appassembler/lib/jdom-1.0.jar>
[INFO] Installing artifact /home/jenkins/jenkins-slave/maven-repositories/0/org/gagravarr/vorbis-java-core/0.1/vorbis-java-core-0.1.jar
to <https://builds.apache.org/job/Any23-trunk/ws/core/target/appassembler/lib/vorbis-java-core-0.1.jar>
[INFO] Installing artifact /home/jenkins/jenkins-slave/maven-repositories/0/com/googlecode/juniversalchardet/juniversalchardet/1.0.3/juniversalchardet-1.0.3.jar
to <https://builds.apache.org/job/Any23-trunk/ws/core/target/appassembler/lib/juniversalchardet-1.0.3.jar>
[INFO] Installing artifact /home/jenkins/jenkins-slave/maven-repositories/0/org/openrdf/sesame/sesame-rio-turtle/2.6.9/sesame-rio-turtle-2.6.9.jar
to <https://builds.apache.org/job/Any23-trunk/ws/core/target/appassembler/lib/sesame-rio-turtle-2.6.9.jar>
[INFO] Installing artifact /home/jenkins/jenkins-slave/maven-repositories/0/org/openrdf/sesame/sesame-rio-ntriples/2.6.9/sesame-rio-ntriples-2.6.9.jar
to <https://builds.apache.org/job/Any23-trunk/ws/core/target/appassembler/lib/sesame-rio-ntriples-2.6.9.jar>
[INFO] Installing artifact /home/jenkins/jenkins-slave/maven-repositories/0/org/openrdf/sesame/sesame-rio-n3/2.6.9/sesame-rio-n3-2.6.9.jar
to <https://builds.apache.org/job/Any23-trunk/ws/core/target/appassembler/lib/sesame-rio-n3-2.6.9.jar>
[INFO] Installing artifact <https://builds.apache.org/job/Any23-trunk/ws/encoding/target/apache-any23-encoding-0.8.0-SNAPSHOT.jar>
to <https://builds.apache.org/job/Any23-trunk/ws/core/target/appassembler/lib/apache-any23-encoding-0.8.0-SNAPSHOT.jar>
[INFO] Installing artifact /home/jenkins/jenkins-slave/maven-repositories/0/commons-lang/commons-lang/2.4/commons-lang-2.4.jar
to <https://builds.apache.org/job/Any23-trunk/ws/core/target/appassembler/lib/commons-lang-2.4.jar>
[INFO] Installing artifact /home/jenkins/jenkins-slave/maven-repositories/0/commons-httpclient/commons-httpclient/3.1/commons-httpclient-3.1.jar
to <https://builds.apache.org/job/Any23-trunk/ws/core/target/appassembler/lib/commons-httpclient-3.1.jar>
[INFO] Installing artifact /home/jenkins/jenkins-slave/maven-repositories/0/net/sourceforge/nekohtml/nekohtml/1.9.15/nekohtml-1.9.15.jar
to <https://builds.apache.org/job/Any23-trunk/ws/core/target/appassembler/lib/nekohtml-1.9.15.jar>
[INFO] Installing artifact /home/jenkins/jenkins-slave/maven-repositories/0/xerces/xercesImpl/2.9.1/xercesImpl-2.9.1.jar
to <https://builds.apache.org/job/Any23-trunk/ws/core/target/appassembler/lib/xercesImpl-2.9.1.jar>
[INFO] Installing artifact /home/jenkins/jenkins-slave/maven-repositories/0/xml-apis/xml-apis/1.3.04/xml-apis-1.3.04.jar
to <https://builds.apache.org/job/Any23-trunk/ws/core/target/appassembler/lib/xml-apis-1.3.04.jar>
[INFO] Installing artifact /home/jenkins/jenkins-slave/maven-repositories/0/com/beust/jcommander/1.23/jcommander-1.23.jar
to <https://builds.apache.org/job/Any23-trunk/ws/core/target/appassembler/lib/jcommander-1.23.jar>
[INFO] Installing artifact /home/jenkins/jenkins-slave/maven-repositories/0/org/openrdf/sesame/sesame-rio-rdfxml/2.6.9/sesame-rio-rdfxml-2.6.9.jar
to <https://builds.apache.org/job/Any23-trunk/ws/core/target/appassembler/lib/sesame-rio-rdfxml-2.6.9.jar>
[INFO] Installing artifact /home/jenkins/jenkins-slave/maven-repositories/0/org/openrdf/sesame/sesame-rio-trix/2.6.9/sesame-rio-trix-2.6.9.jar
to <https://builds.apache.org/job/Any23-trunk/ws/core/target/appassembler/lib/sesame-rio-trix-2.6.9.jar>
[INFO] Installing artifact /home/jenkins/jenkins-slave/maven-repositories/0/org/openrdf/sesame/sesame-repository-sail/2.6.9/sesame-repository-sail-2.6.9.jar
to <https://builds.apache.org/job/Any23-trunk/ws/core/target/appassembler/lib/sesame-repository-sail-2.6.9.jar>
[INFO] Installing artifact /home/jenkins/jenkins-slave/maven-repositories/0/org/openrdf/sesame/sesame-repository-api/2.6.9/sesame-repository-api-2.6.9.jar
to <https://builds.apache.org/job/Any23-trunk/ws/core/target/appassembler/lib/sesame-repository-api-2.6.9.jar>
[INFO] Installing artifact /home/jenkins/jenkins-slave/maven-repositories/0/org/openrdf/sesame/sesame-query/2.6.9/sesame-query-2.6.9.jar
to <https://builds.apache.org/job/Any23-trunk/ws/core/target/appassembler/lib/sesame-query-2.6.9.jar>
[INFO] Installing artifact /home/jenkins/jenkins-slave/maven-repositories/0/org/openrdf/sesame/sesame-sail-api/2.6.9/sesame-sail-api-2.6.9.jar
to <https://builds.apache.org/job/Any23-trunk/ws/core/target/appassembler/lib/sesame-sail-api-2.6.9.jar>
[INFO] Installing artifact /home/jenkins/jenkins-slave/maven-repositories/0/org/openrdf/sesame/sesame-queryalgebra-model/2.6.9/sesame-queryalgebra-model-2.6.9.jar
to <https://builds.apache.org/job/Any23-trunk/ws/core/target/appassembler/lib/sesame-queryalgebra-model-2.6.9.jar>
[INFO] Installing artifact /home/jenkins/jenkins-slave/maven-repositories/0/org/openrdf/sesame/sesame-queryparser-api/2.6.9/sesame-queryparser-api-2.6.9.jar
to <https://builds.apache.org/job/Any23-trunk/ws/core/target/appassembler/lib/sesame-queryparser-api-2.6.9.jar>
[INFO] Installing artifact /home/jenkins/jenkins-slave/maven-repositories/0/org/openrdf/sesame/sesame-sail-memory/2.6.9/sesame-sail-memory-2.6.9.jar
to <https://builds.apache.org/job/Any23-trunk/ws/core/target/appassembler/lib/sesame-sail-memory-2.6.9.jar>
[INFO] Installing artifact /home/jenkins/jenkins-slave/maven-repositories/0/org/openrdf/sesame/sesame-sail-inferencer/2.6.9/sesame-sail-inferencer-2.6.9.jar
to <https://builds.apache.org/job/Any23-trunk/ws/core/target/appassembler/lib/sesame-sail-inferencer-2.6.9.jar>
[INFO] Installing artifact /home/jenkins/jenkins-slave/maven-repositories/0/org/openrdf/sesame/sesame-queryparser-serql/2.6.9/sesame-queryparser-serql-2.6.9.jar
to <https://builds.apache.org/job/Any23-trunk/ws/core/target/appassembler/lib/sesame-queryparser-serql-2.6.9.jar>
[INFO] Installing artifact /home/jenkins/jenkins-slave/maven-repositories/0/org/openrdf/sesame/sesame-queryalgebra-evaluation/2.6.9/sesame-queryalgebra-evaluation-2.6.9.jar
to <https://builds.apache.org/job/Any23-trunk/ws/core/target/appassembler/lib/sesame-queryalgebra-evaluation-2.6.9.jar>
[INFO] Installing artifact /home/jenkins/jenkins-slave/maven-repositories/0/org/openrdf/sesame/sesame-repository-sparql/2.6.9/sesame-repository-sparql-2.6.9.jar
to <https://builds.apache.org/job/Any23-trunk/ws/core/target/appassembler/lib/sesame-repository-sparql-2.6.9.jar>
[INFO] Installing artifact /home/jenkins/jenkins-slave/maven-repositories/0/org/openrdf/sesame/sesame-http-client/2.6.9/sesame-http-client-2.6.9.jar
to <https://builds.apache.org/job/Any23-trunk/ws/core/target/appassembler/lib/sesame-http-client-2.6.9.jar>
[INFO] Installing artifact /home/jenkins/jenkins-slave/maven-repositories/0/org/openrdf/sesame/sesame-http-protocol/2.6.9/sesame-http-protocol-2.6.9.jar
to <https://builds.apache.org/job/Any23-trunk/ws/core/target/appassembler/lib/sesame-http-protocol-2.6.9.jar>
[INFO] Installing artifact /home/jenkins/jenkins-slave/maven-repositories/0/org/openrdf/sesame/sesame-queryresultio-api/2.6.9/sesame-queryresultio-api-2.6.9.jar
to <https://builds.apache.org/job/Any23-trunk/ws/core/target/appassembler/lib/sesame-queryresultio-api-2.6.9.jar>
[INFO] Installing artifact /home/jenkins/jenkins-slave/maven-repositories/0/org/openrdf/sesame/sesame-queryresultio-sparqlxml/2.6.9/sesame-queryresultio-sparqlxml-2.6.9.jar
to <https://builds.apache.org/job/Any23-trunk/ws/core/target/appassembler/lib/sesame-queryresultio-sparqlxml-2.6.9.jar>
[INFO] Installing artifact /home/jenkins/jenkins-slave/maven-repositories/0/info/aduna/commons/aduna-commons-xml/2.7.0/aduna-commons-xml-2.7.0.jar
to <https://builds.apache.org/job/Any23-trunk/ws/core/target/appassembler/lib/aduna-commons-xml-2.7.0.jar>
[INFO] Installing artifact /home/jenkins/jenkins-slave/maven-repositories/0/info/aduna/commons/aduna-commons-text/2.7.0/aduna-commons-text-2.7.0.jar
to <https://builds.apache.org/job/Any23-trunk/ws/core/target/appassembler/lib/aduna-commons-text-2.7.0.jar>
[INFO] Installing artifact /home/jenkins/jenkins-slave/maven-repositories/0/info/aduna/commons/aduna-commons-net/2.7.0/aduna-commons-net-2.7.0.jar
to <https://builds.apache.org/job/Any23-trunk/ws/core/target/appassembler/lib/aduna-commons-net-2.7.0.jar>
[INFO] Installing artifact /home/jenkins/jenkins-slave/maven-repositories/0/info/aduna/commons/aduna-commons-lang/2.9.0/aduna-commons-lang-2.9.0.jar
to <https://builds.apache.org/job/Any23-trunk/ws/core/target/appassembler/lib/aduna-commons-lang-2.9.0.jar>
[INFO] Installing artifact /home/jenkins/jenkins-slave/maven-repositories/0/info/aduna/commons/aduna-commons-iteration/2.10.0/aduna-commons-iteration-2.10.0.jar
to <https://builds.apache.org/job/Any23-trunk/ws/core/target/appassembler/lib/aduna-commons-iteration-2.10.0.jar>
[INFO] Installing artifact /home/jenkins/jenkins-slave/maven-repositories/0/info/aduna/commons/aduna-commons-concurrent/2.7.0/aduna-commons-concurrent-2.7.0.jar
to <https://builds.apache.org/job/Any23-trunk/ws/core/target/appassembler/lib/aduna-commons-concurrent-2.7.0.jar>
[INFO] Installing artifact /home/jenkins/jenkins-slave/maven-repositories/0/info/aduna/commons/aduna-commons-io/2.10.0/aduna-commons-io-2.10.0.jar
to <https://builds.apache.org/job/Any23-trunk/ws/core/target/appassembler/lib/aduna-commons-io-2.10.0.jar>
[INFO] Installing artifact /home/jenkins/jenkins-slave/maven-repositories/0/org/kohsuke/metainf-services/metainf-services/1.4/metainf-services-1.4.jar
to <https://builds.apache.org/job/Any23-trunk/ws/core/target/appassembler/lib/metainf-services-1.4.jar>
[INFO] Installing artifact <https://builds.apache.org/job/Any23-trunk/ws/core/target/apache-any23-core-0.8.0-SNAPSHOT.jar>
to <https://builds.apache.org/job/Any23-trunk/ws/core/target/appassembler/lib/apache-any23-core-0.8.0-SNAPSHOT.jar>
[INFO] [assembly:single {execution: assembly}]
[INFO] Reading assembly descriptor: <https://builds.apache.org/job/Any23-trunk/ws/core/src/main/assembly/bin.xml>
[JENKINS] Archiving <https://builds.apache.org/job/Any23-trunk/ws/core/pom.xml> to /home/hudson/hudson/jobs/Any23-trunk/modules/org.apache.any23$apache-any23-core/builds/2013-06-01_12-22-55/archive/org.apache.any23/apache-any23-core/0.8.0-SNAPSHOT/apache-any23-core-0.8.0-SNAPSHOT.pom
[JENKINS] Archiving <https://builds.apache.org/job/Any23-trunk/ws/core/target/apache-any23-core-0.8.0-SNAPSHOT.jar>
to /home/hudson/hudson/jobs/Any23-trunk/modules/org.apache.any23$apache-any23-core/builds/2013-06-01_12-22-55/archive/org.apache.any23/apache-any23-core/0.8.0-SNAPSHOT/apache-any23-core-0.8.0-SNAPSHOT.jar
[INFO] ------------------------------------------------------------------------
[ERROR] BUILD ERROR
[INFO] ------------------------------------------------------------------------
[INFO] Failed to create assembly: Error adding file to archive: <https://builds.apache.org/job/Any23-trunk/ws/core/./../DISCLAIMER.txt>
isn't a file.

[INFO] ------------------------------------------------------------------------
[INFO] For more information, run Maven with the -e switch
[INFO] ------------------------------------------------------------------------
[INFO] Total time: 2 minutes 19 seconds
[INFO] Finished at: Sat Jun 01 12:25:43 UTC 2013
[INFO] Final Memory: 70M/393M
[INFO] ------------------------------------------------------------------------
Waiting for Jenkins to finish collecting data
Maven failed with error.
channel stopped

Mime
View raw message