any23-dev mailing list archives

Site index · List index
Message view « Date » · « Thread »
Top « Date » · « Thread »
From Apache Jenkins Server <jenk...@builds.apache.org>
Subject Build failed in Jenkins: Any23-trunk #691
Date Thu, 13 Jun 2013 07:01:03 GMT
See <https://builds.apache.org/job/Any23-trunk/691/>

------------------------------------------
Started by timer
Building remotely on ubuntu3 in workspace <https://builds.apache.org/job/Any23-trunk/ws/>
Checkout:Any23-trunk / <https://builds.apache.org/job/Any23-trunk/ws/> - hudson.remoting.Channel@5b249085:ubuntu3
Using strategy: Default
Last Built Revision: Revision 2c22a1090ab34df51dd7542c16f6a4af33da1fcd (origin/HEAD, origin/master)
Fetching changes from 1 remote Git repository
Fetching upstream changes from https://git-wip-us.apache.org/repos/asf/any23.git
Seen branch in repository origin/ANY23-141
Seen branch in repository origin/ANY23-156
Seen branch in repository origin/ANY23-156v2
Seen branch in repository origin/ANY23-158
Seen branch in repository origin/HEAD
Seen branch in repository origin/master
Commencing build of Revision 2c22a1090ab34df51dd7542c16f6a4af33da1fcd (origin/HEAD, origin/master)
Checking out Revision 2c22a1090ab34df51dd7542c16f6a4af33da1fcd (origin/HEAD, origin/master)
Warning : There are multiple branch changesets here
Parsing POMs
Failed to transfer Could not find artifact org.apache.any23:apache-any23:pom:0.8.0 in central
(http://repo.maven.apache.org/maven2)
ERROR: Failed to parse POMs
hudson.util.IOException2: remote file operation failed: <https://builds.apache.org/job/Any23-trunk/ws/>
at hudson.remoting.Channel@5b249085:ubuntu3
	at hudson.FilePath.act(FilePath.java:861)
	at hudson.FilePath.act(FilePath.java:838)
	at hudson.maven.MavenModuleSetBuild$MavenModuleSetBuildExecution.parsePoms(MavenModuleSetBuild.java:862)
	at hudson.maven.MavenModuleSetBuild$MavenModuleSetBuildExecution.doRun(MavenModuleSetBuild.java:620)
	at hudson.model.AbstractBuild$AbstractBuildExecution.run(AbstractBuild.java:592)
	at hudson.model.Run.execute(Run.java:1568)
	at hudson.maven.MavenModuleSetBuild.run(MavenModuleSetBuild.java:477)
	at hudson.model.ResourceController.execute(ResourceController.java:88)
	at hudson.model.Executor.run(Executor.java:236)
Caused by: hudson.remoting.ProxyException: hudson.maven.MavenModuleSetBuild$MavenExecutionException:
org.apache.maven.project.ProjectBuildingException: Some problems were encountered while processing
the POMs:
[FATAL] Non-resolvable parent POM: Could not find artifact org.apache.any23:apache-any23:pom:0.8.0
in central (http://repo.maven.apache.org/maven2) and 'parent.relativePath' points at wrong
local POM @ line 21, column 11

	at hudson.maven.MavenModuleSetBuild$PomParser.invoke(MavenModuleSetBuild.java:1229)
	at hudson.maven.MavenModuleSetBuild$PomParser.invoke(MavenModuleSetBuild.java:997)
	at hudson.FilePath$FileCallableWrapper.call(FilePath.java:2348)
	at hudson.remoting.UserRequest.perform(UserRequest.java:118)
	at hudson.remoting.UserRequest.perform(UserRequest.java:48)
	at hudson.remoting.Request$2.run(Request.java:326)
	at hudson.remoting.InterceptingExecutorService$1.call(InterceptingExecutorService.java:72)
	at java.util.concurrent.FutureTask$Sync.innerRun(FutureTask.java:334)
	at java.util.concurrent.FutureTask.run(FutureTask.java:166)
	at java.util.concurrent.ThreadPoolExecutor.runWorker(ThreadPoolExecutor.java:1146)
	at java.util.concurrent.ThreadPoolExecutor$Worker.run(ThreadPoolExecutor.java:615)
	at java.lang.Thread.run(Thread.java:679)
Caused by: hudson.remoting.ProxyException: org.apache.maven.project.ProjectBuildingException:
Some problems were encountered while processing the POMs:
[FATAL] Non-resolvable parent POM: Could not find artifact org.apache.any23:apache-any23:pom:0.8.0
in central (http://repo.maven.apache.org/maven2) and 'parent.relativePath' points at wrong
local POM @ line 21, column 11

	at org.apache.maven.project.DefaultProjectBuilder.build(DefaultProjectBuilder.java:363)
	at hudson.maven.MavenEmbedder.buildProjects(MavenEmbedder.java:361)
	at hudson.maven.MavenEmbedder.readProjects(MavenEmbedder.java:331)
	at hudson.maven.MavenEmbedder.readProject(MavenEmbedder.java:322)
	at hudson.maven.MavenModuleSetBuild$PomParser.readChilds(MavenModuleSetBuild.java:1283)
	at hudson.maven.MavenModuleSetBuild$PomParser.invoke(MavenModuleSetBuild.java:1190)
	... 11 more

Mime
View raw message