any23-dev mailing list archives

Site index · List index
Message view « Date » · « Thread »
Top « Date » · « Thread »
From Apache Jenkins Server <jenk...@builds.apache.org>
Subject Build failed in Jenkins: Any23-trunk #656
Date Sat, 11 May 2013 07:53:04 GMT
See <https://builds.apache.org/job/Any23-trunk/656/>

------------------------------------------
[...truncated 4012 lines...]
------------------------------------------------------------------------

application/trix

------------------------------------------------------------------------
Apache Any23 SUCCESS
Total time: 0s
Finished at: Sat May 11 07:52:16 UTC 2013
Final Memory: 80M/303M
------------------------------------------------------------------------

------------------------------------------------------------------------
Apache Any23 :: mimes
------------------------------------------------------------------------

text/rdf+n3

------------------------------------------------------------------------
Apache Any23 SUCCESS
Total time: 0s
Finished at: Sat May 11 07:52:16 UTC 2013
Final Memory: 80M/303M
------------------------------------------------------------------------
Tests run: 3, Failures: 0, Errors: 0, Skipped: 0, Time elapsed: 0.356 sec
Running org.apache.any23.cli.MicrodataParserTest

------------------------------------------------------------------------
Apache Any23 :: microdata
------------------------------------------------------------------------

{ "result" : [{ "xpath" : "/HTML[1]/BODY[1]/DIV[1]", "id" : "amanda", "refs" : ["a", "b"],
"type" : null, "itemid" : null, "properties" : [ { "xpath" : "/HTML[1]/BODY[1]/DIV[2]", "name"
: "band", "value" : { "content" : { "xpath" : "/HTML[1]/BODY[1]/DIV[2]", "id" : "b", "refs"
: ["c"], "type" : null, "itemid" : null, "properties" : [ { "xpath" : "/HTML[1]/BODY[1]/DIV[3]/P[1]/SPAN[1]",
"name" : "name", "value" : { "content" : "Jazz Band", "type" : "Plain" } }, { "xpath" : "/HTML[1]/BODY[1]/DIV[3]/P[2]/SPAN[1]",
"name" : "size", "value" : { "content" : "12", "type" : "Plain" } } ] }, "type" : "Nested"
} }, { "xpath" : "/HTML[1]/BODY[1]/P[1]/SPAN[1]", "name" : "name", "value" : { "content" :
"Amanda", "type" : "Plain" } } ] }, { "xpath" : "/HTML[1]/BODY[1]/DIV[4]", "id" : null, "refs"
: [], "type" : "http://schema.org/Movie", "itemid" : null, "properties" : [ { "xpath" : "/HTML[1]/BODY[1]/DIV[4]/H1[1]",
"name" : "name", "value" : { "content" : "Avatar", "type" : "Plain" } }, { "xpath" : "/HTML[1]/BODY[1]/DIV[4]/DIV[1]",
"name" : "director", "value" : { "content" : { "xpath" : "/HTML[1]/BODY[1]/DIV[4]/DIV[1]",
"id" : null, "refs" : [], "type" : "http://schema.org/Person", "itemid" : null, "properties"
: [ { "xpath" : "/HTML[1]/BODY[1]/DIV[4]/DIV[1]/SPAN[1]", "name" : "name", "value" : { "content"
: "James Cameron", "type" : "Plain" } } ] }, "type" : "Nested" } } ] }] }
------------------------------------------------------------------------
Apache Any23 SUCCESS
Total time: 0s
Finished at: Sat May 11 07:52:16 UTC 2013
Final Memory: 86M/303M
------------------------------------------------------------------------
Tests run: 2, Failures: 0, Errors: 0, Skipped: 1, Time elapsed: 0.013 sec
Running org.apache.any23.rdf.RDFUtilsTest
Tests run: 6, Failures: 0, Errors: 0, Skipped: 0, Time elapsed: 0.002 sec
Running org.apache.any23.rdf.PrefixesTest
Tests run: 36, Failures: 0, Errors: 0, Skipped: 0, Time elapsed: 0.009 sec
Running org.apache.any23.writer.WriterRegistryTest
Tests run: 7, Failures: 0, Errors: 0, Skipped: 0, Time elapsed: 0.006 sec
Running org.apache.any23.writer.JSONWriterTest
Tests run: 1, Failures: 0, Errors: 0, Skipped: 0, Time elapsed: 0 sec

Results :

Failed tests:   testKelkoo(org.apache.any23.extractor.html.HListingExtractorTest): Assertion
failed! Extracted triples:
  testKelkooFull(org.apache.any23.extractor.html.HListingExtractorTest): Assertion failed!
Extracted triples:

Tests run: 391, Failures: 2, Errors: 0, Skipped: 7

[ERROR] There are test failures.

Please refer to <https://builds.apache.org/job/Any23-trunk/ws/core/target/surefire-reports>
for the individual test results.
[JENKINS] Recording test results
[INFO] [jar:jar {execution: default-jar}]
[INFO] Building jar: <https://builds.apache.org/job/Any23-trunk/ws/core/target/apache-any23-core-0.8.0-SNAPSHOT.jar>
[INFO] [appassembler:assemble {execution: default}]
[INFO] Installing artifact <https://builds.apache.org/job/Any23-trunk/ws/api/target/apache-any23-api-0.8.0-SNAPSHOT.jar>
to <https://builds.apache.org/job/Any23-trunk/ws/core/target/appassembler/lib/apache-any23-api-0.8.0-SNAPSHOT.jar>
[INFO] Installing artifact /home/jenkins/jenkins-slave/maven-repositories/1/org/slf4j/slf4j-api/1.6.6/slf4j-api-1.6.6.jar
to <https://builds.apache.org/job/Any23-trunk/ws/core/target/appassembler/lib/slf4j-api-1.6.6.jar>
[INFO] Installing artifact /home/jenkins/jenkins-slave/maven-repositories/1/org/openrdf/sesame/sesame-model/2.6.9/sesame-model-2.6.9.jar
to <https://builds.apache.org/job/Any23-trunk/ws/core/target/appassembler/lib/sesame-model-2.6.9.jar>
[INFO] Installing artifact /home/jenkins/jenkins-slave/maven-repositories/1/org/openrdf/sesame/sesame-util/2.6.9/sesame-util-2.6.9.jar
to <https://builds.apache.org/job/Any23-trunk/ws/core/target/appassembler/lib/sesame-util-2.6.9.jar>
[INFO] Installing artifact /home/jenkins/jenkins-slave/maven-repositories/1/org/openrdf/sesame/sesame-rio-api/2.6.9/sesame-rio-api-2.6.9.jar
to <https://builds.apache.org/job/Any23-trunk/ws/core/target/appassembler/lib/sesame-rio-api-2.6.9.jar>
[INFO] Installing artifact <https://builds.apache.org/job/Any23-trunk/ws/csvutils/target/apache-any23-csvutils-0.8.0-SNAPSHOT.jar>
to <https://builds.apache.org/job/Any23-trunk/ws/core/target/appassembler/lib/apache-any23-csvutils-0.8.0-SNAPSHOT.jar>
[INFO] Installing artifact /home/jenkins/jenkins-slave/maven-repositories/1/org/apache/commons/commons-csv/1.0-SNAPSHOT-rev1148315/commons-csv-1.0-SNAPSHOT-rev1148315.jar
to <https://builds.apache.org/job/Any23-trunk/ws/core/target/appassembler/lib/commons-csv-1.0-SNAPSHOT-rev1148315.jar>
[INFO] Installing artifact <https://builds.apache.org/job/Any23-trunk/ws/mime/target/apache-any23-mime-0.8.0-SNAPSHOT.jar>
to <https://builds.apache.org/job/Any23-trunk/ws/core/target/appassembler/lib/apache-any23-mime-0.8.0-SNAPSHOT.jar>
[INFO] Installing artifact /home/jenkins/jenkins-slave/maven-repositories/1/commons-io/commons-io/2.4/commons-io-2.4.jar
to <https://builds.apache.org/job/Any23-trunk/ws/core/target/appassembler/lib/commons-io-2.4.jar>
[INFO] Installing artifact /home/jenkins/jenkins-slave/maven-repositories/1/org/apache/tika/tika-core/1.2/tika-core-1.2.jar
to <https://builds.apache.org/job/Any23-trunk/ws/core/target/appassembler/lib/tika-core-1.2.jar>
[INFO] Installing artifact /home/jenkins/jenkins-slave/maven-repositories/1/org/apache/tika/tika-parsers/1.2/tika-parsers-1.2.jar
to <https://builds.apache.org/job/Any23-trunk/ws/core/target/appassembler/lib/tika-parsers-1.2.jar>
[INFO] Installing artifact /home/jenkins/jenkins-slave/maven-repositories/1/org/gagravarr/vorbis-java-tika/0.1/vorbis-java-tika-0.1.jar
to <https://builds.apache.org/job/Any23-trunk/ws/core/target/appassembler/lib/vorbis-java-tika-0.1.jar>
[INFO] Installing artifact /home/jenkins/jenkins-slave/maven-repositories/1/org/gagravarr/vorbis-java-core/0.1/vorbis-java-core-0.1-tests.jar
to <https://builds.apache.org/job/Any23-trunk/ws/core/target/appassembler/lib/vorbis-java-core-0.1-tests.jar>
[INFO] Installing artifact /home/jenkins/jenkins-slave/maven-repositories/1/edu/ucar/netcdf/4.2-min/netcdf-4.2-min.jar
to <https://builds.apache.org/job/Any23-trunk/ws/core/target/appassembler/lib/netcdf-4.2-min.jar>
[INFO] Installing artifact /home/jenkins/jenkins-slave/maven-repositories/1/org/apache/james/apache-mime4j-core/0.7.2/apache-mime4j-core-0.7.2.jar
to <https://builds.apache.org/job/Any23-trunk/ws/core/target/appassembler/lib/apache-mime4j-core-0.7.2.jar>
[INFO] Installing artifact /home/jenkins/jenkins-slave/maven-repositories/1/org/apache/james/apache-mime4j-dom/0.7.2/apache-mime4j-dom-0.7.2.jar
to <https://builds.apache.org/job/Any23-trunk/ws/core/target/appassembler/lib/apache-mime4j-dom-0.7.2.jar>
[INFO] Installing artifact /home/jenkins/jenkins-slave/maven-repositories/1/org/apache/commons/commons-compress/1.4.1/commons-compress-1.4.1.jar
to <https://builds.apache.org/job/Any23-trunk/ws/core/target/appassembler/lib/commons-compress-1.4.1.jar>
[INFO] Installing artifact /home/jenkins/jenkins-slave/maven-repositories/1/org/tukaani/xz/1.0/xz-1.0.jar
to <https://builds.apache.org/job/Any23-trunk/ws/core/target/appassembler/lib/xz-1.0.jar>
[INFO] Installing artifact /home/jenkins/jenkins-slave/maven-repositories/1/commons-codec/commons-codec/1.6/commons-codec-1.6.jar
to <https://builds.apache.org/job/Any23-trunk/ws/core/target/appassembler/lib/commons-codec-1.6.jar>
[INFO] Installing artifact /home/jenkins/jenkins-slave/maven-repositories/1/org/apache/pdfbox/pdfbox/1.7.0/pdfbox-1.7.0.jar
to <https://builds.apache.org/job/Any23-trunk/ws/core/target/appassembler/lib/pdfbox-1.7.0.jar>
[INFO] Installing artifact /home/jenkins/jenkins-slave/maven-repositories/1/org/apache/pdfbox/fontbox/1.7.0/fontbox-1.7.0.jar
to <https://builds.apache.org/job/Any23-trunk/ws/core/target/appassembler/lib/fontbox-1.7.0.jar>
[INFO] Installing artifact /home/jenkins/jenkins-slave/maven-repositories/1/org/apache/pdfbox/jempbox/1.7.0/jempbox-1.7.0.jar
to <https://builds.apache.org/job/Any23-trunk/ws/core/target/appassembler/lib/jempbox-1.7.0.jar>
[INFO] Installing artifact /home/jenkins/jenkins-slave/maven-repositories/1/commons-logging/commons-logging/1.0.4/commons-logging-1.0.4.jar
to <https://builds.apache.org/job/Any23-trunk/ws/core/target/appassembler/lib/commons-logging-1.0.4.jar>
[INFO] Installing artifact /home/jenkins/jenkins-slave/maven-repositories/1/org/bouncycastle/bcmail-jdk15/1.45/bcmail-jdk15-1.45.jar
to <https://builds.apache.org/job/Any23-trunk/ws/core/target/appassembler/lib/bcmail-jdk15-1.45.jar>
[INFO] Installing artifact /home/jenkins/jenkins-slave/maven-repositories/1/org/bouncycastle/bcprov-jdk15/1.45/bcprov-jdk15-1.45.jar
to <https://builds.apache.org/job/Any23-trunk/ws/core/target/appassembler/lib/bcprov-jdk15-1.45.jar>
[INFO] Installing artifact /home/jenkins/jenkins-slave/maven-repositories/1/org/apache/poi/poi/3.8/poi-3.8.jar
to <https://builds.apache.org/job/Any23-trunk/ws/core/target/appassembler/lib/poi-3.8.jar>
[INFO] Installing artifact /home/jenkins/jenkins-slave/maven-repositories/1/org/apache/poi/poi-scratchpad/3.8/poi-scratchpad-3.8.jar
to <https://builds.apache.org/job/Any23-trunk/ws/core/target/appassembler/lib/poi-scratchpad-3.8.jar>
[INFO] Installing artifact /home/jenkins/jenkins-slave/maven-repositories/1/org/apache/poi/poi-ooxml/3.8/poi-ooxml-3.8.jar
to <https://builds.apache.org/job/Any23-trunk/ws/core/target/appassembler/lib/poi-ooxml-3.8.jar>
[INFO] Installing artifact /home/jenkins/jenkins-slave/maven-repositories/1/org/apache/poi/poi-ooxml-schemas/3.8/poi-ooxml-schemas-3.8.jar
to <https://builds.apache.org/job/Any23-trunk/ws/core/target/appassembler/lib/poi-ooxml-schemas-3.8.jar>
[INFO] Installing artifact /home/jenkins/jenkins-slave/maven-repositories/1/org/apache/xmlbeans/xmlbeans/2.3.0/xmlbeans-2.3.0.jar
to <https://builds.apache.org/job/Any23-trunk/ws/core/target/appassembler/lib/xmlbeans-2.3.0.jar>
[INFO] Installing artifact /home/jenkins/jenkins-slave/maven-repositories/1/dom4j/dom4j/1.6.1/dom4j-1.6.1.jar
to <https://builds.apache.org/job/Any23-trunk/ws/core/target/appassembler/lib/dom4j-1.6.1.jar>
[INFO] Installing artifact /home/jenkins/jenkins-slave/maven-repositories/1/org/apache/geronimo/specs/geronimo-stax-api_1.0_spec/1.0.1/geronimo-stax-api_1.0_spec-1.0.1.jar
to <https://builds.apache.org/job/Any23-trunk/ws/core/target/appassembler/lib/geronimo-stax-api_1.0_spec-1.0.1.jar>
[INFO] Installing artifact /home/jenkins/jenkins-slave/maven-repositories/1/org/ccil/cowan/tagsoup/tagsoup/1.2.1/tagsoup-1.2.1.jar
to <https://builds.apache.org/job/Any23-trunk/ws/core/target/appassembler/lib/tagsoup-1.2.1.jar>
[INFO] Installing artifact /home/jenkins/jenkins-slave/maven-repositories/1/asm/asm/3.1/asm-3.1.jar
to <https://builds.apache.org/job/Any23-trunk/ws/core/target/appassembler/lib/asm-3.1.jar>
[INFO] Installing artifact /home/jenkins/jenkins-slave/maven-repositories/1/com/googlecode/mp4parser/isoparser/1.0-RC-1/isoparser-1.0-RC-1.jar
to <https://builds.apache.org/job/Any23-trunk/ws/core/target/appassembler/lib/isoparser-1.0-RC-1.jar>
[INFO] Installing artifact /home/jenkins/jenkins-slave/maven-repositories/1/org/aspectj/aspectjrt/1.6.11/aspectjrt-1.6.11.jar
to <https://builds.apache.org/job/Any23-trunk/ws/core/target/appassembler/lib/aspectjrt-1.6.11.jar>
[INFO] Installing artifact /home/jenkins/jenkins-slave/maven-repositories/1/com/drewnoakes/metadata-extractor/2.4.0-beta-1/metadata-extractor-2.4.0-beta-1.jar
to <https://builds.apache.org/job/Any23-trunk/ws/core/target/appassembler/lib/metadata-extractor-2.4.0-beta-1.jar>
[INFO] Installing artifact /home/jenkins/jenkins-slave/maven-repositories/1/de/l3s/boilerpipe/boilerpipe/1.1.0/boilerpipe-1.1.0.jar
to <https://builds.apache.org/job/Any23-trunk/ws/core/target/appassembler/lib/boilerpipe-1.1.0.jar>
[INFO] Installing artifact /home/jenkins/jenkins-slave/maven-repositories/1/rome/rome/0.9/rome-0.9.jar
to <https://builds.apache.org/job/Any23-trunk/ws/core/target/appassembler/lib/rome-0.9.jar>
[INFO] Installing artifact /home/jenkins/jenkins-slave/maven-repositories/1/jdom/jdom/1.0/jdom-1.0.jar
to <https://builds.apache.org/job/Any23-trunk/ws/core/target/appassembler/lib/jdom-1.0.jar>
[INFO] Installing artifact /home/jenkins/jenkins-slave/maven-repositories/1/org/gagravarr/vorbis-java-core/0.1/vorbis-java-core-0.1.jar
to <https://builds.apache.org/job/Any23-trunk/ws/core/target/appassembler/lib/vorbis-java-core-0.1.jar>
[INFO] Installing artifact /home/jenkins/jenkins-slave/maven-repositories/1/com/googlecode/juniversalchardet/juniversalchardet/1.0.3/juniversalchardet-1.0.3.jar
to <https://builds.apache.org/job/Any23-trunk/ws/core/target/appassembler/lib/juniversalchardet-1.0.3.jar>
[INFO] Installing artifact /home/jenkins/jenkins-slave/maven-repositories/1/org/openrdf/sesame/sesame-rio-turtle/2.6.9/sesame-rio-turtle-2.6.9.jar
to <https://builds.apache.org/job/Any23-trunk/ws/core/target/appassembler/lib/sesame-rio-turtle-2.6.9.jar>
[INFO] Installing artifact /home/jenkins/jenkins-slave/maven-repositories/1/org/openrdf/sesame/sesame-rio-ntriples/2.6.9/sesame-rio-ntriples-2.6.9.jar
to <https://builds.apache.org/job/Any23-trunk/ws/core/target/appassembler/lib/sesame-rio-ntriples-2.6.9.jar>
[INFO] Installing artifact /home/jenkins/jenkins-slave/maven-repositories/1/org/openrdf/sesame/sesame-rio-n3/2.6.9/sesame-rio-n3-2.6.9.jar
to <https://builds.apache.org/job/Any23-trunk/ws/core/target/appassembler/lib/sesame-rio-n3-2.6.9.jar>
[INFO] Installing artifact <https://builds.apache.org/job/Any23-trunk/ws/encoding/target/apache-any23-encoding-0.8.0-SNAPSHOT.jar>
to <https://builds.apache.org/job/Any23-trunk/ws/core/target/appassembler/lib/apache-any23-encoding-0.8.0-SNAPSHOT.jar>
[INFO] Installing artifact /home/jenkins/jenkins-slave/maven-repositories/1/commons-lang/commons-lang/2.4/commons-lang-2.4.jar
to <https://builds.apache.org/job/Any23-trunk/ws/core/target/appassembler/lib/commons-lang-2.4.jar>
[INFO] Installing artifact /home/jenkins/jenkins-slave/maven-repositories/1/commons-httpclient/commons-httpclient/3.1/commons-httpclient-3.1.jar
to <https://builds.apache.org/job/Any23-trunk/ws/core/target/appassembler/lib/commons-httpclient-3.1.jar>
[INFO] Installing artifact /home/jenkins/jenkins-slave/maven-repositories/1/net/sourceforge/nekohtml/nekohtml/1.9.15/nekohtml-1.9.15.jar
to <https://builds.apache.org/job/Any23-trunk/ws/core/target/appassembler/lib/nekohtml-1.9.15.jar>
[INFO] Installing artifact /home/jenkins/jenkins-slave/maven-repositories/1/xerces/xercesImpl/2.9.1/xercesImpl-2.9.1.jar
to <https://builds.apache.org/job/Any23-trunk/ws/core/target/appassembler/lib/xercesImpl-2.9.1.jar>
[INFO] Installing artifact /home/jenkins/jenkins-slave/maven-repositories/1/xml-apis/xml-apis/1.3.04/xml-apis-1.3.04.jar
to <https://builds.apache.org/job/Any23-trunk/ws/core/target/appassembler/lib/xml-apis-1.3.04.jar>
[INFO] Installing artifact /home/jenkins/jenkins-slave/maven-repositories/1/com/beust/jcommander/1.23/jcommander-1.23.jar
to <https://builds.apache.org/job/Any23-trunk/ws/core/target/appassembler/lib/jcommander-1.23.jar>
[INFO] Installing artifact /home/jenkins/jenkins-slave/maven-repositories/1/org/openrdf/sesame/sesame-rio-rdfxml/2.6.9/sesame-rio-rdfxml-2.6.9.jar
to <https://builds.apache.org/job/Any23-trunk/ws/core/target/appassembler/lib/sesame-rio-rdfxml-2.6.9.jar>
[INFO] Installing artifact /home/jenkins/jenkins-slave/maven-repositories/1/org/openrdf/sesame/sesame-rio-trix/2.6.9/sesame-rio-trix-2.6.9.jar
to <https://builds.apache.org/job/Any23-trunk/ws/core/target/appassembler/lib/sesame-rio-trix-2.6.9.jar>
[INFO] Installing artifact /home/jenkins/jenkins-slave/maven-repositories/1/org/openrdf/sesame/sesame-repository-sail/2.6.9/sesame-repository-sail-2.6.9.jar
to <https://builds.apache.org/job/Any23-trunk/ws/core/target/appassembler/lib/sesame-repository-sail-2.6.9.jar>
[INFO] Installing artifact /home/jenkins/jenkins-slave/maven-repositories/1/org/openrdf/sesame/sesame-repository-api/2.6.9/sesame-repository-api-2.6.9.jar
to <https://builds.apache.org/job/Any23-trunk/ws/core/target/appassembler/lib/sesame-repository-api-2.6.9.jar>
[INFO] Installing artifact /home/jenkins/jenkins-slave/maven-repositories/1/org/openrdf/sesame/sesame-query/2.6.9/sesame-query-2.6.9.jar
to <https://builds.apache.org/job/Any23-trunk/ws/core/target/appassembler/lib/sesame-query-2.6.9.jar>
[INFO] Installing artifact /home/jenkins/jenkins-slave/maven-repositories/1/org/openrdf/sesame/sesame-sail-api/2.6.9/sesame-sail-api-2.6.9.jar
to <https://builds.apache.org/job/Any23-trunk/ws/core/target/appassembler/lib/sesame-sail-api-2.6.9.jar>
[INFO] Installing artifact /home/jenkins/jenkins-slave/maven-repositories/1/org/openrdf/sesame/sesame-queryalgebra-model/2.6.9/sesame-queryalgebra-model-2.6.9.jar
to <https://builds.apache.org/job/Any23-trunk/ws/core/target/appassembler/lib/sesame-queryalgebra-model-2.6.9.jar>
[INFO] Installing artifact /home/jenkins/jenkins-slave/maven-repositories/1/org/openrdf/sesame/sesame-queryparser-api/2.6.9/sesame-queryparser-api-2.6.9.jar
to <https://builds.apache.org/job/Any23-trunk/ws/core/target/appassembler/lib/sesame-queryparser-api-2.6.9.jar>
[INFO] Installing artifact /home/jenkins/jenkins-slave/maven-repositories/1/org/openrdf/sesame/sesame-sail-memory/2.6.9/sesame-sail-memory-2.6.9.jar
to <https://builds.apache.org/job/Any23-trunk/ws/core/target/appassembler/lib/sesame-sail-memory-2.6.9.jar>
[INFO] Installing artifact /home/jenkins/jenkins-slave/maven-repositories/1/org/openrdf/sesame/sesame-sail-inferencer/2.6.9/sesame-sail-inferencer-2.6.9.jar
to <https://builds.apache.org/job/Any23-trunk/ws/core/target/appassembler/lib/sesame-sail-inferencer-2.6.9.jar>
[INFO] Installing artifact /home/jenkins/jenkins-slave/maven-repositories/1/org/openrdf/sesame/sesame-queryparser-serql/2.6.9/sesame-queryparser-serql-2.6.9.jar
to <https://builds.apache.org/job/Any23-trunk/ws/core/target/appassembler/lib/sesame-queryparser-serql-2.6.9.jar>
[INFO] Installing artifact /home/jenkins/jenkins-slave/maven-repositories/1/org/openrdf/sesame/sesame-queryalgebra-evaluation/2.6.9/sesame-queryalgebra-evaluation-2.6.9.jar
to <https://builds.apache.org/job/Any23-trunk/ws/core/target/appassembler/lib/sesame-queryalgebra-evaluation-2.6.9.jar>
[INFO] Installing artifact /home/jenkins/jenkins-slave/maven-repositories/1/org/openrdf/sesame/sesame-repository-sparql/2.6.9/sesame-repository-sparql-2.6.9.jar
to <https://builds.apache.org/job/Any23-trunk/ws/core/target/appassembler/lib/sesame-repository-sparql-2.6.9.jar>
[INFO] Installing artifact /home/jenkins/jenkins-slave/maven-repositories/1/org/openrdf/sesame/sesame-http-client/2.6.9/sesame-http-client-2.6.9.jar
to <https://builds.apache.org/job/Any23-trunk/ws/core/target/appassembler/lib/sesame-http-client-2.6.9.jar>
[INFO] Installing artifact /home/jenkins/jenkins-slave/maven-repositories/1/org/openrdf/sesame/sesame-http-protocol/2.6.9/sesame-http-protocol-2.6.9.jar
to <https://builds.apache.org/job/Any23-trunk/ws/core/target/appassembler/lib/sesame-http-protocol-2.6.9.jar>
[INFO] Installing artifact /home/jenkins/jenkins-slave/maven-repositories/1/org/openrdf/sesame/sesame-queryresultio-api/2.6.9/sesame-queryresultio-api-2.6.9.jar
to <https://builds.apache.org/job/Any23-trunk/ws/core/target/appassembler/lib/sesame-queryresultio-api-2.6.9.jar>
[INFO] Installing artifact /home/jenkins/jenkins-slave/maven-repositories/1/org/openrdf/sesame/sesame-queryresultio-sparqlxml/2.6.9/sesame-queryresultio-sparqlxml-2.6.9.jar
to <https://builds.apache.org/job/Any23-trunk/ws/core/target/appassembler/lib/sesame-queryresultio-sparqlxml-2.6.9.jar>
[INFO] Installing artifact /home/jenkins/jenkins-slave/maven-repositories/1/info/aduna/commons/aduna-commons-xml/2.7.0/aduna-commons-xml-2.7.0.jar
to <https://builds.apache.org/job/Any23-trunk/ws/core/target/appassembler/lib/aduna-commons-xml-2.7.0.jar>
[INFO] Installing artifact /home/jenkins/jenkins-slave/maven-repositories/1/info/aduna/commons/aduna-commons-text/2.7.0/aduna-commons-text-2.7.0.jar
to <https://builds.apache.org/job/Any23-trunk/ws/core/target/appassembler/lib/aduna-commons-text-2.7.0.jar>
[INFO] Installing artifact /home/jenkins/jenkins-slave/maven-repositories/1/info/aduna/commons/aduna-commons-net/2.7.0/aduna-commons-net-2.7.0.jar
to <https://builds.apache.org/job/Any23-trunk/ws/core/target/appassembler/lib/aduna-commons-net-2.7.0.jar>
[INFO] Installing artifact /home/jenkins/jenkins-slave/maven-repositories/1/info/aduna/commons/aduna-commons-lang/2.9.0/aduna-commons-lang-2.9.0.jar
to <https://builds.apache.org/job/Any23-trunk/ws/core/target/appassembler/lib/aduna-commons-lang-2.9.0.jar>
[INFO] Installing artifact /home/jenkins/jenkins-slave/maven-repositories/1/info/aduna/commons/aduna-commons-iteration/2.10.0/aduna-commons-iteration-2.10.0.jar
to <https://builds.apache.org/job/Any23-trunk/ws/core/target/appassembler/lib/aduna-commons-iteration-2.10.0.jar>
[INFO] Installing artifact /home/jenkins/jenkins-slave/maven-repositories/1/info/aduna/commons/aduna-commons-concurrent/2.7.0/aduna-commons-concurrent-2.7.0.jar
to <https://builds.apache.org/job/Any23-trunk/ws/core/target/appassembler/lib/aduna-commons-concurrent-2.7.0.jar>
[INFO] Installing artifact /home/jenkins/jenkins-slave/maven-repositories/1/info/aduna/commons/aduna-commons-io/2.10.0/aduna-commons-io-2.10.0.jar
to <https://builds.apache.org/job/Any23-trunk/ws/core/target/appassembler/lib/aduna-commons-io-2.10.0.jar>
[INFO] Installing artifact /home/jenkins/jenkins-slave/maven-repositories/1/org/kohsuke/metainf-services/metainf-services/1.4/metainf-services-1.4.jar
to <https://builds.apache.org/job/Any23-trunk/ws/core/target/appassembler/lib/metainf-services-1.4.jar>
[INFO] Installing artifact <https://builds.apache.org/job/Any23-trunk/ws/core/target/apache-any23-core-0.8.0-SNAPSHOT.jar>
to <https://builds.apache.org/job/Any23-trunk/ws/core/target/appassembler/lib/apache-any23-core-0.8.0-SNAPSHOT.jar>
[INFO] [assembly:single {execution: assembly}]
[INFO] Reading assembly descriptor: <https://builds.apache.org/job/Any23-trunk/ws/core/src/main/assembly/bin.xml>
[INFO] Building tar: <https://builds.apache.org/job/Any23-trunk/ws/core/target/apache-any23-core-0.8.0-SNAPSHOT.tar.gz>
[INFO] Building zip: <https://builds.apache.org/job/Any23-trunk/ws/core/target/apache-any23-core-0.8.0-SNAPSHOT.zip>
[INFO] [jar:test-jar {execution: default}]
[INFO] Building jar: <https://builds.apache.org/job/Any23-trunk/ws/core/target/apache-any23-core-0.8.0-SNAPSHOT-tests.jar>
[INFO] [install:install {execution: default-install}]
[INFO] Installing <https://builds.apache.org/job/Any23-trunk/ws/core/target/apache-any23-core-0.8.0-SNAPSHOT.jar>
to /home/jenkins/jenkins-slave/maven-repositories/1/org/apache/any23/apache-any23-core/0.8.0-SNAPSHOT/apache-any23-core-0.8.0-SNAPSHOT.jar
[INFO] Installing <https://builds.apache.org/job/Any23-trunk/ws/core/target/apache-any23-core-0.8.0-SNAPSHOT.tar.gz>
to /home/jenkins/jenkins-slave/maven-repositories/1/org/apache/any23/apache-any23-core/0.8.0-SNAPSHOT/apache-any23-core-0.8.0-SNAPSHOT.tar.gz
[INFO] Installing <https://builds.apache.org/job/Any23-trunk/ws/core/target/apache-any23-core-0.8.0-SNAPSHOT.zip>
to /home/jenkins/jenkins-slave/maven-repositories/1/org/apache/any23/apache-any23-core/0.8.0-SNAPSHOT/apache-any23-core-0.8.0-SNAPSHOT.zip
[INFO] Installing <https://builds.apache.org/job/Any23-trunk/ws/core/target/apache-any23-core-0.8.0-SNAPSHOT-tests.jar>
to /home/jenkins/jenkins-slave/maven-repositories/1/org/apache/any23/apache-any23-core/0.8.0-SNAPSHOT/apache-any23-core-0.8.0-SNAPSHOT-tests.jar
[INFO] [deploy:deploy {execution: default-deploy}]
[INFO] Retrieving previous build number from apache.snapshots.https
[WARNING] *** CHECKSUM FAILED - Checksum failed on download: local = '647937be7e2a85295b8630e564498cb62558f7b6';
remote = '9d902e811c5dfb328d410cd7e2c678c1a2bc4fd5' - RETRYING
[WARNING] *** CHECKSUM FAILED - Checksum failed on download: local = '647937be7e2a85295b8630e564498cb62558f7b6';
remote = '9d902e811c5dfb328d410cd7e2c678c1a2bc4fd5' - IGNORING
Uploading: https://repository.apache.org/content/repositories/snapshots/org/apache/any23/apache-any23-core/0.8.0-SNAPSHOT/apache-any23-core-0.8.0-20130511.075140-103.jar
374K uploaded  (apache-any23-core-0.8.0-20130511.075140-103.jar)
[INFO] Uploading project information for apache-any23-core 0.8.0-20130511.075140-103
[INFO] Retrieving previous metadata from apache.snapshots.https
[WARNING] *** CHECKSUM FAILED - Checksum failed on download: local = '250da19271706d0d11c33cc5de991f002fd8230f';
remote = '2161e9c3527a1d9bf52e4d00448b0ba67af0a779' - RETRYING
[WARNING] *** CHECKSUM FAILED - Checksum failed on download: local = '250da19271706d0d11c33cc5de991f002fd8230f';
remote = '2161e9c3527a1d9bf52e4d00448b0ba67af0a779' - IGNORING
[INFO] Uploading repository metadata for: 'artifact org.apache.any23:apache-any23-core'
[INFO] Retrieving previous metadata from apache.snapshots.https
[WARNING] *** CHECKSUM FAILED - Checksum failed on download: local = '647937be7e2a85295b8630e564498cb62558f7b6';
remote = '9d902e811c5dfb328d410cd7e2c678c1a2bc4fd5' - RETRYING
[WARNING] *** CHECKSUM FAILED - Checksum failed on download: local = '647937be7e2a85295b8630e564498cb62558f7b6';
remote = '9d902e811c5dfb328d410cd7e2c678c1a2bc4fd5' - IGNORING
[INFO] Uploading repository metadata for: 'snapshot org.apache.any23:apache-any23-core:0.8.0-SNAPSHOT'
[INFO] Retrieving previous build number from apache.snapshots.https
Uploading: https://repository.apache.org/content/repositories/snapshots/org/apache/any23/apache-any23-core/0.8.0-SNAPSHOT/apache-any23-core-0.8.0-20130511.075140-103.tar.gz
26056K uploaded  (apache-any23-core-0.8.0-20130511.075140-103.tar.gz)
[INFO] Retrieving previous build number from apache.snapshots.https
Uploading: https://repository.apache.org/content/repositories/snapshots/org/apache/any23/apache-any23-core/0.8.0-SNAPSHOT/apache-any23-core-0.8.0-20130511.075140-103.zip
26071K uploaded  (apache-any23-core-0.8.0-20130511.075140-103.zip)
[INFO] Retrieving previous build number from apache.snapshots.https
Uploading: https://repository.apache.org/content/repositories/snapshots/org/apache/any23/apache-any23-core/0.8.0-SNAPSHOT/apache-any23-core-0.8.0-20130511.075140-103-tests.jar
156K uploaded  (apache-any23-core-0.8.0-20130511.075140-103-tests.jar)
[JENKINS] Archiving <https://builds.apache.org/job/Any23-trunk/ws/core/pom.xml> to /home/hudson/hudson/jobs/Any23-trunk/modules/org.apache.any23$apache-any23-core/builds/2013-05-11_07-51-19/archive/org.apache.any23/apache-any23-core/0.8.0-SNAPSHOT/apache-any23-core-0.8.0-SNAPSHOT.pom
[JENKINS] Archiving <https://builds.apache.org/job/Any23-trunk/ws/core/target/apache-any23-core-0.8.0-SNAPSHOT.jar>
to /home/hudson/hudson/jobs/Any23-trunk/modules/org.apache.any23$apache-any23-core/builds/2013-05-11_07-51-19/archive/org.apache.any23/apache-any23-core/0.8.0-20130511.075140-103/apache-any23-core-0.8.0-20130511.075140-103.jar
[JENKINS] Archiving <https://builds.apache.org/job/Any23-trunk/ws/core/target/apache-any23-core-0.8.0-SNAPSHOT.tar.gz>
to /home/hudson/hudson/jobs/Any23-trunk/modules/org.apache.any23$apache-any23-core/builds/2013-05-11_07-51-19/archive/org.apache.any23/apache-any23-core/0.8.0-20130511.075140-103/apache-any23-core-0.8.0-20130511.075140-103.tar.gz
[JENKINS] Archiving <https://builds.apache.org/job/Any23-trunk/ws/core/target/apache-any23-core-0.8.0-SNAPSHOT.zip>
to /home/hudson/hudson/jobs/Any23-trunk/modules/org.apache.any23$apache-any23-core/builds/2013-05-11_07-51-19/archive/org.apache.any23/apache-any23-core/0.8.0-20130511.075140-103/apache-any23-core-0.8.0-20130511.075140-103.zip
[JENKINS] Archiving <https://builds.apache.org/job/Any23-trunk/ws/core/target/apache-any23-core-0.8.0-SNAPSHOT-tests.jar>
to /home/hudson/hudson/jobs/Any23-trunk/modules/org.apache.any23$apache-any23-core/builds/2013-05-11_07-51-19/archive/org.apache.any23/apache-any23-core/0.8.0-20130511.075140-103/apache-any23-core-0.8.0-20130511.075140-103-tests.jar
[INFO] ------------------------------------------------------------------------
[INFO] Building Apache Any23 :: Plugins :: Basic Crawler
[INFO]    task-segment: [clean, deploy]
[INFO] ------------------------------------------------------------------------
[INFO] [clean:clean {execution: default-clean}]
[INFO] Deleting <https://builds.apache.org/job/Any23-trunk/ws/plugins/basic-crawler/target>
[INFO] [cobertura:clean {execution: default}]
[INFO] [buildnumber:create {execution: default}]
[INFO] Checking for local modifications: skipped.
[INFO] Updating project files from SCM: skipped.
[INFO] Executing: /bin/sh -c cd <https://builds.apache.org/job/Any23-trunk/ws/plugins/basic-crawler>
&& git show
[INFO] Working directory: <https://builds.apache.org/job/Any23-trunk/ws/plugins/basic-crawler>
[INFO] Storing buildNumber: null at timestamp: 1368258770165
[INFO] Executing: /bin/sh -c cd <https://builds.apache.org/job/Any23-trunk/ws/plugins/basic-crawler>
&& git show
[INFO] Working directory: <https://builds.apache.org/job/Any23-trunk/ws/plugins/basic-crawler>
[INFO] Storing buildScmBranch: UNKNOWN
[debug] execute contextualize
[INFO] [resources:resources {execution: default-resources}]
[INFO] Using 'UTF-8' encoding to copy filtered resources.
[INFO] Copying 2 resources to META-INF
[INFO] [compiler:compile {execution: default-compile}]
[INFO] Compiling 6 source files to <https://builds.apache.org/job/Any23-trunk/ws/plugins/basic-crawler/target/classes>
[INFO] -------------------------------------------------------------
[ERROR] COMPILATION ERROR : 
[INFO] -------------------------------------------------------------
[ERROR] <https://builds.apache.org/job/Any23-trunk/ws/plugins/basic-crawler/src/main/java/org/apache/any23/plugin/crawler/DefaultWebCrawler.java>:[23,16]
package org.slf4j does not exist
[ERROR] <https://builds.apache.org/job/Any23-trunk/ws/plugins/basic-crawler/src/main/java/org/apache/any23/plugin/crawler/DefaultWebCrawler.java>:[24,16]
package org.slf4j does not exist
[ERROR] <https://builds.apache.org/job/Any23-trunk/ws/plugins/basic-crawler/src/main/java/org/apache/any23/plugin/crawler/DefaultWebCrawler.java>:[35,25]
cannot find symbol
symbol  : class Logger
location: class org.apache.any23.plugin.crawler.DefaultWebCrawler
[ERROR] <https://builds.apache.org/job/Any23-trunk/ws/plugins/basic-crawler/src/main/java/org/apache/any23/plugin/crawler/DefaultWebCrawler.java>:[23,16]
package org.slf4j does not exist
[ERROR] <https://builds.apache.org/job/Any23-trunk/ws/plugins/basic-crawler/src/main/java/org/apache/any23/plugin/crawler/DefaultWebCrawler.java>:[24,16]
package org.slf4j does not exist
[ERROR] <https://builds.apache.org/job/Any23-trunk/ws/plugins/basic-crawler/src/main/java/org/apache/any23/plugin/crawler/DefaultWebCrawler.java>:[35,25]
cannot find symbol
symbol  : class Logger
location: class org.apache.any23.plugin.crawler.DefaultWebCrawler
[ERROR] <https://builds.apache.org/job/Any23-trunk/ws/plugins/basic-crawler/src/main/java/org/apache/any23/plugin/crawler/DefaultWebCrawler.java>:[35,41]
cannot find symbol
symbol  : variable LoggerFactory
location: class org.apache.any23.plugin.crawler.DefaultWebCrawler
[INFO] 7 errors 
[INFO] -------------------------------------------------------------
[JENKINS] Archiving <https://builds.apache.org/job/Any23-trunk/ws/plugins/basic-crawler/pom.xml>
to /home/hudson/hudson/jobs/Any23-trunk/modules/org.apache.any23.plugins$apache-any23-basic-crawler/builds/2013-05-11_07-51-19/archive/org.apache.any23.plugins/apache-any23-basic-crawler/1.0.2-SNAPSHOT/apache-any23-basic-crawler-1.0.2-SNAPSHOT.pom
[INFO] ------------------------------------------------------------------------
[ERROR] BUILD FAILURE
[INFO] ------------------------------------------------------------------------
[INFO] Compilation failure

<https://builds.apache.org/job/Any23-trunk/ws/plugins/basic-crawler/src/main/java/org/apache/any23/plugin/crawler/DefaultWebCrawler.java>:[23,16]
package org.slf4j does not exist
<https://builds.apache.org/job/Any23-trunk/ws/plugins/basic-crawler/src/main/java/org/apache/any23/plugin/crawler/DefaultWebCrawler.java>:[24,16]
package org.slf4j does not exist
<https://builds.apache.org/job/Any23-trunk/ws/plugins/basic-crawler/src/main/java/org/apache/any23/plugin/crawler/DefaultWebCrawler.java>:[35,25]
cannot find symbol
symbol  : class Logger
location: class org.apache.any23.plugin.crawler.DefaultWebCrawler
<https://builds.apache.org/job/Any23-trunk/ws/plugins/basic-crawler/src/main/java/org/apache/any23/plugin/crawler/DefaultWebCrawler.java>:[23,16]
package org.slf4j does not exist
<https://builds.apache.org/job/Any23-trunk/ws/plugins/basic-crawler/src/main/java/org/apache/any23/plugin/crawler/DefaultWebCrawler.java>:[24,16]
package org.slf4j does not exist
<https://builds.apache.org/job/Any23-trunk/ws/plugins/basic-crawler/src/main/java/org/apache/any23/plugin/crawler/DefaultWebCrawler.java>:[35,25]
cannot find symbol
symbol  : class Logger
location: class org.apache.any23.plugin.crawler.DefaultWebCrawler
<https://builds.apache.org/job/Any23-trunk/ws/plugins/basic-crawler/src/main/java/org/apache/any23/plugin/crawler/DefaultWebCrawler.java>:[35,41]
cannot find symbol
symbol  : variable LoggerFactory
location: class org.apache.any23.plugin.crawler.DefaultWebCrawler

[INFO] ------------------------------------------------------------------------
[INFO] For more information, run Maven with the -e switch
[INFO] ------------------------------------------------------------------------
[INFO] Total time: 1 minute 23 seconds
[INFO] Finished at: Sat May 11 07:52:50 UTC 2013
[INFO] Final Memory: 73M/448M
[INFO] ------------------------------------------------------------------------
Waiting for Jenkins to finish collecting data
Maven failed with error.
channel stopped

Mime
View raw message