any23-dev mailing list archives

Site index · List index
Message view « Date » · « Thread »
Top « Date » · « Thread »
From Apache Jenkins Server <jenk...@builds.apache.org>
Subject Build failed in Jenkins: Any23-trunk #650
Date Thu, 02 May 2013 02:52:43 GMT
See <https://builds.apache.org/job/Any23-trunk/650/changes>

Changes:

[lewismc] ANY23-156 - Add logging dependencies to plugins and service

[lewismc] ANY23-156 - Add logging dependencies to plugins and service

[lewismc] prepare for 0.8.0 RC#1

[lewismc] temp disable crawler cli test

[lewismc] update pom.xml for new git scm repository

[lewismc] update of pom.xml to remove rat plugin from release build, there is a problem with
not ignoring new .git repos

[lewismc] [maven-release-plugin] prepare release apache-any23-0.8.0

[lewismc] [maven-release-plugin] prepare for next development iteration

------------------------------------------
[...truncated 3981 lines...]
Tests run: 6, Failures: 0, Errors: 0, Skipped: 0, Time elapsed: 0.015 sec
Running org.apache.any23.extractor.html.HCalendarExtractorTest
Tests run: 27, Failures: 0, Errors: 0, Skipped: 0, Time elapsed: 0.296 sec
Running org.apache.any23.extractor.html.AdrExtractorTest
Tests run: 1, Failures: 0, Errors: 0, Skipped: 0, Time elapsed: 0.079 sec
Running org.apache.any23.extractor.html.EncodingTest
Tests run: 5, Failures: 0, Errors: 0, Skipped: 0, Time elapsed: 0.016 sec
Running org.apache.any23.extractor.html.HReviewExtractorTest
Tests run: 6, Failures: 0, Errors: 0, Skipped: 0, Time elapsed: 0.052 sec
Running org.apache.any23.extractor.html.DomUtilsTest
Tests run: 7, Failures: 0, Errors: 0, Skipped: 0, Time elapsed: 0.073 sec
Running org.apache.any23.extractor.html.HRecipeExtractorTest
Tests run: 2, Failures: 0, Errors: 0, Skipped: 0, Time elapsed: 0.018 sec
Running org.apache.any23.extractor.html.TitleExtractorTest
Tests run: 5, Failures: 0, Errors: 0, Skipped: 0, Time elapsed: 0.033 sec
Running org.apache.any23.extractor.html.HListingExtractorTest
Tests run: 26, Failures: 2, Errors: 0, Skipped: 0, Time elapsed: 0.293 sec <<< FAILURE!
Running org.apache.any23.extractor.html.HeadLinkExtractorTest
Tests run: 1, Failures: 0, Errors: 0, Skipped: 0, Time elapsed: 0 sec
Running org.apache.any23.extractor.html.TurtleHTMLExtractorTest
Tests run: 1, Failures: 0, Errors: 0, Skipped: 0, Time elapsed: 0 sec
Running org.apache.any23.extractor.html.HTMLDocumentTest
Tests run: 1, Failures: 0, Errors: 0, Skipped: 0, Time elapsed: 0 sec
Running org.apache.any23.extractor.html.HTMLMetaExtractorTest
Tests run: 2, Failures: 0, Errors: 0, Skipped: 0, Time elapsed: 0 sec
Running org.apache.any23.extractor.html.SpeciesExtractorTest
Tests run: 1, Failures: 0, Errors: 0, Skipped: 0, Time elapsed: 0.017 sec
Running org.apache.any23.extractor.html.SpanCloserInputStreamTest
Tests run: 7, Failures: 0, Errors: 0, Skipped: 0, Time elapsed: 0.022 sec
Running org.apache.any23.extractor.html.RDFMergerTest
Tests run: 10, Failures: 0, Errors: 0, Skipped: 0, Time elapsed: 0.229 sec
Running org.apache.any23.extractor.html.LicenseExtractorTest
Tests run: 6, Failures: 0, Errors: 0, Skipped: 0, Time elapsed: 0.037 sec
Running org.apache.any23.extractor.html.XFNExtractorTest
Tests run: 15, Failures: 0, Errors: 0, Skipped: 0, Time elapsed: 0.096 sec
Running org.apache.any23.extractor.html.HCardExtractorTest
Tests run: 46, Failures: 0, Errors: 0, Skipped: 2, Time elapsed: 0.684 sec
Running org.apache.any23.extractor.html.HResumeExtractorTest
Tests run: 4, Failures: 0, Errors: 0, Skipped: 0, Time elapsed: 0.104 sec
Running org.apache.any23.extractor.html.TagSoupParserTest
Tests run: 4, Failures: 0, Errors: 0, Skipped: 0, Time elapsed: 0.043 sec
Running org.apache.any23.extractor.ExtractionResultImplTest
Tests run: 1, Failures: 0, Errors: 0, Skipped: 0, Time elapsed: 0 sec
Running org.apache.any23.http.AcceptHeaderBuilderTest
Tests run: 12, Failures: 0, Errors: 0, Skipped: 0, Time elapsed: 0 sec
Running org.apache.any23.writer.WriterRegistryTest
Tests run: 7, Failures: 0, Errors: 0, Skipped: 0, Time elapsed: 0.001 sec
Running org.apache.any23.writer.JSONWriterTest
Tests run: 1, Failures: 0, Errors: 0, Skipped: 0, Time elapsed: 0 sec

Results :

Failed tests:   testKelkoo(org.apache.any23.extractor.html.HListingExtractorTest): Assertion
failed! Extracted triples:
  testKelkooFull(org.apache.any23.extractor.html.HListingExtractorTest): Assertion failed!
Extracted triples:

Tests run: 391, Failures: 2, Errors: 0, Skipped: 7

[JENKINS] Recording test results[ERROR] There are test failures.

Please refer to <https://builds.apache.org/job/Any23-trunk/ws/core/target/surefire-reports>
for the individual test results.

[INFO] [jar:jar {execution: default-jar}]
[INFO] Building jar: <https://builds.apache.org/job/Any23-trunk/ws/core/target/apache-any23-core-0.8.1-SNAPSHOT.jar>
[INFO] [appassembler:assemble {execution: default}]
[INFO] Installing artifact <https://builds.apache.org/job/Any23-trunk/ws/api/target/apache-any23-api-0.8.1-SNAPSHOT.jar>
to <https://builds.apache.org/job/Any23-trunk/ws/core/target/appassembler/lib/apache-any23-api-0.8.1-SNAPSHOT.jar>
[INFO] Installing artifact /home/jenkins/jenkins-slave/maven-repositories/1/org/slf4j/slf4j-api/1.6.6/slf4j-api-1.6.6.jar
to <https://builds.apache.org/job/Any23-trunk/ws/core/target/appassembler/lib/slf4j-api-1.6.6.jar>
[INFO] Installing artifact /home/jenkins/jenkins-slave/maven-repositories/1/org/openrdf/sesame/sesame-model/2.6.9/sesame-model-2.6.9.jar
to <https://builds.apache.org/job/Any23-trunk/ws/core/target/appassembler/lib/sesame-model-2.6.9.jar>
[INFO] Installing artifact /home/jenkins/jenkins-slave/maven-repositories/1/org/openrdf/sesame/sesame-util/2.6.9/sesame-util-2.6.9.jar
to <https://builds.apache.org/job/Any23-trunk/ws/core/target/appassembler/lib/sesame-util-2.6.9.jar>
[INFO] Installing artifact /home/jenkins/jenkins-slave/maven-repositories/1/org/openrdf/sesame/sesame-rio-api/2.6.9/sesame-rio-api-2.6.9.jar
to <https://builds.apache.org/job/Any23-trunk/ws/core/target/appassembler/lib/sesame-rio-api-2.6.9.jar>
[INFO] Installing artifact <https://builds.apache.org/job/Any23-trunk/ws/csvutils/target/apache-any23-csvutils-0.8.1-SNAPSHOT.jar>
to <https://builds.apache.org/job/Any23-trunk/ws/core/target/appassembler/lib/apache-any23-csvutils-0.8.1-SNAPSHOT.jar>
[INFO] Installing artifact /home/jenkins/jenkins-slave/maven-repositories/1/org/apache/commons/commons-csv/1.0-SNAPSHOT-rev1148315/commons-csv-1.0-SNAPSHOT-rev1148315.jar
to <https://builds.apache.org/job/Any23-trunk/ws/core/target/appassembler/lib/commons-csv-1.0-SNAPSHOT-rev1148315.jar>
[INFO] Installing artifact <https://builds.apache.org/job/Any23-trunk/ws/mime/target/apache-any23-mime-0.8.1-SNAPSHOT.jar>
to <https://builds.apache.org/job/Any23-trunk/ws/core/target/appassembler/lib/apache-any23-mime-0.8.1-SNAPSHOT.jar>
[INFO] Installing artifact /home/jenkins/jenkins-slave/maven-repositories/1/commons-io/commons-io/2.4/commons-io-2.4.jar
to <https://builds.apache.org/job/Any23-trunk/ws/core/target/appassembler/lib/commons-io-2.4.jar>
[INFO] Installing artifact /home/jenkins/jenkins-slave/maven-repositories/1/org/apache/tika/tika-core/1.2/tika-core-1.2.jar
to <https://builds.apache.org/job/Any23-trunk/ws/core/target/appassembler/lib/tika-core-1.2.jar>
[INFO] Installing artifact /home/jenkins/jenkins-slave/maven-repositories/1/org/apache/tika/tika-parsers/1.2/tika-parsers-1.2.jar
to <https://builds.apache.org/job/Any23-trunk/ws/core/target/appassembler/lib/tika-parsers-1.2.jar>
[INFO] Installing artifact /home/jenkins/jenkins-slave/maven-repositories/1/org/gagravarr/vorbis-java-tika/0.1/vorbis-java-tika-0.1.jar
to <https://builds.apache.org/job/Any23-trunk/ws/core/target/appassembler/lib/vorbis-java-tika-0.1.jar>
[INFO] Installing artifact /home/jenkins/jenkins-slave/maven-repositories/1/org/gagravarr/vorbis-java-core/0.1/vorbis-java-core-0.1-tests.jar
to <https://builds.apache.org/job/Any23-trunk/ws/core/target/appassembler/lib/vorbis-java-core-0.1-tests.jar>
[INFO] Installing artifact /home/jenkins/jenkins-slave/maven-repositories/1/edu/ucar/netcdf/4.2-min/netcdf-4.2-min.jar
to <https://builds.apache.org/job/Any23-trunk/ws/core/target/appassembler/lib/netcdf-4.2-min.jar>
[INFO] Installing artifact /home/jenkins/jenkins-slave/maven-repositories/1/org/apache/james/apache-mime4j-core/0.7.2/apache-mime4j-core-0.7.2.jar
to <https://builds.apache.org/job/Any23-trunk/ws/core/target/appassembler/lib/apache-mime4j-core-0.7.2.jar>
[INFO] Installing artifact /home/jenkins/jenkins-slave/maven-repositories/1/org/apache/james/apache-mime4j-dom/0.7.2/apache-mime4j-dom-0.7.2.jar
to <https://builds.apache.org/job/Any23-trunk/ws/core/target/appassembler/lib/apache-mime4j-dom-0.7.2.jar>
[INFO] Installing artifact /home/jenkins/jenkins-slave/maven-repositories/1/org/apache/commons/commons-compress/1.4.1/commons-compress-1.4.1.jar
to <https://builds.apache.org/job/Any23-trunk/ws/core/target/appassembler/lib/commons-compress-1.4.1.jar>
[INFO] Installing artifact /home/jenkins/jenkins-slave/maven-repositories/1/org/tukaani/xz/1.0/xz-1.0.jar
to <https://builds.apache.org/job/Any23-trunk/ws/core/target/appassembler/lib/xz-1.0.jar>
[INFO] Installing artifact /home/jenkins/jenkins-slave/maven-repositories/1/commons-codec/commons-codec/1.6/commons-codec-1.6.jar
to <https://builds.apache.org/job/Any23-trunk/ws/core/target/appassembler/lib/commons-codec-1.6.jar>
[INFO] Installing artifact /home/jenkins/jenkins-slave/maven-repositories/1/org/apache/pdfbox/pdfbox/1.7.0/pdfbox-1.7.0.jar
to <https://builds.apache.org/job/Any23-trunk/ws/core/target/appassembler/lib/pdfbox-1.7.0.jar>
[INFO] Installing artifact /home/jenkins/jenkins-slave/maven-repositories/1/org/apache/pdfbox/fontbox/1.7.0/fontbox-1.7.0.jar
to <https://builds.apache.org/job/Any23-trunk/ws/core/target/appassembler/lib/fontbox-1.7.0.jar>
[INFO] Installing artifact /home/jenkins/jenkins-slave/maven-repositories/1/org/apache/pdfbox/jempbox/1.7.0/jempbox-1.7.0.jar
to <https://builds.apache.org/job/Any23-trunk/ws/core/target/appassembler/lib/jempbox-1.7.0.jar>
[INFO] Installing artifact /home/jenkins/jenkins-slave/maven-repositories/1/commons-logging/commons-logging/1.0.4/commons-logging-1.0.4.jar
to <https://builds.apache.org/job/Any23-trunk/ws/core/target/appassembler/lib/commons-logging-1.0.4.jar>
[INFO] Installing artifact /home/jenkins/jenkins-slave/maven-repositories/1/org/bouncycastle/bcmail-jdk15/1.45/bcmail-jdk15-1.45.jar
to <https://builds.apache.org/job/Any23-trunk/ws/core/target/appassembler/lib/bcmail-jdk15-1.45.jar>
[INFO] Installing artifact /home/jenkins/jenkins-slave/maven-repositories/1/org/bouncycastle/bcprov-jdk15/1.45/bcprov-jdk15-1.45.jar
to <https://builds.apache.org/job/Any23-trunk/ws/core/target/appassembler/lib/bcprov-jdk15-1.45.jar>
[INFO] Installing artifact /home/jenkins/jenkins-slave/maven-repositories/1/org/apache/poi/poi/3.8/poi-3.8.jar
to <https://builds.apache.org/job/Any23-trunk/ws/core/target/appassembler/lib/poi-3.8.jar>
[INFO] Installing artifact /home/jenkins/jenkins-slave/maven-repositories/1/org/apache/poi/poi-scratchpad/3.8/poi-scratchpad-3.8.jar
to <https://builds.apache.org/job/Any23-trunk/ws/core/target/appassembler/lib/poi-scratchpad-3.8.jar>
[INFO] Installing artifact /home/jenkins/jenkins-slave/maven-repositories/1/org/apache/poi/poi-ooxml/3.8/poi-ooxml-3.8.jar
to <https://builds.apache.org/job/Any23-trunk/ws/core/target/appassembler/lib/poi-ooxml-3.8.jar>
[INFO] Installing artifact /home/jenkins/jenkins-slave/maven-repositories/1/org/apache/poi/poi-ooxml-schemas/3.8/poi-ooxml-schemas-3.8.jar
to <https://builds.apache.org/job/Any23-trunk/ws/core/target/appassembler/lib/poi-ooxml-schemas-3.8.jar>
[INFO] Installing artifact /home/jenkins/jenkins-slave/maven-repositories/1/org/apache/xmlbeans/xmlbeans/2.3.0/xmlbeans-2.3.0.jar
to <https://builds.apache.org/job/Any23-trunk/ws/core/target/appassembler/lib/xmlbeans-2.3.0.jar>
[INFO] Installing artifact /home/jenkins/jenkins-slave/maven-repositories/1/dom4j/dom4j/1.6.1/dom4j-1.6.1.jar
to <https://builds.apache.org/job/Any23-trunk/ws/core/target/appassembler/lib/dom4j-1.6.1.jar>
[INFO] Installing artifact /home/jenkins/jenkins-slave/maven-repositories/1/org/apache/geronimo/specs/geronimo-stax-api_1.0_spec/1.0.1/geronimo-stax-api_1.0_spec-1.0.1.jar
to <https://builds.apache.org/job/Any23-trunk/ws/core/target/appassembler/lib/geronimo-stax-api_1.0_spec-1.0.1.jar>
[INFO] Installing artifact /home/jenkins/jenkins-slave/maven-repositories/1/org/ccil/cowan/tagsoup/tagsoup/1.2.1/tagsoup-1.2.1.jar
to <https://builds.apache.org/job/Any23-trunk/ws/core/target/appassembler/lib/tagsoup-1.2.1.jar>
[INFO] Installing artifact /home/jenkins/jenkins-slave/maven-repositories/1/asm/asm/3.1/asm-3.1.jar
to <https://builds.apache.org/job/Any23-trunk/ws/core/target/appassembler/lib/asm-3.1.jar>
[INFO] Installing artifact /home/jenkins/jenkins-slave/maven-repositories/1/com/googlecode/mp4parser/isoparser/1.0-RC-1/isoparser-1.0-RC-1.jar
to <https://builds.apache.org/job/Any23-trunk/ws/core/target/appassembler/lib/isoparser-1.0-RC-1.jar>
[INFO] Installing artifact /home/jenkins/jenkins-slave/maven-repositories/1/org/aspectj/aspectjrt/1.6.11/aspectjrt-1.6.11.jar
to <https://builds.apache.org/job/Any23-trunk/ws/core/target/appassembler/lib/aspectjrt-1.6.11.jar>
[INFO] Installing artifact /home/jenkins/jenkins-slave/maven-repositories/1/com/drewnoakes/metadata-extractor/2.4.0-beta-1/metadata-extractor-2.4.0-beta-1.jar
to <https://builds.apache.org/job/Any23-trunk/ws/core/target/appassembler/lib/metadata-extractor-2.4.0-beta-1.jar>
[INFO] Installing artifact /home/jenkins/jenkins-slave/maven-repositories/1/de/l3s/boilerpipe/boilerpipe/1.1.0/boilerpipe-1.1.0.jar
to <https://builds.apache.org/job/Any23-trunk/ws/core/target/appassembler/lib/boilerpipe-1.1.0.jar>
[INFO] Installing artifact /home/jenkins/jenkins-slave/maven-repositories/1/rome/rome/0.9/rome-0.9.jar
to <https://builds.apache.org/job/Any23-trunk/ws/core/target/appassembler/lib/rome-0.9.jar>
[INFO] Installing artifact /home/jenkins/jenkins-slave/maven-repositories/1/jdom/jdom/1.0/jdom-1.0.jar
to <https://builds.apache.org/job/Any23-trunk/ws/core/target/appassembler/lib/jdom-1.0.jar>
[INFO] Installing artifact /home/jenkins/jenkins-slave/maven-repositories/1/org/gagravarr/vorbis-java-core/0.1/vorbis-java-core-0.1.jar
to <https://builds.apache.org/job/Any23-trunk/ws/core/target/appassembler/lib/vorbis-java-core-0.1.jar>
[INFO] Installing artifact /home/jenkins/jenkins-slave/maven-repositories/1/com/googlecode/juniversalchardet/juniversalchardet/1.0.3/juniversalchardet-1.0.3.jar
to <https://builds.apache.org/job/Any23-trunk/ws/core/target/appassembler/lib/juniversalchardet-1.0.3.jar>
[INFO] Installing artifact /home/jenkins/jenkins-slave/maven-repositories/1/org/openrdf/sesame/sesame-rio-turtle/2.6.9/sesame-rio-turtle-2.6.9.jar
to <https://builds.apache.org/job/Any23-trunk/ws/core/target/appassembler/lib/sesame-rio-turtle-2.6.9.jar>
[INFO] Installing artifact /home/jenkins/jenkins-slave/maven-repositories/1/org/openrdf/sesame/sesame-rio-ntriples/2.6.9/sesame-rio-ntriples-2.6.9.jar
to <https://builds.apache.org/job/Any23-trunk/ws/core/target/appassembler/lib/sesame-rio-ntriples-2.6.9.jar>
[INFO] Installing artifact /home/jenkins/jenkins-slave/maven-repositories/1/org/openrdf/sesame/sesame-rio-n3/2.6.9/sesame-rio-n3-2.6.9.jar
to <https://builds.apache.org/job/Any23-trunk/ws/core/target/appassembler/lib/sesame-rio-n3-2.6.9.jar>
[INFO] Installing artifact <https://builds.apache.org/job/Any23-trunk/ws/encoding/target/apache-any23-encoding-0.8.1-SNAPSHOT.jar>
to <https://builds.apache.org/job/Any23-trunk/ws/core/target/appassembler/lib/apache-any23-encoding-0.8.1-SNAPSHOT.jar>
[INFO] Installing artifact /home/jenkins/jenkins-slave/maven-repositories/1/commons-lang/commons-lang/2.4/commons-lang-2.4.jar
to <https://builds.apache.org/job/Any23-trunk/ws/core/target/appassembler/lib/commons-lang-2.4.jar>
[INFO] Installing artifact /home/jenkins/jenkins-slave/maven-repositories/1/commons-httpclient/commons-httpclient/3.1/commons-httpclient-3.1.jar
to <https://builds.apache.org/job/Any23-trunk/ws/core/target/appassembler/lib/commons-httpclient-3.1.jar>
[INFO] Installing artifact /home/jenkins/jenkins-slave/maven-repositories/1/net/sourceforge/nekohtml/nekohtml/1.9.15/nekohtml-1.9.15.jar
to <https://builds.apache.org/job/Any23-trunk/ws/core/target/appassembler/lib/nekohtml-1.9.15.jar>
[INFO] Installing artifact /home/jenkins/jenkins-slave/maven-repositories/1/xerces/xercesImpl/2.9.1/xercesImpl-2.9.1.jar
to <https://builds.apache.org/job/Any23-trunk/ws/core/target/appassembler/lib/xercesImpl-2.9.1.jar>
[INFO] Installing artifact /home/jenkins/jenkins-slave/maven-repositories/1/xml-apis/xml-apis/1.3.04/xml-apis-1.3.04.jar
to <https://builds.apache.org/job/Any23-trunk/ws/core/target/appassembler/lib/xml-apis-1.3.04.jar>
[INFO] Installing artifact /home/jenkins/jenkins-slave/maven-repositories/1/com/beust/jcommander/1.23/jcommander-1.23.jar
to <https://builds.apache.org/job/Any23-trunk/ws/core/target/appassembler/lib/jcommander-1.23.jar>
[INFO] Installing artifact /home/jenkins/jenkins-slave/maven-repositories/1/org/openrdf/sesame/sesame-rio-rdfxml/2.6.9/sesame-rio-rdfxml-2.6.9.jar
to <https://builds.apache.org/job/Any23-trunk/ws/core/target/appassembler/lib/sesame-rio-rdfxml-2.6.9.jar>
[INFO] Installing artifact /home/jenkins/jenkins-slave/maven-repositories/1/org/openrdf/sesame/sesame-rio-trix/2.6.9/sesame-rio-trix-2.6.9.jar
to <https://builds.apache.org/job/Any23-trunk/ws/core/target/appassembler/lib/sesame-rio-trix-2.6.9.jar>
[INFO] Installing artifact /home/jenkins/jenkins-slave/maven-repositories/1/org/openrdf/sesame/sesame-repository-sail/2.6.9/sesame-repository-sail-2.6.9.jar
to <https://builds.apache.org/job/Any23-trunk/ws/core/target/appassembler/lib/sesame-repository-sail-2.6.9.jar>
[INFO] Installing artifact /home/jenkins/jenkins-slave/maven-repositories/1/org/openrdf/sesame/sesame-repository-api/2.6.9/sesame-repository-api-2.6.9.jar
to <https://builds.apache.org/job/Any23-trunk/ws/core/target/appassembler/lib/sesame-repository-api-2.6.9.jar>
[INFO] Installing artifact /home/jenkins/jenkins-slave/maven-repositories/1/org/openrdf/sesame/sesame-query/2.6.9/sesame-query-2.6.9.jar
to <https://builds.apache.org/job/Any23-trunk/ws/core/target/appassembler/lib/sesame-query-2.6.9.jar>
[INFO] Installing artifact /home/jenkins/jenkins-slave/maven-repositories/1/org/openrdf/sesame/sesame-sail-api/2.6.9/sesame-sail-api-2.6.9.jar
to <https://builds.apache.org/job/Any23-trunk/ws/core/target/appassembler/lib/sesame-sail-api-2.6.9.jar>
[INFO] Installing artifact /home/jenkins/jenkins-slave/maven-repositories/1/org/openrdf/sesame/sesame-queryalgebra-model/2.6.9/sesame-queryalgebra-model-2.6.9.jar
to <https://builds.apache.org/job/Any23-trunk/ws/core/target/appassembler/lib/sesame-queryalgebra-model-2.6.9.jar>
[INFO] Installing artifact /home/jenkins/jenkins-slave/maven-repositories/1/org/openrdf/sesame/sesame-queryparser-api/2.6.9/sesame-queryparser-api-2.6.9.jar
to <https://builds.apache.org/job/Any23-trunk/ws/core/target/appassembler/lib/sesame-queryparser-api-2.6.9.jar>
[INFO] Installing artifact /home/jenkins/jenkins-slave/maven-repositories/1/org/openrdf/sesame/sesame-sail-memory/2.6.9/sesame-sail-memory-2.6.9.jar
to <https://builds.apache.org/job/Any23-trunk/ws/core/target/appassembler/lib/sesame-sail-memory-2.6.9.jar>
[INFO] Installing artifact /home/jenkins/jenkins-slave/maven-repositories/1/org/openrdf/sesame/sesame-sail-inferencer/2.6.9/sesame-sail-inferencer-2.6.9.jar
to <https://builds.apache.org/job/Any23-trunk/ws/core/target/appassembler/lib/sesame-sail-inferencer-2.6.9.jar>
[INFO] Installing artifact /home/jenkins/jenkins-slave/maven-repositories/1/org/openrdf/sesame/sesame-queryparser-serql/2.6.9/sesame-queryparser-serql-2.6.9.jar
to <https://builds.apache.org/job/Any23-trunk/ws/core/target/appassembler/lib/sesame-queryparser-serql-2.6.9.jar>
[INFO] Installing artifact /home/jenkins/jenkins-slave/maven-repositories/1/org/openrdf/sesame/sesame-queryalgebra-evaluation/2.6.9/sesame-queryalgebra-evaluation-2.6.9.jar
to <https://builds.apache.org/job/Any23-trunk/ws/core/target/appassembler/lib/sesame-queryalgebra-evaluation-2.6.9.jar>
[INFO] Installing artifact /home/jenkins/jenkins-slave/maven-repositories/1/org/openrdf/sesame/sesame-repository-sparql/2.6.9/sesame-repository-sparql-2.6.9.jar
to <https://builds.apache.org/job/Any23-trunk/ws/core/target/appassembler/lib/sesame-repository-sparql-2.6.9.jar>
[INFO] Installing artifact /home/jenkins/jenkins-slave/maven-repositories/1/org/openrdf/sesame/sesame-http-client/2.6.9/sesame-http-client-2.6.9.jar
to <https://builds.apache.org/job/Any23-trunk/ws/core/target/appassembler/lib/sesame-http-client-2.6.9.jar>
[INFO] Installing artifact /home/jenkins/jenkins-slave/maven-repositories/1/org/openrdf/sesame/sesame-http-protocol/2.6.9/sesame-http-protocol-2.6.9.jar
to <https://builds.apache.org/job/Any23-trunk/ws/core/target/appassembler/lib/sesame-http-protocol-2.6.9.jar>
[INFO] Installing artifact /home/jenkins/jenkins-slave/maven-repositories/1/org/openrdf/sesame/sesame-queryresultio-api/2.6.9/sesame-queryresultio-api-2.6.9.jar
to <https://builds.apache.org/job/Any23-trunk/ws/core/target/appassembler/lib/sesame-queryresultio-api-2.6.9.jar>
[INFO] Installing artifact /home/jenkins/jenkins-slave/maven-repositories/1/org/openrdf/sesame/sesame-queryresultio-sparqlxml/2.6.9/sesame-queryresultio-sparqlxml-2.6.9.jar
to <https://builds.apache.org/job/Any23-trunk/ws/core/target/appassembler/lib/sesame-queryresultio-sparqlxml-2.6.9.jar>
[INFO] Installing artifact /home/jenkins/jenkins-slave/maven-repositories/1/info/aduna/commons/aduna-commons-xml/2.7.0/aduna-commons-xml-2.7.0.jar
to <https://builds.apache.org/job/Any23-trunk/ws/core/target/appassembler/lib/aduna-commons-xml-2.7.0.jar>
[INFO] Installing artifact /home/jenkins/jenkins-slave/maven-repositories/1/info/aduna/commons/aduna-commons-text/2.7.0/aduna-commons-text-2.7.0.jar
to <https://builds.apache.org/job/Any23-trunk/ws/core/target/appassembler/lib/aduna-commons-text-2.7.0.jar>
[INFO] Installing artifact /home/jenkins/jenkins-slave/maven-repositories/1/info/aduna/commons/aduna-commons-net/2.7.0/aduna-commons-net-2.7.0.jar
to <https://builds.apache.org/job/Any23-trunk/ws/core/target/appassembler/lib/aduna-commons-net-2.7.0.jar>
[INFO] Installing artifact /home/jenkins/jenkins-slave/maven-repositories/1/info/aduna/commons/aduna-commons-lang/2.9.0/aduna-commons-lang-2.9.0.jar
to <https://builds.apache.org/job/Any23-trunk/ws/core/target/appassembler/lib/aduna-commons-lang-2.9.0.jar>
[INFO] Installing artifact /home/jenkins/jenkins-slave/maven-repositories/1/info/aduna/commons/aduna-commons-iteration/2.10.0/aduna-commons-iteration-2.10.0.jar
to <https://builds.apache.org/job/Any23-trunk/ws/core/target/appassembler/lib/aduna-commons-iteration-2.10.0.jar>
[INFO] Installing artifact /home/jenkins/jenkins-slave/maven-repositories/1/info/aduna/commons/aduna-commons-concurrent/2.7.0/aduna-commons-concurrent-2.7.0.jar
to <https://builds.apache.org/job/Any23-trunk/ws/core/target/appassembler/lib/aduna-commons-concurrent-2.7.0.jar>
[INFO] Installing artifact /home/jenkins/jenkins-slave/maven-repositories/1/info/aduna/commons/aduna-commons-io/2.10.0/aduna-commons-io-2.10.0.jar
to <https://builds.apache.org/job/Any23-trunk/ws/core/target/appassembler/lib/aduna-commons-io-2.10.0.jar>
[INFO] Installing artifact /home/jenkins/jenkins-slave/maven-repositories/1/org/kohsuke/metainf-services/metainf-services/1.4/metainf-services-1.4.jar
to <https://builds.apache.org/job/Any23-trunk/ws/core/target/appassembler/lib/metainf-services-1.4.jar>
[INFO] Installing artifact <https://builds.apache.org/job/Any23-trunk/ws/core/target/apache-any23-core-0.8.1-SNAPSHOT.jar>
to <https://builds.apache.org/job/Any23-trunk/ws/core/target/appassembler/lib/apache-any23-core-0.8.1-SNAPSHOT.jar>
[INFO] [assembly:single {execution: assembly}]
[INFO] Reading assembly descriptor: <https://builds.apache.org/job/Any23-trunk/ws/core/src/main/assembly/bin.xml>
[INFO] Building tar: <https://builds.apache.org/job/Any23-trunk/ws/core/target/apache-any23-core-0.8.1-SNAPSHOT.tar.gz>
[INFO] Building zip: <https://builds.apache.org/job/Any23-trunk/ws/core/target/apache-any23-core-0.8.1-SNAPSHOT.zip>
[INFO] [jar:test-jar {execution: default}]
[INFO] Building jar: <https://builds.apache.org/job/Any23-trunk/ws/core/target/apache-any23-core-0.8.1-SNAPSHOT-tests.jar>
[INFO] [install:install {execution: default-install}]
[INFO] Installing <https://builds.apache.org/job/Any23-trunk/ws/core/target/apache-any23-core-0.8.1-SNAPSHOT.jar>
to /home/jenkins/jenkins-slave/maven-repositories/1/org/apache/any23/apache-any23-core/0.8.1-SNAPSHOT/apache-any23-core-0.8.1-SNAPSHOT.jar
[INFO] Installing <https://builds.apache.org/job/Any23-trunk/ws/core/target/apache-any23-core-0.8.1-SNAPSHOT.tar.gz>
to /home/jenkins/jenkins-slave/maven-repositories/1/org/apache/any23/apache-any23-core/0.8.1-SNAPSHOT/apache-any23-core-0.8.1-SNAPSHOT.tar.gz
[INFO] Installing <https://builds.apache.org/job/Any23-trunk/ws/core/target/apache-any23-core-0.8.1-SNAPSHOT.zip>
to /home/jenkins/jenkins-slave/maven-repositories/1/org/apache/any23/apache-any23-core/0.8.1-SNAPSHOT/apache-any23-core-0.8.1-SNAPSHOT.zip
[INFO] Installing <https://builds.apache.org/job/Any23-trunk/ws/core/target/apache-any23-core-0.8.1-SNAPSHOT-tests.jar>
to /home/jenkins/jenkins-slave/maven-repositories/1/org/apache/any23/apache-any23-core/0.8.1-SNAPSHOT/apache-any23-core-0.8.1-SNAPSHOT-tests.jar
[INFO] [deploy:deploy {execution: default-deploy}]
[INFO] Retrieving previous build number from apache.snapshots.https
[INFO] repository metadata for: 'snapshot org.apache.any23:apache-any23-core:0.8.1-SNAPSHOT'
could not be found on repository: apache.snapshots.https, so will be created
Uploading: https://repository.apache.org/content/repositories/snapshots/org/apache/any23/apache-any23-core/0.8.1-SNAPSHOT/apache-any23-core-0.8.1-20130502.024501-1.jar
374K uploaded  (apache-any23-core-0.8.1-20130502.024501-1.jar)
[INFO] Uploading project information for apache-any23-core 0.8.1-20130502.024501-1
[INFO] Retrieving previous metadata from apache.snapshots.https
[INFO] repository metadata for: 'snapshot org.apache.any23:apache-any23-core:0.8.1-SNAPSHOT'
could not be found on repository: apache.snapshots.https, so will be created
[INFO] Uploading repository metadata for: 'snapshot org.apache.any23:apache-any23-core:0.8.1-SNAPSHOT'
[INFO] Retrieving previous metadata from apache.snapshots.https
[INFO] Uploading repository metadata for: 'artifact org.apache.any23:apache-any23-core'
[INFO] Retrieving previous build number from apache.snapshots.https
Uploading: https://repository.apache.org/content/repositories/snapshots/org/apache/any23/apache-any23-core/0.8.1-SNAPSHOT/apache-any23-core-0.8.1-20130502.024501-1.tar.gz
26057K uploaded  (apache-any23-core-0.8.1-20130502.024501-1.tar.gz)
[INFO] Retrieving previous build number from apache.snapshots.https
Uploading: https://repository.apache.org/content/repositories/snapshots/org/apache/any23/apache-any23-core/0.8.1-SNAPSHOT/apache-any23-core-0.8.1-20130502.024501-1.zip
26071K uploaded  (apache-any23-core-0.8.1-20130502.024501-1.zip)
[INFO] Retrieving previous build number from apache.snapshots.https
Uploading: https://repository.apache.org/content/repositories/snapshots/org/apache/any23/apache-any23-core/0.8.1-SNAPSHOT/apache-any23-core-0.8.1-20130502.024501-1-tests.jar
156K uploaded  (apache-any23-core-0.8.1-20130502.024501-1-tests.jar)
[JENKINS] Archiving <https://builds.apache.org/job/Any23-trunk/ws/core/pom.xml> to /home/hudson/hudson/jobs/Any23-trunk/modules/org.apache.any23$apache-any23-core/builds/2013-05-02_02-44-06/archive/org.apache.any23/apache-any23-core/0.8.1-SNAPSHOT/apache-any23-core-0.8.1-SNAPSHOT.pom
[JENKINS] Archiving <https://builds.apache.org/job/Any23-trunk/ws/core/target/apache-any23-core-0.8.1-SNAPSHOT.jar>
to /home/hudson/hudson/jobs/Any23-trunk/modules/org.apache.any23$apache-any23-core/builds/2013-05-02_02-44-06/archive/org.apache.any23/apache-any23-core/0.8.1-20130502.024501-1/apache-any23-core-0.8.1-20130502.024501-1.jar
[JENKINS] Archiving <https://builds.apache.org/job/Any23-trunk/ws/core/target/apache-any23-core-0.8.1-SNAPSHOT.tar.gz>
to /home/hudson/hudson/jobs/Any23-trunk/modules/org.apache.any23$apache-any23-core/builds/2013-05-02_02-44-06/archive/org.apache.any23/apache-any23-core/0.8.1-20130502.024501-1/apache-any23-core-0.8.1-20130502.024501-1.tar.gz
[JENKINS] Archiving <https://builds.apache.org/job/Any23-trunk/ws/core/target/apache-any23-core-0.8.1-SNAPSHOT.zip>
to /home/hudson/hudson/jobs/Any23-trunk/modules/org.apache.any23$apache-any23-core/builds/2013-05-02_02-44-06/archive/org.apache.any23/apache-any23-core/0.8.1-20130502.024501-1/apache-any23-core-0.8.1-20130502.024501-1.zip
[JENKINS] Archiving <https://builds.apache.org/job/Any23-trunk/ws/core/target/apache-any23-core-0.8.1-SNAPSHOT-tests.jar>
to /home/hudson/hudson/jobs/Any23-trunk/modules/org.apache.any23$apache-any23-core/builds/2013-05-02_02-44-06/archive/org.apache.any23/apache-any23-core/0.8.1-20130502.024501-1/apache-any23-core-0.8.1-20130502.024501-1-tests.jar
[INFO] ------------------------------------------------------------------------
[INFO] Building Apache Any23 :: Plugins :: Basic Crawler
[INFO]    task-segment: [clean, deploy]
[INFO] ------------------------------------------------------------------------
[INFO] [clean:clean {execution: default-clean}]
[INFO] Deleting <https://builds.apache.org/job/Any23-trunk/ws/plugins/basic-crawler/target>
[INFO] [cobertura:clean {execution: default}]
[INFO] [buildnumber:create {execution: default}]
[INFO] Checking for local modifications: skipped.
[INFO] Updating project files from SCM: skipped.
[INFO] Executing: /bin/sh -c cd <https://builds.apache.org/job/Any23-trunk/ws/plugins/basic-crawler>
&& git show
[INFO] Working directory: <https://builds.apache.org/job/Any23-trunk/ws/plugins/basic-crawler>
[INFO] Storing buildNumber: null at timestamp: 1367463143436
[INFO] Executing: /bin/sh -c cd <https://builds.apache.org/job/Any23-trunk/ws/plugins/basic-crawler>
&& git show
[INFO] Working directory: <https://builds.apache.org/job/Any23-trunk/ws/plugins/basic-crawler>
[INFO] Storing buildScmBranch: UNKNOWN
[debug] execute contextualize
[INFO] [resources:resources {execution: default-resources}]
[INFO] Using 'UTF-8' encoding to copy filtered resources.
[INFO] Copying 2 resources to META-INF
[INFO] [compiler:compile {execution: default-compile}]
[INFO] Compiling 6 source files to <https://builds.apache.org/job/Any23-trunk/ws/plugins/basic-crawler/target/classes>
[INFO] -------------------------------------------------------------
[ERROR] COMPILATION ERROR : 
[INFO] -------------------------------------------------------------
[ERROR] <https://builds.apache.org/job/Any23-trunk/ws/plugins/basic-crawler/src/main/java/org/apache/any23/plugin/crawler/DefaultWebCrawler.java>:[23,16]
package org.slf4j does not exist
[ERROR] <https://builds.apache.org/job/Any23-trunk/ws/plugins/basic-crawler/src/main/java/org/apache/any23/plugin/crawler/DefaultWebCrawler.java>:[24,16]
package org.slf4j does not exist
[ERROR] <https://builds.apache.org/job/Any23-trunk/ws/plugins/basic-crawler/src/main/java/org/apache/any23/plugin/crawler/DefaultWebCrawler.java>:[35,25]
cannot find symbol
symbol  : class Logger
location: class org.apache.any23.plugin.crawler.DefaultWebCrawler
[ERROR] <https://builds.apache.org/job/Any23-trunk/ws/plugins/basic-crawler/src/main/java/org/apache/any23/plugin/crawler/DefaultWebCrawler.java>:[23,16]
package org.slf4j does not exist
[ERROR] <https://builds.apache.org/job/Any23-trunk/ws/plugins/basic-crawler/src/main/java/org/apache/any23/plugin/crawler/DefaultWebCrawler.java>:[24,16]
package org.slf4j does not exist
[ERROR] <https://builds.apache.org/job/Any23-trunk/ws/plugins/basic-crawler/src/main/java/org/apache/any23/plugin/crawler/DefaultWebCrawler.java>:[35,25]
cannot find symbol
symbol  : class Logger
location: class org.apache.any23.plugin.crawler.DefaultWebCrawler
[ERROR] <https://builds.apache.org/job/Any23-trunk/ws/plugins/basic-crawler/src/main/java/org/apache/any23/plugin/crawler/DefaultWebCrawler.java>:[35,41]
cannot find symbol
symbol  : variable LoggerFactory
location: class org.apache.any23.plugin.crawler.DefaultWebCrawler
[INFO] 7 errors 
[INFO] -------------------------------------------------------------
[JENKINS] Archiving <https://builds.apache.org/job/Any23-trunk/ws/plugins/basic-crawler/pom.xml>
to /home/hudson/hudson/jobs/Any23-trunk/modules/org.apache.any23.plugins$apache-any23-basic-crawler/builds/2013-05-02_02-44-06/archive/org.apache.any23.plugins/apache-any23-basic-crawler/1.0.2-SNAPSHOT/apache-any23-basic-crawler-1.0.2-SNAPSHOT.pom
[INFO] ------------------------------------------------------------------------
[ERROR] BUILD FAILURE
[INFO] ------------------------------------------------------------------------
[INFO] Compilation failure

<https://builds.apache.org/job/Any23-trunk/ws/plugins/basic-crawler/src/main/java/org/apache/any23/plugin/crawler/DefaultWebCrawler.java>:[23,16]
package org.slf4j does not exist
<https://builds.apache.org/job/Any23-trunk/ws/plugins/basic-crawler/src/main/java/org/apache/any23/plugin/crawler/DefaultWebCrawler.java>:[24,16]
package org.slf4j does not exist
<https://builds.apache.org/job/Any23-trunk/ws/plugins/basic-crawler/src/main/java/org/apache/any23/plugin/crawler/DefaultWebCrawler.java>:[35,25]
cannot find symbol
symbol  : class Logger
location: class org.apache.any23.plugin.crawler.DefaultWebCrawler
<https://builds.apache.org/job/Any23-trunk/ws/plugins/basic-crawler/src/main/java/org/apache/any23/plugin/crawler/DefaultWebCrawler.java>:[23,16]
package org.slf4j does not exist
<https://builds.apache.org/job/Any23-trunk/ws/plugins/basic-crawler/src/main/java/org/apache/any23/plugin/crawler/DefaultWebCrawler.java>:[24,16]
package org.slf4j does not exist
<https://builds.apache.org/job/Any23-trunk/ws/plugins/basic-crawler/src/main/java/org/apache/any23/plugin/crawler/DefaultWebCrawler.java>:[35,25]
cannot find symbol
symbol  : class Logger
location: class org.apache.any23.plugin.crawler.DefaultWebCrawler
<https://builds.apache.org/job/Any23-trunk/ws/plugins/basic-crawler/src/main/java/org/apache/any23/plugin/crawler/DefaultWebCrawler.java>:[35,41]
cannot find symbol
symbol  : variable LoggerFactory
location: class org.apache.any23.plugin.crawler.DefaultWebCrawler

[INFO] ------------------------------------------------------------------------
[INFO] For more information, run Maven with the -e switch
[INFO] ------------------------------------------------------------------------
[INFO] Total time: 7 minutes 43 seconds
[INFO] Finished at: Thu May 02 02:52:25 UTC 2013
[INFO] Final Memory: 71M/378M
[INFO] ------------------------------------------------------------------------
Waiting for Jenkins to finish collecting data
Maven failed with error.
channel stopped
Updating ANY23-156

Mime
View raw message