any23-dev mailing list archives

Site index · List index
Message view « Date » · « Thread »
Top « Date » · « Thread »
From Apache Jenkins Server <jenk...@builds.apache.org>
Subject Build failed in Jenkins: Any23-trunk #531
Date Fri, 05 Apr 2013 08:12:58 GMT
See <https://builds.apache.org/job/Any23-trunk/531/>

------------------------------------------
[...truncated 5354 lines...]
2529K uploaded  (apache-any23-basic-crawler-1.0.1-20130405.070836-169.tar.gz)
[INFO] Retrieving previous build number from apache.snapshots.https
Uploading: https://repository.apache.org/content/repositories/snapshots/org/apache/any23/plugins/apache-any23-basic-crawler/1.0.1-SNAPSHOT/apache-any23-basic-crawler-1.0.1-20130405.070836-169.zip
2530K uploaded  (apache-any23-basic-crawler-1.0.1-20130405.070836-169.zip)
[INFO] Retrieving previous build number from apache.snapshots.https
Uploading: https://repository.apache.org/content/repositories/snapshots/org/apache/any23/plugins/apache-any23-basic-crawler/1.0.1-SNAPSHOT/apache-any23-basic-crawler-1.0.1-20130405.070836-169-tests.jar
9K uploaded  (apache-any23-basic-crawler-1.0.1-20130405.070836-169-tests.jar)
[JENKINS] Archiving <https://builds.apache.org/job/Any23-trunk/ws/plugins/basic-crawler/pom.xml>
to /home/hudson/hudson/jobs/Any23-trunk/modules/org.apache.any23.plugins$apache-any23-basic-crawler/builds/2013-04-05_07-01-59/archive/org.apache.any23.plugins/apache-any23-basic-crawler/1.0.1-SNAPSHOT/apache-any23-basic-crawler-1.0.1-SNAPSHOT.pom
[JENKINS] Archiving <https://builds.apache.org/job/Any23-trunk/ws/plugins/basic-crawler/target/apache-any23-basic-crawler-1.0.1-SNAPSHOT.jar>
to /home/hudson/hudson/jobs/Any23-trunk/modules/org.apache.any23.plugins$apache-any23-basic-crawler/builds/2013-04-05_07-01-59/archive/org.apache.any23.plugins/apache-any23-basic-crawler/1.0.1-20130405.070836-169/apache-any23-basic-crawler-1.0.1-20130405.070836-169.jar
[JENKINS] Archiving <https://builds.apache.org/job/Any23-trunk/ws/plugins/basic-crawler/target/apache-any23-basic-crawler-1.0.1-SNAPSHOT.tar.gz>
to /home/hudson/hudson/jobs/Any23-trunk/modules/org.apache.any23.plugins$apache-any23-basic-crawler/builds/2013-04-05_07-01-59/archive/org.apache.any23.plugins/apache-any23-basic-crawler/1.0.1-20130405.070836-169/apache-any23-basic-crawler-1.0.1-20130405.070836-169.tar.gz
[JENKINS] Archiving <https://builds.apache.org/job/Any23-trunk/ws/plugins/basic-crawler/target/apache-any23-basic-crawler-1.0.1-SNAPSHOT.zip>
to /home/hudson/hudson/jobs/Any23-trunk/modules/org.apache.any23.plugins$apache-any23-basic-crawler/builds/2013-04-05_07-01-59/archive/org.apache.any23.plugins/apache-any23-basic-crawler/1.0.1-20130405.070836-169/apache-any23-basic-crawler-1.0.1-20130405.070836-169.zip
[JENKINS] Archiving <https://builds.apache.org/job/Any23-trunk/ws/plugins/basic-crawler/target/apache-any23-basic-crawler-1.0.1-SNAPSHOT-tests.jar>
to /home/hudson/hudson/jobs/Any23-trunk/modules/org.apache.any23.plugins$apache-any23-basic-crawler/builds/2013-04-05_07-01-59/archive/org.apache.any23.plugins/apache-any23-basic-crawler/1.0.1-20130405.070836-169/apache-any23-basic-crawler-1.0.1-20130405.070836-169-tests.jar
[INFO] ------------------------------------------------------------------------
[INFO] Building Apache Any23 :: Plugins :: HTML Scraper
[INFO]    task-segment: [clean, deploy]
[INFO] ------------------------------------------------------------------------
[INFO] [clean:clean {execution: default-clean}]
[INFO] [cobertura:clean {execution: default}]
[INFO] [buildnumber:create {execution: default}]
[INFO] Checking for local modifications: skipped.
[INFO] Updating project files from SCM: skipped.
[INFO] Executing: /bin/sh -c cd <https://builds.apache.org/job/Any23-trunk/ws/plugins/html-scraper>
&& svn --non-interactive info
[INFO] Working directory: <https://builds.apache.org/job/Any23-trunk/ws/plugins/html-scraper>
[INFO] Storing buildNumber: 1435999 at timestamp: 1365149059903
[INFO] Executing: /bin/sh -c cd <https://builds.apache.org/job/Any23-trunk/ws/plugins/html-scraper>
&& svn --non-interactive info
[INFO] Working directory: <https://builds.apache.org/job/Any23-trunk/ws/plugins/html-scraper>
[INFO] Storing buildScmBranch: trunk
[debug] execute contextualize
[INFO] [resources:resources {execution: default-resources}]
[INFO] Using 'UTF-8' encoding to copy filtered resources.
[INFO] Copying 2 resources to META-INF
[INFO] [compiler:compile {execution: default-compile}]
[INFO] Compiling 3 source files to <https://builds.apache.org/job/Any23-trunk/ws/plugins/html-scraper/target/classes>
[debug] execute contextualize
[INFO] [resources:testResources {execution: default-testResources}]
[INFO] Using 'UTF-8' encoding to copy filtered resources.
[INFO] Copying 1 resource
[INFO] [compiler:testCompile {execution: default-testCompile}]
[INFO] Compiling 1 source file to <https://builds.apache.org/job/Any23-trunk/ws/plugins/html-scraper/target/test-classes>
[INFO] [surefire:test {execution: default-test}]
[INFO] Surefire report directory: <https://builds.apache.org/job/Any23-trunk/ws/plugins/html-scraper/target/surefire-reports>

-------------------------------------------------------
 T E S T S
-------------------------------------------------------
Running org.apache.any23.plugin.htmlscraper.HTMLScraperExtractorTest
SLF4J: Failed to load class "org.slf4j.impl.StaticLoggerBinder".
SLF4J: Defaulting to no-operation (NOP) logger implementation
SLF4J: See http://www.slf4j.org/codes.html#StaticLoggerBinder for further details.
Tests run: 2, Failures: 0, Errors: 0, Skipped: 0, Time elapsed: 0.567 sec

Results :

Tests run: 2, Failures: 0, Errors: 0, Skipped: 0

[JENKINS] Recording test results
[INFO] [jar:jar {execution: default-jar}]
[INFO] Building jar: <https://builds.apache.org/job/Any23-trunk/ws/plugins/html-scraper/target/apache-any23-html-scraper-1.0.2-SNAPSHOT.jar>
[INFO] [assembly:single {execution: assembly}]
[INFO] Reading assembly descriptor: <https://builds.apache.org/job/Any23-trunk/ws/plugins/html-scraper/src/main/assembly/bin.xml>
[INFO] Building tar: <https://builds.apache.org/job/Any23-trunk/ws/plugins/html-scraper/target/apache-any23-html-scraper-1.0.2-SNAPSHOT.tar.gz>
[INFO] Building zip: <https://builds.apache.org/job/Any23-trunk/ws/plugins/html-scraper/target/apache-any23-html-scraper-1.0.2-SNAPSHOT.zip>
[INFO] [install:install {execution: default-install}]
[INFO] Installing <https://builds.apache.org/job/Any23-trunk/ws/plugins/html-scraper/target/apache-any23-html-scraper-1.0.2-SNAPSHOT.jar>
to /export/home/hudson/hudson-slave/maven-repositories/1/org/apache/any23/plugins/apache-any23-html-scraper/1.0.2-SNAPSHOT/apache-any23-html-scraper-1.0.2-SNAPSHOT.jar
[INFO] Installing <https://builds.apache.org/job/Any23-trunk/ws/plugins/html-scraper/target/apache-any23-html-scraper-1.0.2-SNAPSHOT.tar.gz>
to /export/home/hudson/hudson-slave/maven-repositories/1/org/apache/any23/plugins/apache-any23-html-scraper/1.0.2-SNAPSHOT/apache-any23-html-scraper-1.0.2-SNAPSHOT.tar.gz
[INFO] Installing <https://builds.apache.org/job/Any23-trunk/ws/plugins/html-scraper/target/apache-any23-html-scraper-1.0.2-SNAPSHOT.zip>
to /export/home/hudson/hudson-slave/maven-repositories/1/org/apache/any23/plugins/apache-any23-html-scraper/1.0.2-SNAPSHOT/apache-any23-html-scraper-1.0.2-SNAPSHOT.zip
[INFO] [deploy:deploy {execution: default-deploy}]
[INFO] Retrieving previous build number from apache.snapshots.https
[WARNING] *** CHECKSUM FAILED - Checksum failed on download: local = '36996c71b31af053f50c308709e79dbe7fc1a065';
remote = '92ab4d462b944574fa32ebc8c9667e251f296b5c' - RETRYING
[WARNING] *** CHECKSUM FAILED - Checksum failed on download: local = '36996c71b31af053f50c308709e79dbe7fc1a065';
remote = '92ab4d462b944574fa32ebc8c9667e251f296b5c' - IGNORING
Uploading: https://repository.apache.org/content/repositories/snapshots/org/apache/any23/plugins/apache-any23-html-scraper/1.0.2-SNAPSHOT/apache-any23-html-scraper-1.0.2-20130405.070836-166.jar
12K uploaded  (apache-any23-html-scraper-1.0.2-20130405.070836-166.jar)
[INFO] Retrieving previous metadata from apache.snapshots.https
[WARNING] *** CHECKSUM FAILED - Checksum failed on download: local = '36996c71b31af053f50c308709e79dbe7fc1a065';
remote = '92ab4d462b944574fa32ebc8c9667e251f296b5c' - RETRYING
[WARNING] *** CHECKSUM FAILED - Checksum failed on download: local = '36996c71b31af053f50c308709e79dbe7fc1a065';
remote = '92ab4d462b944574fa32ebc8c9667e251f296b5c' - IGNORING
[INFO] Uploading repository metadata for: 'snapshot org.apache.any23.plugins:apache-any23-html-scraper:1.0.2-SNAPSHOT'
[INFO] Uploading project information for apache-any23-html-scraper 1.0.2-20130405.070836-166
[INFO] Retrieving previous metadata from apache.snapshots.https
[WARNING] *** CHECKSUM FAILED - Checksum failed on download: local = '28b923b3e0ce592f31745f91dd762e464f29cfcf';
remote = 'f28bcf0751eb6e686631822e55e4cf9cb5327f35' - RETRYING
[WARNING] *** CHECKSUM FAILED - Checksum failed on download: local = '28b923b3e0ce592f31745f91dd762e464f29cfcf';
remote = 'f28bcf0751eb6e686631822e55e4cf9cb5327f35' - IGNORING
[INFO] Uploading repository metadata for: 'artifact org.apache.any23.plugins:apache-any23-html-scraper'
[INFO] Retrieving previous build number from apache.snapshots.https
Uploading: https://repository.apache.org/content/repositories/snapshots/org/apache/any23/plugins/apache-any23-html-scraper/1.0.2-SNAPSHOT/apache-any23-html-scraper-1.0.2-20130405.070836-166.tar.gz
99K uploaded  (apache-any23-html-scraper-1.0.2-20130405.070836-166.tar.gz)
[INFO] Retrieving previous build number from apache.snapshots.https
Uploading: https://repository.apache.org/content/repositories/snapshots/org/apache/any23/plugins/apache-any23-html-scraper/1.0.2-SNAPSHOT/apache-any23-html-scraper-1.0.2-20130405.070836-166.zip
100K uploaded  (apache-any23-html-scraper-1.0.2-20130405.070836-166.zip)
[JENKINS] Archiving <https://builds.apache.org/job/Any23-trunk/ws/plugins/html-scraper/pom.xml>
to /home/hudson/hudson/jobs/Any23-trunk/modules/org.apache.any23.plugins$apache-any23-html-scraper/builds/2013-04-05_07-01-59/archive/org.apache.any23.plugins/apache-any23-html-scraper/1.0.2-SNAPSHOT/apache-any23-html-scraper-1.0.2-SNAPSHOT.pom
[JENKINS] Archiving <https://builds.apache.org/job/Any23-trunk/ws/plugins/html-scraper/target/apache-any23-html-scraper-1.0.2-SNAPSHOT.jar>
to /home/hudson/hudson/jobs/Any23-trunk/modules/org.apache.any23.plugins$apache-any23-html-scraper/builds/2013-04-05_07-01-59/archive/org.apache.any23.plugins/apache-any23-html-scraper/1.0.2-20130405.070836-166/apache-any23-html-scraper-1.0.2-20130405.070836-166.jar
[JENKINS] Archiving <https://builds.apache.org/job/Any23-trunk/ws/plugins/html-scraper/target/apache-any23-html-scraper-1.0.2-SNAPSHOT.tar.gz>
to /home/hudson/hudson/jobs/Any23-trunk/modules/org.apache.any23.plugins$apache-any23-html-scraper/builds/2013-04-05_07-01-59/archive/org.apache.any23.plugins/apache-any23-html-scraper/1.0.2-20130405.070836-166/apache-any23-html-scraper-1.0.2-20130405.070836-166.tar.gz
[JENKINS] Archiving <https://builds.apache.org/job/Any23-trunk/ws/plugins/html-scraper/target/apache-any23-html-scraper-1.0.2-SNAPSHOT.zip>
to /home/hudson/hudson/jobs/Any23-trunk/modules/org.apache.any23.plugins$apache-any23-html-scraper/builds/2013-04-05_07-01-59/archive/org.apache.any23.plugins/apache-any23-html-scraper/1.0.2-20130405.070836-166/apache-any23-html-scraper-1.0.2-20130405.070836-166.zip
[INFO] ------------------------------------------------------------------------
[INFO] Building Apache Any23 :: Plugins :: Office Scraper
[INFO]    task-segment: [clean, deploy]
[INFO] ------------------------------------------------------------------------
[INFO] [clean:clean {execution: default-clean}]
[INFO] [cobertura:clean {execution: default}]
[INFO] [buildnumber:create {execution: default}]
[INFO] Checking for local modifications: skipped.
[INFO] Updating project files from SCM: skipped.
[INFO] Executing: /bin/sh -c cd <https://builds.apache.org/job/Any23-trunk/ws/plugins/office-scraper>
&& svn --non-interactive info
[INFO] Working directory: <https://builds.apache.org/job/Any23-trunk/ws/plugins/office-scraper>
[INFO] Storing buildNumber: 1435999 at timestamp: 1365149105191
[INFO] Executing: /bin/sh -c cd <https://builds.apache.org/job/Any23-trunk/ws/plugins/office-scraper>
&& svn --non-interactive info
[INFO] Working directory: <https://builds.apache.org/job/Any23-trunk/ws/plugins/office-scraper>
[INFO] Storing buildScmBranch: trunk
[debug] execute contextualize
[INFO] [resources:resources {execution: default-resources}]
[INFO] Using 'UTF-8' encoding to copy filtered resources.
[INFO] Copying 2 resources to META-INF
[INFO] [compiler:compile {execution: default-compile}]
[INFO] Compiling 4 source files to <https://builds.apache.org/job/Any23-trunk/ws/plugins/office-scraper/target/classes>
[debug] execute contextualize
[INFO] [resources:testResources {execution: default-testResources}]
[INFO] Using 'UTF-8' encoding to copy filtered resources.
[INFO] Copying 2 resources
[INFO] [compiler:testCompile {execution: default-testCompile}]
[INFO] Compiling 2 source files to <https://builds.apache.org/job/Any23-trunk/ws/plugins/office-scraper/target/test-classes>
[INFO] [surefire:test {execution: default-test}]
[INFO] Surefire report directory: <https://builds.apache.org/job/Any23-trunk/ws/plugins/office-scraper/target/surefire-reports>

-------------------------------------------------------
 T E S T S
-------------------------------------------------------
Running org.apache.any23.plugin.officescraper.ExcelExtractorTest
SLF4J: Failed to load class "org.slf4j.impl.StaticLoggerBinder".
SLF4J: Defaulting to no-operation (NOP) logger implementation
SLF4J: See http://www.slf4j.org/codes.html#StaticLoggerBinder for further details.
Tests run: 3, Failures: 0, Errors: 0, Skipped: 0, Time elapsed: 2.111 sec
Running org.apache.any23.plugin.officescraper.XSSFWorkbookTest
Tests run: 2, Failures: 0, Errors: 0, Skipped: 0, Time elapsed: 0.05 sec

Results :

Tests run: 5, Failures: 0, Errors: 0, Skipped: 0

[JENKINS] Recording test results
[INFO] [jar:jar {execution: default-jar}]
[INFO] Building jar: <https://builds.apache.org/job/Any23-trunk/ws/plugins/office-scraper/target/apache-any23-office-scraper-1.0.1-SNAPSHOT.jar>
[INFO] [assembly:single {execution: assembly}]
[INFO] Reading assembly descriptor: <https://builds.apache.org/job/Any23-trunk/ws/plugins/office-scraper/src/main/assembly/bin.xml>
[INFO] Building tar: <https://builds.apache.org/job/Any23-trunk/ws/plugins/office-scraper/target/apache-any23-office-scraper-1.0.1-SNAPSHOT.tar.gz>
[INFO] Building zip: <https://builds.apache.org/job/Any23-trunk/ws/plugins/office-scraper/target/apache-any23-office-scraper-1.0.1-SNAPSHOT.zip>
[INFO] [install:install {execution: default-install}]
[INFO] Installing <https://builds.apache.org/job/Any23-trunk/ws/plugins/office-scraper/target/apache-any23-office-scraper-1.0.1-SNAPSHOT.jar>
to /export/home/hudson/hudson-slave/maven-repositories/1/org/apache/any23/plugins/apache-any23-office-scraper/1.0.1-SNAPSHOT/apache-any23-office-scraper-1.0.1-SNAPSHOT.jar
[INFO] Installing <https://builds.apache.org/job/Any23-trunk/ws/plugins/office-scraper/target/apache-any23-office-scraper-1.0.1-SNAPSHOT.tar.gz>
to /export/home/hudson/hudson-slave/maven-repositories/1/org/apache/any23/plugins/apache-any23-office-scraper/1.0.1-SNAPSHOT/apache-any23-office-scraper-1.0.1-SNAPSHOT.tar.gz
[INFO] Installing <https://builds.apache.org/job/Any23-trunk/ws/plugins/office-scraper/target/apache-any23-office-scraper-1.0.1-SNAPSHOT.zip>
to /export/home/hudson/hudson-slave/maven-repositories/1/org/apache/any23/plugins/apache-any23-office-scraper/1.0.1-SNAPSHOT/apache-any23-office-scraper-1.0.1-SNAPSHOT.zip
[INFO] [deploy:deploy {execution: default-deploy}]
[INFO] Retrieving previous build number from apache.snapshots.https
[WARNING] *** CHECKSUM FAILED - Checksum failed on download: local = '2801c41c89e59c0524aeb8a9f81efc599b423447';
remote = 'bc6b549d14b8e4e911b58cbd1ef9e891a98cfbc5' - RETRYING
[WARNING] *** CHECKSUM FAILED - Checksum failed on download: local = '2801c41c89e59c0524aeb8a9f81efc599b423447';
remote = 'bc6b549d14b8e4e911b58cbd1ef9e891a98cfbc5' - IGNORING
Uploading: https://repository.apache.org/content/repositories/snapshots/org/apache/any23/plugins/apache-any23-office-scraper/1.0.1-SNAPSHOT/apache-any23-office-scraper-1.0.1-20130405.070836-165.jar
13K uploaded  (apache-any23-office-scraper-1.0.1-20130405.070836-165.jar)
[INFO] Retrieving previous metadata from apache.snapshots.https
[WARNING] *** CHECKSUM FAILED - Checksum failed on download: local = '2801c41c89e59c0524aeb8a9f81efc599b423447';
remote = 'bc6b549d14b8e4e911b58cbd1ef9e891a98cfbc5' - RETRYING
[WARNING] *** CHECKSUM FAILED - Checksum failed on download: local = '2801c41c89e59c0524aeb8a9f81efc599b423447';
remote = 'bc6b549d14b8e4e911b58cbd1ef9e891a98cfbc5' - IGNORING
[INFO] Uploading repository metadata for: 'snapshot org.apache.any23.plugins:apache-any23-office-scraper:1.0.1-SNAPSHOT'
[INFO] Uploading project information for apache-any23-office-scraper 1.0.1-20130405.070836-165
[INFO] Retrieving previous metadata from apache.snapshots.https
[WARNING] *** CHECKSUM FAILED - Checksum failed on download: local = '9cea90e2a3ffc1cc7530e0776e523eda036a73cd';
remote = 'cbc4d1fac942763692a4027e4586d460e5f5c60a' - RETRYING
[WARNING] *** CHECKSUM FAILED - Checksum failed on download: local = '9cea90e2a3ffc1cc7530e0776e523eda036a73cd';
remote = 'cbc4d1fac942763692a4027e4586d460e5f5c60a' - IGNORING
[INFO] Uploading repository metadata for: 'artifact org.apache.any23.plugins:apache-any23-office-scraper'
[INFO] Retrieving previous build number from apache.snapshots.https
Uploading: https://repository.apache.org/content/repositories/snapshots/org/apache/any23/plugins/apache-any23-office-scraper/1.0.1-SNAPSHOT/apache-any23-office-scraper-1.0.1-20130405.070836-165.tar.gz
1636K uploaded  (apache-any23-office-scraper-1.0.1-20130405.070836-165.tar.gz)
[INFO] Retrieving previous build number from apache.snapshots.https
Uploading: https://repository.apache.org/content/repositories/snapshots/org/apache/any23/plugins/apache-any23-office-scraper/1.0.1-SNAPSHOT/apache-any23-office-scraper-1.0.1-20130405.070836-165.zip
1636K uploaded  (apache-any23-office-scraper-1.0.1-20130405.070836-165.zip)
[JENKINS] Archiving <https://builds.apache.org/job/Any23-trunk/ws/plugins/office-scraper/pom.xml>
to /home/hudson/hudson/jobs/Any23-trunk/modules/org.apache.any23.plugins$apache-any23-office-scraper/builds/2013-04-05_07-02-00/archive/org.apache.any23.plugins/apache-any23-office-scraper/1.0.1-SNAPSHOT/apache-any23-office-scraper-1.0.1-SNAPSHOT.pom
[JENKINS] Archiving <https://builds.apache.org/job/Any23-trunk/ws/plugins/office-scraper/target/apache-any23-office-scraper-1.0.1-SNAPSHOT.jar>
to /home/hudson/hudson/jobs/Any23-trunk/modules/org.apache.any23.plugins$apache-any23-office-scraper/builds/2013-04-05_07-02-00/archive/org.apache.any23.plugins/apache-any23-office-scraper/1.0.1-20130405.070836-165/apache-any23-office-scraper-1.0.1-20130405.070836-165.jar
[JENKINS] Archiving <https://builds.apache.org/job/Any23-trunk/ws/plugins/office-scraper/target/apache-any23-office-scraper-1.0.1-SNAPSHOT.tar.gz>
to /home/hudson/hudson/jobs/Any23-trunk/modules/org.apache.any23.plugins$apache-any23-office-scraper/builds/2013-04-05_07-02-00/archive/org.apache.any23.plugins/apache-any23-office-scraper/1.0.1-20130405.070836-165/apache-any23-office-scraper-1.0.1-20130405.070836-165.tar.gz
[JENKINS] Archiving <https://builds.apache.org/job/Any23-trunk/ws/plugins/office-scraper/target/apache-any23-office-scraper-1.0.1-SNAPSHOT.zip>
to /home/hudson/hudson/jobs/Any23-trunk/modules/org.apache.any23.plugins$apache-any23-office-scraper/builds/2013-04-05_07-02-00/archive/org.apache.any23.plugins/apache-any23-office-scraper/1.0.1-20130405.070836-165/apache-any23-office-scraper-1.0.1-20130405.070836-165.zip
[INFO] ------------------------------------------------------------------------
[INFO] Building Apache Any23 :: Plugins :: Integration Test
[INFO]    task-segment: [clean, deploy]
[INFO] ------------------------------------------------------------------------
[INFO] [clean:clean {execution: default-clean}]
[INFO] [cobertura:clean {execution: default}]
[INFO] [buildnumber:create {execution: default}]
[INFO] Checking for local modifications: skipped.
[INFO] Updating project files from SCM: skipped.
[INFO] Executing: /bin/sh -c cd <https://builds.apache.org/job/Any23-trunk/ws/plugins/integration-test>
&& svn --non-interactive info
[INFO] Working directory: <https://builds.apache.org/job/Any23-trunk/ws/plugins/integration-test>
[INFO] Storing buildNumber: 1448870 at timestamp: 1365149303246
[INFO] Executing: /bin/sh -c cd <https://builds.apache.org/job/Any23-trunk/ws/plugins/integration-test>
&& svn --non-interactive info
[INFO] Working directory: <https://builds.apache.org/job/Any23-trunk/ws/plugins/integration-test>
[INFO] Storing buildScmBranch: trunk
[debug] execute contextualize
[INFO] [resources:resources {execution: default-resources}]
[INFO] Using 'UTF-8' encoding to copy filtered resources.
[INFO] Copying 2 resources to META-INF
[INFO] [compiler:compile {execution: default-compile}]
[INFO] Nothing to compile - all classes are up to date
[debug] execute contextualize
[INFO] [resources:testResources {execution: default-testResources}]
[INFO] Using 'UTF-8' encoding to copy filtered resources.
[INFO] Copying 1 resource
[INFO] [compiler:testCompile {execution: default-testCompile}]
[INFO] Compiling 1 source file to <https://builds.apache.org/job/Any23-trunk/ws/plugins/integration-test/target/test-classes>
[INFO] [surefire:test {execution: default-test}]
[INFO] Surefire report directory: <https://builds.apache.org/job/Any23-trunk/ws/plugins/integration-test/target/surefire-reports>

-------------------------------------------------------
 T E S T S
-------------------------------------------------------
There are no tests to run.

Results :

Tests run: 0, Failures: 0, Errors: 0, Skipped: 0

[JENKINS] Recording test results
[INFO] [jar:jar {execution: default-jar}]
[INFO] Building jar: <https://builds.apache.org/job/Any23-trunk/ws/plugins/integration-test/target/apache-any23-integration-test-0.8.0-SNAPSHOT.jar>
[INFO] [assembly:single {execution: assembly}]
[INFO] Assemblies have been skipped per configuration of the skipAssembly parameter.
[INFO] [invoker:run {execution: default}]
[INFO] Building: html-scraper/pom.xml
[INFO] ..SUCCESS (110.6 s)
[INFO] Building: basic-crawler/pom.xml
[INFO] ..FAILED (88.8 s)
[INFO]   The build exited with code 1. See <https://builds.apache.org/job/Any23-trunk/ws/plugins/integration-test/target/plugins-build/basic-crawler/build.log>
for details.
[INFO] Building: office-scraper/pom.xml
[INFO] ..SUCCESS (100.1 s)
[INFO] -------------------------------------------------
[INFO] Build Summary:
[INFO]   Passed: 2, Failed: 1, Errors: 0, Skipped: 0
[INFO] -------------------------------------------------
[ERROR] The following builds failed:
[ERROR] *  basic-crawler/pom.xml
[INFO] -------------------------------------------------
[JENKINS] Archiving <https://builds.apache.org/job/Any23-trunk/ws/plugins/integration-test/pom.xml>
to /home/hudson/hudson/jobs/Any23-trunk/modules/org.apache.any23.plugins$apache-any23-integration-test/builds/2013-04-05_07-02-00/archive/org.apache.any23.plugins/apache-any23-integration-test/0.8.0-SNAPSHOT/apache-any23-integration-test-0.8.0-SNAPSHOT.pom
[JENKINS] Archiving <https://builds.apache.org/job/Any23-trunk/ws/plugins/integration-test/target/apache-any23-integration-test-0.8.0-SNAPSHOT.jar>
to /home/hudson/hudson/jobs/Any23-trunk/modules/org.apache.any23.plugins$apache-any23-integration-test/builds/2013-04-05_07-02-00/archive/org.apache.any23.plugins/apache-any23-integration-test/0.8.0-SNAPSHOT/apache-any23-integration-test-0.8.0-SNAPSHOT.jar
[INFO] ------------------------------------------------------------------------
[ERROR] BUILD FAILURE
[INFO] ------------------------------------------------------------------------
[INFO] : org.apache.maven.plugin.invoker.InvokerSession@1c6a928
1 build failed.
[INFO] ------------------------------------------------------------------------
[INFO] For more information, run Maven with the -e switch
[INFO] ------------------------------------------------------------------------
[INFO] Total time: 67 minutes 7 seconds
[INFO] Finished at: Fri Apr 05 08:14:27 GMT+00:00 2013
[INFO] Final Memory: 80M/420M
[INFO] ------------------------------------------------------------------------
Maven failed with error.
Sending e-mails to: any23-dev@apache.org
Sending e-mails to: any23-dev@apache.org
channel stopped

Mime
View raw message