any23-dev mailing list archives

Site index · List index
Message view « Date » · « Thread »
Top « Date » · « Thread »
From Apache Jenkins Server <jenk...@builds.apache.org>
Subject Build failed in Jenkins: Any23-trunk #505
Date Sat, 09 Mar 2013 08:03:16 GMT
See <https://builds.apache.org/job/Any23-trunk/505/>

------------------------------------------
[...truncated 5357 lines...]
2529K uploaded  (apache-any23-basic-crawler-1.0.1-20130309.070723-147.tar.gz)
[INFO] Retrieving previous build number from apache.snapshots.https
Uploading: https://repository.apache.org/content/repositories/snapshots/org/apache/any23/plugins/apache-any23-basic-crawler/1.0.1-SNAPSHOT/apache-any23-basic-crawler-1.0.1-20130309.070723-147.zip
2530K uploaded  (apache-any23-basic-crawler-1.0.1-20130309.070723-147.zip)
[INFO] Retrieving previous build number from apache.snapshots.https
Uploading: https://repository.apache.org/content/repositories/snapshots/org/apache/any23/plugins/apache-any23-basic-crawler/1.0.1-SNAPSHOT/apache-any23-basic-crawler-1.0.1-20130309.070723-147-tests.jar
9K uploaded  (apache-any23-basic-crawler-1.0.1-20130309.070723-147-tests.jar)
[JENKINS] Archiving <https://builds.apache.org/job/Any23-trunk/ws/plugins/basic-crawler/pom.xml>
to /home/hudson/hudson/jobs/Any23-trunk/modules/org.apache.any23.plugins$apache-any23-basic-crawler/builds/2013-03-09_07-01-27/archive/org.apache.any23.plugins/apache-any23-basic-crawler/1.0.1-SNAPSHOT/apache-any23-basic-crawler-1.0.1-SNAPSHOT.pom
[JENKINS] Archiving <https://builds.apache.org/job/Any23-trunk/ws/plugins/basic-crawler/target/apache-any23-basic-crawler-1.0.1-SNAPSHOT.jar>
to /home/hudson/hudson/jobs/Any23-trunk/modules/org.apache.any23.plugins$apache-any23-basic-crawler/builds/2013-03-09_07-01-27/archive/org.apache.any23.plugins/apache-any23-basic-crawler/1.0.1-20130309.070723-147/apache-any23-basic-crawler-1.0.1-20130309.070723-147.jar
[JENKINS] Archiving <https://builds.apache.org/job/Any23-trunk/ws/plugins/basic-crawler/target/apache-any23-basic-crawler-1.0.1-SNAPSHOT.tar.gz>
to /home/hudson/hudson/jobs/Any23-trunk/modules/org.apache.any23.plugins$apache-any23-basic-crawler/builds/2013-03-09_07-01-27/archive/org.apache.any23.plugins/apache-any23-basic-crawler/1.0.1-20130309.070723-147/apache-any23-basic-crawler-1.0.1-20130309.070723-147.tar.gz
[JENKINS] Archiving <https://builds.apache.org/job/Any23-trunk/ws/plugins/basic-crawler/target/apache-any23-basic-crawler-1.0.1-SNAPSHOT.zip>
to /home/hudson/hudson/jobs/Any23-trunk/modules/org.apache.any23.plugins$apache-any23-basic-crawler/builds/2013-03-09_07-01-27/archive/org.apache.any23.plugins/apache-any23-basic-crawler/1.0.1-20130309.070723-147/apache-any23-basic-crawler-1.0.1-20130309.070723-147.zip
[JENKINS] Archiving <https://builds.apache.org/job/Any23-trunk/ws/plugins/basic-crawler/target/apache-any23-basic-crawler-1.0.1-SNAPSHOT-tests.jar>
to /home/hudson/hudson/jobs/Any23-trunk/modules/org.apache.any23.plugins$apache-any23-basic-crawler/builds/2013-03-09_07-01-27/archive/org.apache.any23.plugins/apache-any23-basic-crawler/1.0.1-20130309.070723-147/apache-any23-basic-crawler-1.0.1-20130309.070723-147-tests.jar
[INFO] ------------------------------------------------------------------------
[INFO] Building Apache Any23 :: Plugins :: HTML Scraper
[INFO]    task-segment: [clean, deploy]
[INFO] ------------------------------------------------------------------------
[INFO] [clean:clean {execution: default-clean}]
[INFO] [cobertura:clean {execution: default}]
[INFO] [buildnumber:create {execution: default}]
[INFO] Checking for local modifications: skipped.
[INFO] Updating project files from SCM: skipped.
[INFO] Executing: /bin/sh -c cd <https://builds.apache.org/job/Any23-trunk/ws/plugins/html-scraper>
&& svn --non-interactive info
[INFO] Working directory: <https://builds.apache.org/job/Any23-trunk/ws/plugins/html-scraper>
[INFO] Storing buildNumber: 1435999 at timestamp: 1362815922411
[INFO] Executing: /bin/sh -c cd <https://builds.apache.org/job/Any23-trunk/ws/plugins/html-scraper>
&& svn --non-interactive info
[INFO] Working directory: <https://builds.apache.org/job/Any23-trunk/ws/plugins/html-scraper>
[INFO] Storing buildScmBranch: trunk
[debug] execute contextualize
[INFO] [resources:resources {execution: default-resources}]
[INFO] Using 'UTF-8' encoding to copy filtered resources.
[INFO] Copying 2 resources to META-INF
[INFO] [compiler:compile {execution: default-compile}]
[INFO] Compiling 3 source files to <https://builds.apache.org/job/Any23-trunk/ws/plugins/html-scraper/target/classes>
[debug] execute contextualize
[INFO] [resources:testResources {execution: default-testResources}]
[INFO] Using 'UTF-8' encoding to copy filtered resources.
[INFO] Copying 1 resource
[INFO] [compiler:testCompile {execution: default-testCompile}]
[INFO] Compiling 1 source file to <https://builds.apache.org/job/Any23-trunk/ws/plugins/html-scraper/target/test-classes>
[INFO] [surefire:test {execution: default-test}]
[INFO] Surefire report directory: <https://builds.apache.org/job/Any23-trunk/ws/plugins/html-scraper/target/surefire-reports>

-------------------------------------------------------
 T E S T S
-------------------------------------------------------
Running org.apache.any23.plugin.htmlscraper.HTMLScraperExtractorTest
SLF4J: Failed to load class "org.slf4j.impl.StaticLoggerBinder".
SLF4J: Defaulting to no-operation (NOP) logger implementation
SLF4J: See http://www.slf4j.org/codes.html#StaticLoggerBinder for further details.
Tests run: 2, Failures: 0, Errors: 0, Skipped: 0, Time elapsed: 0.578 sec

Results :

Tests run: 2, Failures: 0, Errors: 0, Skipped: 0

[JENKINS] Recording test results
[INFO] [jar:jar {execution: default-jar}]
[INFO] Building jar: <https://builds.apache.org/job/Any23-trunk/ws/plugins/html-scraper/target/apache-any23-html-scraper-1.0.2-SNAPSHOT.jar>
[INFO] [assembly:single {execution: assembly}]
[INFO] Reading assembly descriptor: <https://builds.apache.org/job/Any23-trunk/ws/plugins/html-scraper/src/main/assembly/bin.xml>
[INFO] Building tar: <https://builds.apache.org/job/Any23-trunk/ws/plugins/html-scraper/target/apache-any23-html-scraper-1.0.2-SNAPSHOT.tar.gz>
[INFO] Building zip: <https://builds.apache.org/job/Any23-trunk/ws/plugins/html-scraper/target/apache-any23-html-scraper-1.0.2-SNAPSHOT.zip>
[INFO] [install:install {execution: default-install}]
[INFO] Installing <https://builds.apache.org/job/Any23-trunk/ws/plugins/html-scraper/target/apache-any23-html-scraper-1.0.2-SNAPSHOT.jar>
to /export/home/hudson/hudson-slave/maven-repositories/1/org/apache/any23/plugins/apache-any23-html-scraper/1.0.2-SNAPSHOT/apache-any23-html-scraper-1.0.2-SNAPSHOT.jar
[INFO] Installing <https://builds.apache.org/job/Any23-trunk/ws/plugins/html-scraper/target/apache-any23-html-scraper-1.0.2-SNAPSHOT.tar.gz>
to /export/home/hudson/hudson-slave/maven-repositories/1/org/apache/any23/plugins/apache-any23-html-scraper/1.0.2-SNAPSHOT/apache-any23-html-scraper-1.0.2-SNAPSHOT.tar.gz
[INFO] Installing <https://builds.apache.org/job/Any23-trunk/ws/plugins/html-scraper/target/apache-any23-html-scraper-1.0.2-SNAPSHOT.zip>
to /export/home/hudson/hudson-slave/maven-repositories/1/org/apache/any23/plugins/apache-any23-html-scraper/1.0.2-SNAPSHOT/apache-any23-html-scraper-1.0.2-SNAPSHOT.zip
[INFO] [deploy:deploy {execution: default-deploy}]
[INFO] Retrieving previous build number from apache.snapshots.https
[WARNING] *** CHECKSUM FAILED - Checksum failed on download: local = '67d67c872432d061d767f4f9957b18f01621ede7';
remote = '5fb3558c9bd56b56bc52885c32ae696d590055d5' - RETRYING
[WARNING] *** CHECKSUM FAILED - Checksum failed on download: local = '67d67c872432d061d767f4f9957b18f01621ede7';
remote = '5fb3558c9bd56b56bc52885c32ae696d590055d5' - IGNORING
Uploading: https://repository.apache.org/content/repositories/snapshots/org/apache/any23/plugins/apache-any23-html-scraper/1.0.2-SNAPSHOT/apache-any23-html-scraper-1.0.2-20130309.070723-144.jar
12K uploaded  (apache-any23-html-scraper-1.0.2-20130309.070723-144.jar)
[INFO] Retrieving previous metadata from apache.snapshots.https
[WARNING] *** CHECKSUM FAILED - Checksum failed on download: local = '67d67c872432d061d767f4f9957b18f01621ede7';
remote = '5fb3558c9bd56b56bc52885c32ae696d590055d5' - RETRYING
[WARNING] *** CHECKSUM FAILED - Checksum failed on download: local = '67d67c872432d061d767f4f9957b18f01621ede7';
remote = '5fb3558c9bd56b56bc52885c32ae696d590055d5' - IGNORING
[INFO] Uploading repository metadata for: 'snapshot org.apache.any23.plugins:apache-any23-html-scraper:1.0.2-SNAPSHOT'
[INFO] Uploading project information for apache-any23-html-scraper 1.0.2-20130309.070723-144
[INFO] Retrieving previous metadata from apache.snapshots.https
[WARNING] *** CHECKSUM FAILED - Checksum failed on download: local = '681053878365559e12ffce158eaceb27394a8d64';
remote = 'd5e742fdd9af84266b94d8463a444257707c73df' - RETRYING
[WARNING] *** CHECKSUM FAILED - Checksum failed on download: local = '681053878365559e12ffce158eaceb27394a8d64';
remote = 'd5e742fdd9af84266b94d8463a444257707c73df' - IGNORING
[INFO] Uploading repository metadata for: 'artifact org.apache.any23.plugins:apache-any23-html-scraper'
[INFO] Retrieving previous build number from apache.snapshots.https
Uploading: https://repository.apache.org/content/repositories/snapshots/org/apache/any23/plugins/apache-any23-html-scraper/1.0.2-SNAPSHOT/apache-any23-html-scraper-1.0.2-20130309.070723-144.tar.gz
99K uploaded  (apache-any23-html-scraper-1.0.2-20130309.070723-144.tar.gz)
[INFO] Retrieving previous build number from apache.snapshots.https
Uploading: https://repository.apache.org/content/repositories/snapshots/org/apache/any23/plugins/apache-any23-html-scraper/1.0.2-SNAPSHOT/apache-any23-html-scraper-1.0.2-20130309.070723-144.zip
100K uploaded  (apache-any23-html-scraper-1.0.2-20130309.070723-144.zip)
[JENKINS] Archiving <https://builds.apache.org/job/Any23-trunk/ws/plugins/html-scraper/pom.xml>
to /home/hudson/hudson/jobs/Any23-trunk/modules/org.apache.any23.plugins$apache-any23-html-scraper/builds/2013-03-09_07-01-27/archive/org.apache.any23.plugins/apache-any23-html-scraper/1.0.2-SNAPSHOT/apache-any23-html-scraper-1.0.2-SNAPSHOT.pom
[JENKINS] Archiving <https://builds.apache.org/job/Any23-trunk/ws/plugins/html-scraper/target/apache-any23-html-scraper-1.0.2-SNAPSHOT.jar>
to /home/hudson/hudson/jobs/Any23-trunk/modules/org.apache.any23.plugins$apache-any23-html-scraper/builds/2013-03-09_07-01-27/archive/org.apache.any23.plugins/apache-any23-html-scraper/1.0.2-20130309.070723-144/apache-any23-html-scraper-1.0.2-20130309.070723-144.jar
[JENKINS] Archiving <https://builds.apache.org/job/Any23-trunk/ws/plugins/html-scraper/target/apache-any23-html-scraper-1.0.2-SNAPSHOT.tar.gz>
to /home/hudson/hudson/jobs/Any23-trunk/modules/org.apache.any23.plugins$apache-any23-html-scraper/builds/2013-03-09_07-01-27/archive/org.apache.any23.plugins/apache-any23-html-scraper/1.0.2-20130309.070723-144/apache-any23-html-scraper-1.0.2-20130309.070723-144.tar.gz
[JENKINS] Archiving <https://builds.apache.org/job/Any23-trunk/ws/plugins/html-scraper/target/apache-any23-html-scraper-1.0.2-SNAPSHOT.zip>
to /home/hudson/hudson/jobs/Any23-trunk/modules/org.apache.any23.plugins$apache-any23-html-scraper/builds/2013-03-09_07-01-27/archive/org.apache.any23.plugins/apache-any23-html-scraper/1.0.2-20130309.070723-144/apache-any23-html-scraper-1.0.2-20130309.070723-144.zip
[INFO] ------------------------------------------------------------------------
[INFO] Building Apache Any23 :: Plugins :: Office Scraper
[INFO]    task-segment: [clean, deploy]
[INFO] ------------------------------------------------------------------------
[INFO] [clean:clean {execution: default-clean}]
[INFO] [cobertura:clean {execution: default}]
[INFO] [buildnumber:create {execution: default}]
[INFO] Checking for local modifications: skipped.
[INFO] Updating project files from SCM: skipped.
[INFO] Executing: /bin/sh -c cd <https://builds.apache.org/job/Any23-trunk/ws/plugins/office-scraper>
&& svn --non-interactive info
[INFO] Working directory: <https://builds.apache.org/job/Any23-trunk/ws/plugins/office-scraper>
[INFO] Storing buildNumber: 1435999 at timestamp: 1362815969855
[INFO] Executing: /bin/sh -c cd <https://builds.apache.org/job/Any23-trunk/ws/plugins/office-scraper>
&& svn --non-interactive info
[INFO] Working directory: <https://builds.apache.org/job/Any23-trunk/ws/plugins/office-scraper>
[INFO] Storing buildScmBranch: trunk
[debug] execute contextualize
[INFO] [resources:resources {execution: default-resources}]
[INFO] Using 'UTF-8' encoding to copy filtered resources.
[INFO] Copying 2 resources to META-INF
[INFO] [compiler:compile {execution: default-compile}]
[INFO] Compiling 4 source files to <https://builds.apache.org/job/Any23-trunk/ws/plugins/office-scraper/target/classes>
[debug] execute contextualize
[INFO] [resources:testResources {execution: default-testResources}]
[INFO] Using 'UTF-8' encoding to copy filtered resources.
[INFO] Copying 2 resources
[INFO] [compiler:testCompile {execution: default-testCompile}]
[INFO] Compiling 2 source files to <https://builds.apache.org/job/Any23-trunk/ws/plugins/office-scraper/target/test-classes>
[INFO] [surefire:test {execution: default-test}]
[INFO] Surefire report directory: <https://builds.apache.org/job/Any23-trunk/ws/plugins/office-scraper/target/surefire-reports>

-------------------------------------------------------
 T E S T S
-------------------------------------------------------
Running org.apache.any23.plugin.officescraper.ExcelExtractorTest
SLF4J: Failed to load class "org.slf4j.impl.StaticLoggerBinder".
SLF4J: Defaulting to no-operation (NOP) logger implementation
SLF4J: See http://www.slf4j.org/codes.html#StaticLoggerBinder for further details.
Tests run: 3, Failures: 0, Errors: 0, Skipped: 0, Time elapsed: 1.836 sec
Running org.apache.any23.plugin.officescraper.XSSFWorkbookTest
Tests run: 2, Failures: 0, Errors: 0, Skipped: 0, Time elapsed: 0.083 sec

[JENKINS] Recording test resultsResults :

Tests run: 5, Failures: 0, Errors: 0, Skipped: 0


[INFO] [jar:jar {execution: default-jar}]
[INFO] Building jar: <https://builds.apache.org/job/Any23-trunk/ws/plugins/office-scraper/target/apache-any23-office-scraper-1.0.1-SNAPSHOT.jar>
[INFO] [assembly:single {execution: assembly}]
[INFO] Reading assembly descriptor: <https://builds.apache.org/job/Any23-trunk/ws/plugins/office-scraper/src/main/assembly/bin.xml>
[INFO] Building tar: <https://builds.apache.org/job/Any23-trunk/ws/plugins/office-scraper/target/apache-any23-office-scraper-1.0.1-SNAPSHOT.tar.gz>
[INFO] Building zip: <https://builds.apache.org/job/Any23-trunk/ws/plugins/office-scraper/target/apache-any23-office-scraper-1.0.1-SNAPSHOT.zip>
[INFO] [install:install {execution: default-install}]
[INFO] Installing <https://builds.apache.org/job/Any23-trunk/ws/plugins/office-scraper/target/apache-any23-office-scraper-1.0.1-SNAPSHOT.jar>
to /export/home/hudson/hudson-slave/maven-repositories/1/org/apache/any23/plugins/apache-any23-office-scraper/1.0.1-SNAPSHOT/apache-any23-office-scraper-1.0.1-SNAPSHOT.jar
[INFO] Installing <https://builds.apache.org/job/Any23-trunk/ws/plugins/office-scraper/target/apache-any23-office-scraper-1.0.1-SNAPSHOT.tar.gz>
to /export/home/hudson/hudson-slave/maven-repositories/1/org/apache/any23/plugins/apache-any23-office-scraper/1.0.1-SNAPSHOT/apache-any23-office-scraper-1.0.1-SNAPSHOT.tar.gz
[INFO] Installing <https://builds.apache.org/job/Any23-trunk/ws/plugins/office-scraper/target/apache-any23-office-scraper-1.0.1-SNAPSHOT.zip>
to /export/home/hudson/hudson-slave/maven-repositories/1/org/apache/any23/plugins/apache-any23-office-scraper/1.0.1-SNAPSHOT/apache-any23-office-scraper-1.0.1-SNAPSHOT.zip
[INFO] [deploy:deploy {execution: default-deploy}]
[INFO] Retrieving previous build number from apache.snapshots.https
[WARNING] *** CHECKSUM FAILED - Checksum failed on download: local = '8c1f096cfceb2c63ed740664fc3266f63f483c64';
remote = 'd62bba071f182ad5008ebc076078f3d48777c05b' - RETRYING
[WARNING] *** CHECKSUM FAILED - Checksum failed on download: local = '8c1f096cfceb2c63ed740664fc3266f63f483c64';
remote = 'd62bba071f182ad5008ebc076078f3d48777c05b' - IGNORING
Uploading: https://repository.apache.org/content/repositories/snapshots/org/apache/any23/plugins/apache-any23-office-scraper/1.0.1-SNAPSHOT/apache-any23-office-scraper-1.0.1-20130309.070723-143.jar
13K uploaded  (apache-any23-office-scraper-1.0.1-20130309.070723-143.jar)
[INFO] Retrieving previous metadata from apache.snapshots.https
[WARNING] *** CHECKSUM FAILED - Checksum failed on download: local = '8c1f096cfceb2c63ed740664fc3266f63f483c64';
remote = 'd62bba071f182ad5008ebc076078f3d48777c05b' - RETRYING
[WARNING] *** CHECKSUM FAILED - Checksum failed on download: local = '8c1f096cfceb2c63ed740664fc3266f63f483c64';
remote = 'd62bba071f182ad5008ebc076078f3d48777c05b' - IGNORING
[INFO] Uploading repository metadata for: 'snapshot org.apache.any23.plugins:apache-any23-office-scraper:1.0.1-SNAPSHOT'
[INFO] Uploading project information for apache-any23-office-scraper 1.0.1-20130309.070723-143
[INFO] Retrieving previous metadata from apache.snapshots.https
[WARNING] *** CHECKSUM FAILED - Checksum failed on download: local = '6818efcd6bf959f630075bddf190028101a3143b';
remote = 'be6bcb50cdda2d12610050cb85a163e78a8d11e2' - RETRYING
[WARNING] *** CHECKSUM FAILED - Checksum failed on download: local = '6818efcd6bf959f630075bddf190028101a3143b';
remote = 'be6bcb50cdda2d12610050cb85a163e78a8d11e2' - IGNORING
[INFO] Uploading repository metadata for: 'artifact org.apache.any23.plugins:apache-any23-office-scraper'
[INFO] Retrieving previous build number from apache.snapshots.https
Uploading: https://repository.apache.org/content/repositories/snapshots/org/apache/any23/plugins/apache-any23-office-scraper/1.0.1-SNAPSHOT/apache-any23-office-scraper-1.0.1-20130309.070723-143.tar.gz
1636K uploaded  (apache-any23-office-scraper-1.0.1-20130309.070723-143.tar.gz)
[INFO] Retrieving previous build number from apache.snapshots.https
Uploading: https://repository.apache.org/content/repositories/snapshots/org/apache/any23/plugins/apache-any23-office-scraper/1.0.1-SNAPSHOT/apache-any23-office-scraper-1.0.1-20130309.070723-143.zip
1636K uploaded  (apache-any23-office-scraper-1.0.1-20130309.070723-143.zip)
[JENKINS] Archiving <https://builds.apache.org/job/Any23-trunk/ws/plugins/office-scraper/pom.xml>
to /home/hudson/hudson/jobs/Any23-trunk/modules/org.apache.any23.plugins$apache-any23-office-scraper/builds/2013-03-09_07-01-27/archive/org.apache.any23.plugins/apache-any23-office-scraper/1.0.1-SNAPSHOT/apache-any23-office-scraper-1.0.1-SNAPSHOT.pom
[JENKINS] Archiving <https://builds.apache.org/job/Any23-trunk/ws/plugins/office-scraper/target/apache-any23-office-scraper-1.0.1-SNAPSHOT.jar>
to /home/hudson/hudson/jobs/Any23-trunk/modules/org.apache.any23.plugins$apache-any23-office-scraper/builds/2013-03-09_07-01-27/archive/org.apache.any23.plugins/apache-any23-office-scraper/1.0.1-20130309.070723-143/apache-any23-office-scraper-1.0.1-20130309.070723-143.jar
[JENKINS] Archiving <https://builds.apache.org/job/Any23-trunk/ws/plugins/office-scraper/target/apache-any23-office-scraper-1.0.1-SNAPSHOT.tar.gz>
to /home/hudson/hudson/jobs/Any23-trunk/modules/org.apache.any23.plugins$apache-any23-office-scraper/builds/2013-03-09_07-01-27/archive/org.apache.any23.plugins/apache-any23-office-scraper/1.0.1-20130309.070723-143/apache-any23-office-scraper-1.0.1-20130309.070723-143.tar.gz
[JENKINS] Archiving <https://builds.apache.org/job/Any23-trunk/ws/plugins/office-scraper/target/apache-any23-office-scraper-1.0.1-SNAPSHOT.zip>
to /home/hudson/hudson/jobs/Any23-trunk/modules/org.apache.any23.plugins$apache-any23-office-scraper/builds/2013-03-09_07-01-27/archive/org.apache.any23.plugins/apache-any23-office-scraper/1.0.1-20130309.070723-143/apache-any23-office-scraper-1.0.1-20130309.070723-143.zip
[INFO] ------------------------------------------------------------------------
[INFO] Building Apache Any23 :: Plugins :: Integration Test
[INFO]    task-segment: [clean, deploy]
[INFO] ------------------------------------------------------------------------
[INFO] [clean:clean {execution: default-clean}]
[INFO] [cobertura:clean {execution: default}]
[INFO] [buildnumber:create {execution: default}]
[INFO] Checking for local modifications: skipped.
[INFO] Updating project files from SCM: skipped.
[INFO] Executing: /bin/sh -c cd <https://builds.apache.org/job/Any23-trunk/ws/plugins/integration-test>
&& svn --non-interactive info
[INFO] Working directory: <https://builds.apache.org/job/Any23-trunk/ws/plugins/integration-test>
[INFO] Storing buildNumber: 1448870 at timestamp: 1362816142086
[INFO] Executing: /bin/sh -c cd <https://builds.apache.org/job/Any23-trunk/ws/plugins/integration-test>
&& svn --non-interactive info
[INFO] Working directory: <https://builds.apache.org/job/Any23-trunk/ws/plugins/integration-test>
[INFO] Storing buildScmBranch: trunk
[debug] execute contextualize
[INFO] [resources:resources {execution: default-resources}]
[INFO] Using 'UTF-8' encoding to copy filtered resources.
[INFO] Copying 2 resources to META-INF
[INFO] [compiler:compile {execution: default-compile}]
[INFO] Nothing to compile - all classes are up to date
[debug] execute contextualize
[INFO] [resources:testResources {execution: default-testResources}]
[INFO] Using 'UTF-8' encoding to copy filtered resources.
[INFO] Copying 1 resource
[INFO] [compiler:testCompile {execution: default-testCompile}]
[INFO] Compiling 1 source file to <https://builds.apache.org/job/Any23-trunk/ws/plugins/integration-test/target/test-classes>
[INFO] [surefire:test {execution: default-test}]
[INFO] Surefire report directory: <https://builds.apache.org/job/Any23-trunk/ws/plugins/integration-test/target/surefire-reports>

-------------------------------------------------------
 T E S T S
-------------------------------------------------------
There are no tests to run.

Results :

Tests run: 0, Failures: 0, Errors: 0, Skipped: 0

[JENKINS] Recording test results
[INFO] [jar:jar {execution: default-jar}]
[INFO] Building jar: <https://builds.apache.org/job/Any23-trunk/ws/plugins/integration-test/target/apache-any23-integration-test-0.8.0-SNAPSHOT.jar>
[INFO] [assembly:single {execution: assembly}]
[INFO] Assemblies have been skipped per configuration of the skipAssembly parameter.
[INFO] [invoker:run {execution: default}]
[INFO] Building: html-scraper/pom.xml
[INFO] ..SUCCESS (43.9 s)
[INFO] Building: basic-crawler/pom.xml
[INFO] ..FAILED (42.6 s)
[INFO]   The build exited with code 1. See <https://builds.apache.org/job/Any23-trunk/ws/plugins/integration-test/target/plugins-build/basic-crawler/build.log>
for details.
[INFO] Building: office-scraper/pom.xml
[INFO] ..SUCCESS (28.4 s)
[INFO] -------------------------------------------------
[INFO] Build Summary:
[INFO]   Passed: 2, Failed: 1, Errors: 0, Skipped: 0
[INFO] -------------------------------------------------
[ERROR] The following builds failed:
[ERROR] *  basic-crawler/pom.xml
[INFO] -------------------------------------------------
[JENKINS] Archiving <https://builds.apache.org/job/Any23-trunk/ws/plugins/integration-test/pom.xml>
to /home/hudson/hudson/jobs/Any23-trunk/modules/org.apache.any23.plugins$apache-any23-integration-test/builds/2013-03-09_07-01-28/archive/org.apache.any23.plugins/apache-any23-integration-test/0.8.0-SNAPSHOT/apache-any23-integration-test-0.8.0-SNAPSHOT.pom
[JENKINS] Archiving <https://builds.apache.org/job/Any23-trunk/ws/plugins/integration-test/target/apache-any23-integration-test-0.8.0-SNAPSHOT.jar>
to /home/hudson/hudson/jobs/Any23-trunk/modules/org.apache.any23.plugins$apache-any23-integration-test/builds/2013-03-09_07-01-28/archive/org.apache.any23.plugins/apache-any23-integration-test/0.8.0-SNAPSHOT/apache-any23-integration-test-0.8.0-SNAPSHOT.jar
[INFO] ------------------------------------------------------------------------
[ERROR] BUILD FAILURE
[INFO] ------------------------------------------------------------------------
[INFO] : org.apache.maven.plugin.invoker.InvokerSession@1b66555
1 build failed.
[INFO] ------------------------------------------------------------------------
[INFO] For more information, run Maven with the -e switch
[INFO] ------------------------------------------------------------------------
[INFO] Total time: 58 minutes 31 seconds
[INFO] Finished at: Sat Mar 09 08:04:39 GMT+00:00 2013
[INFO] Final Memory: 81M/452M
[INFO] ------------------------------------------------------------------------
Maven failed with error.
Sending e-mails to: any23-dev@apache.org
Sending e-mails to: any23-dev@apache.org
channel stopped

Mime
View raw message