any23-dev mailing list archives

Site index · List index
Message view « Date » · « Thread »
Top « Date » · « Thread »
From Apache Jenkins Server <jenk...@builds.apache.org>
Subject Build failed in Jenkins: Any23-trunk » Apache Any23 :: Plugins :: Integration Test #492
Date Sun, 24 Feb 2013 08:05:09 GMT
See <https://builds.apache.org/job/Any23-trunk/org.apache.any23.plugins$apache-any23-integration-test/492/>

------------------------------------------
[INFO] ------------------------------------------------------------------------
[INFO] Building Apache Any23 :: Plugins :: Integration Test
[INFO]    task-segment: [clean, deploy]
[INFO] ------------------------------------------------------------------------
[INFO] [clean:clean {execution: default-clean}]
[INFO] [cobertura:clean {execution: default}]
[INFO] [buildnumber:create {execution: default}]
[INFO] Checking for local modifications: skipped.
[INFO] Updating project files from SCM: skipped.
[INFO] Executing: /bin/sh -c cd <https://builds.apache.org/job/Any23-trunk/org.apache.any23.plugins$apache-any23-integration-test/ws/>
&& svn --non-interactive info
[INFO] Working directory: <https://builds.apache.org/job/Any23-trunk/org.apache.any23.plugins$apache-any23-integration-test/ws/>
[INFO] Storing buildNumber: 1448870 at timestamp: 1361692819503
[INFO] Executing: /bin/sh -c cd <https://builds.apache.org/job/Any23-trunk/org.apache.any23.plugins$apache-any23-integration-test/ws/>
&& svn --non-interactive info
[INFO] Working directory: <https://builds.apache.org/job/Any23-trunk/org.apache.any23.plugins$apache-any23-integration-test/ws/>
[INFO] Storing buildScmBranch: trunk
[debug] execute contextualize
[INFO] [resources:resources {execution: default-resources}]
[INFO] Using 'UTF-8' encoding to copy filtered resources.
[INFO] Copying 2 resources to META-INF
[INFO] [compiler:compile {execution: default-compile}]
[INFO] Nothing to compile - all classes are up to date
[debug] execute contextualize
[INFO] [resources:testResources {execution: default-testResources}]
[INFO] Using 'UTF-8' encoding to copy filtered resources.
[INFO] Copying 1 resource
[INFO] [compiler:testCompile {execution: default-testCompile}]
[INFO] Compiling 1 source file to <https://builds.apache.org/job/Any23-trunk/org.apache.any23.plugins$apache-any23-integration-test/ws/target/test-classes>
[INFO] [surefire:test {execution: default-test}]
[INFO] Surefire report directory: <https://builds.apache.org/job/Any23-trunk/org.apache.any23.plugins$apache-any23-integration-test/ws/target/surefire-reports>

-------------------------------------------------------
 T E S T S
-------------------------------------------------------
There are no tests to run.

Results :

Tests run: 0, Failures: 0, Errors: 0, Skipped: 0

[JENKINS] Recording test results
[INFO] [jar:jar {execution: default-jar}]
[INFO] Building jar: <https://builds.apache.org/job/Any23-trunk/org.apache.any23.plugins$apache-any23-integration-test/ws/target/apache-any23-integration-test-0.8.0-SNAPSHOT.jar>
[INFO] [assembly:single {execution: assembly}]
[INFO] Assemblies have been skipped per configuration of the skipAssembly parameter.
[INFO] [invoker:run {execution: default}]
[INFO] Building: basic-crawler/pom.xml
[INFO] ..FAILED (150.5 s)
[INFO]   The build exited with code 1. See <https://builds.apache.org/job/Any23-trunk/org.apache.any23.plugins$apache-any23-integration-test/ws/target/plugins-build/basic-crawler/build.log>
for details.
[INFO] Building: html-scraper/pom.xml
[INFO] ..SUCCESS (103.2 s)
[INFO] Building: office-scraper/pom.xml
[INFO] ..SUCCESS (46.1 s)
[INFO] -------------------------------------------------
[INFO] Build Summary:
[INFO]   Passed: 2, Failed: 1, Errors: 0, Skipped: 0
[INFO] -------------------------------------------------
[ERROR] The following builds failed:
[ERROR] *  basic-crawler/pom.xml
[INFO] -------------------------------------------------
[JENKINS] Archiving <https://builds.apache.org/job/Any23-trunk/org.apache.any23.plugins$apache-any23-integration-test/ws/pom.xml>
to /home/hudson/hudson/jobs/Any23-trunk/modules/org.apache.any23.plugins$apache-any23-integration-test/builds/2013-02-24_07-01-12/archive/org.apache.any23.plugins/apache-any23-integration-test/0.8.0-SNAPSHOT/apache-any23-integration-test-0.8.0-SNAPSHOT.pom
[JENKINS] Archiving <https://builds.apache.org/job/Any23-trunk/org.apache.any23.plugins$apache-any23-integration-test/ws/target/apache-any23-integration-test-0.8.0-SNAPSHOT.jar>
to /home/hudson/hudson/jobs/Any23-trunk/modules/org.apache.any23.plugins$apache-any23-integration-test/builds/2013-02-24_07-01-12/archive/org.apache.any23.plugins/apache-any23-integration-test/0.8.0-SNAPSHOT/apache-any23-integration-test-0.8.0-SNAPSHOT.jar
[INFO] ------------------------------------------------------------------------
[ERROR] BUILD FAILURE
[INFO] ------------------------------------------------------------------------
[INFO] : org.apache.maven.plugin.invoker.InvokerSession@14e5e23
1 build failed.
[INFO] ------------------------------------------------------------------------
[INFO] For more information, run Maven with the -e switch
[INFO] ------------------------------------------------------------------------
[INFO] Total time: 60 minutes 57 seconds
[INFO] Finished at: Sun Feb 24 08:06:34 GMT+00:00 2013
[INFO] Final Memory: 80M/425M
[INFO] ------------------------------------------------------------------------
Maven failed with error.

Mime
View raw message