any23-dev mailing list archives

Site index · List index
Message view « Date » · « Thread »
Top « Date » · « Thread »
From Apache Jenkins Server <jenk...@builds.apache.org>
Subject Build failed in Jenkins: Any23-trunk #495
Date Wed, 27 Feb 2013 08:21:32 GMT
See <https://builds.apache.org/job/Any23-trunk/495/>

------------------------------------------
[...truncated 5354 lines...]
[INFO] Retrieving previous build number from apache.snapshots.https
Uploading: https://repository.apache.org/content/repositories/snapshots/org/apache/any23/plugins/apache-any23-basic-crawler/1.0.1-SNAPSHOT/apache-any23-basic-crawler-1.0.1-20130227.072549-138.zip
2530K uploaded  (apache-any23-basic-crawler-1.0.1-20130227.072549-138.zip)
[INFO] Retrieving previous build number from apache.snapshots.https
Uploading: https://repository.apache.org/content/repositories/snapshots/org/apache/any23/plugins/apache-any23-basic-crawler/1.0.1-SNAPSHOT/apache-any23-basic-crawler-1.0.1-20130227.072549-138-tests.jar
9K uploaded  (apache-any23-basic-crawler-1.0.1-20130227.072549-138-tests.jar)
[JENKINS] Archiving <https://builds.apache.org/job/Any23-trunk/ws/plugins/basic-crawler/pom.xml>
to /home/hudson/hudson/jobs/Any23-trunk/modules/org.apache.any23.plugins$apache-any23-basic-crawler/builds/2013-02-27_07-19-56/archive/org.apache.any23.plugins/apache-any23-basic-crawler/1.0.1-SNAPSHOT/apache-any23-basic-crawler-1.0.1-SNAPSHOT.pom
[JENKINS] Archiving <https://builds.apache.org/job/Any23-trunk/ws/plugins/basic-crawler/target/apache-any23-basic-crawler-1.0.1-SNAPSHOT.jar>
to /home/hudson/hudson/jobs/Any23-trunk/modules/org.apache.any23.plugins$apache-any23-basic-crawler/builds/2013-02-27_07-19-56/archive/org.apache.any23.plugins/apache-any23-basic-crawler/1.0.1-20130227.072549-138/apache-any23-basic-crawler-1.0.1-20130227.072549-138.jar
[JENKINS] Archiving <https://builds.apache.org/job/Any23-trunk/ws/plugins/basic-crawler/target/apache-any23-basic-crawler-1.0.1-SNAPSHOT.tar.gz>
to /home/hudson/hudson/jobs/Any23-trunk/modules/org.apache.any23.plugins$apache-any23-basic-crawler/builds/2013-02-27_07-19-56/archive/org.apache.any23.plugins/apache-any23-basic-crawler/1.0.1-20130227.072549-138/apache-any23-basic-crawler-1.0.1-20130227.072549-138.tar.gz
[JENKINS] Archiving <https://builds.apache.org/job/Any23-trunk/ws/plugins/basic-crawler/target/apache-any23-basic-crawler-1.0.1-SNAPSHOT.zip>
to /home/hudson/hudson/jobs/Any23-trunk/modules/org.apache.any23.plugins$apache-any23-basic-crawler/builds/2013-02-27_07-19-56/archive/org.apache.any23.plugins/apache-any23-basic-crawler/1.0.1-20130227.072549-138/apache-any23-basic-crawler-1.0.1-20130227.072549-138.zip
[JENKINS] Archiving <https://builds.apache.org/job/Any23-trunk/ws/plugins/basic-crawler/target/apache-any23-basic-crawler-1.0.1-SNAPSHOT-tests.jar>
to /home/hudson/hudson/jobs/Any23-trunk/modules/org.apache.any23.plugins$apache-any23-basic-crawler/builds/2013-02-27_07-19-56/archive/org.apache.any23.plugins/apache-any23-basic-crawler/1.0.1-20130227.072549-138/apache-any23-basic-crawler-1.0.1-20130227.072549-138-tests.jar
[INFO] ------------------------------------------------------------------------
[INFO] Building Apache Any23 :: Plugins :: HTML Scraper
[INFO]    task-segment: [clean, deploy]
[INFO] ------------------------------------------------------------------------
[INFO] [clean:clean {execution: default-clean}]
[INFO] [cobertura:clean {execution: default}]
[INFO] [buildnumber:create {execution: default}]
[INFO] Checking for local modifications: skipped.
[INFO] Updating project files from SCM: skipped.
[INFO] Executing: /bin/sh -c cd <https://builds.apache.org/job/Any23-trunk/ws/plugins/html-scraper>
&& svn --non-interactive info
[INFO] Working directory: <https://builds.apache.org/job/Any23-trunk/ws/plugins/html-scraper>
[INFO] Storing buildNumber: 1435999 at timestamp: 1361952943788
[INFO] Executing: /bin/sh -c cd <https://builds.apache.org/job/Any23-trunk/ws/plugins/html-scraper>
&& svn --non-interactive info
[INFO] Working directory: <https://builds.apache.org/job/Any23-trunk/ws/plugins/html-scraper>
[INFO] Storing buildScmBranch: trunk
[debug] execute contextualize
[INFO] [resources:resources {execution: default-resources}]
[INFO] Using 'UTF-8' encoding to copy filtered resources.
[INFO] Copying 2 resources to META-INF
[INFO] [compiler:compile {execution: default-compile}]
[INFO] Compiling 3 source files to <https://builds.apache.org/job/Any23-trunk/ws/plugins/html-scraper/target/classes>
[debug] execute contextualize
[INFO] [resources:testResources {execution: default-testResources}]
[INFO] Using 'UTF-8' encoding to copy filtered resources.
[INFO] Copying 1 resource
[INFO] [compiler:testCompile {execution: default-testCompile}]
[INFO] Compiling 1 source file to <https://builds.apache.org/job/Any23-trunk/ws/plugins/html-scraper/target/test-classes>
[INFO] [surefire:test {execution: default-test}]
[INFO] Surefire report directory: <https://builds.apache.org/job/Any23-trunk/ws/plugins/html-scraper/target/surefire-reports>

-------------------------------------------------------
 T E S T S
-------------------------------------------------------
Running org.apache.any23.plugin.htmlscraper.HTMLScraperExtractorTest
SLF4J: Failed to load class "org.slf4j.impl.StaticLoggerBinder".
SLF4J: Defaulting to no-operation (NOP) logger implementation
SLF4J: See http://www.slf4j.org/codes.html#StaticLoggerBinder for further details.
Tests run: 2, Failures: 0, Errors: 0, Skipped: 0, Time elapsed: 0.89 sec

Results :

Tests run: 2, Failures: 0, Errors: 0, Skipped: 0

[JENKINS] Recording test results
[INFO] [jar:jar {execution: default-jar}]
[INFO] Building jar: <https://builds.apache.org/job/Any23-trunk/ws/plugins/html-scraper/target/apache-any23-html-scraper-1.0.2-SNAPSHOT.jar>
[INFO] [assembly:single {execution: assembly}]
[INFO] Reading assembly descriptor: <https://builds.apache.org/job/Any23-trunk/ws/plugins/html-scraper/src/main/assembly/bin.xml>
[INFO] Building tar: <https://builds.apache.org/job/Any23-trunk/ws/plugins/html-scraper/target/apache-any23-html-scraper-1.0.2-SNAPSHOT.tar.gz>
[INFO] Building zip: <https://builds.apache.org/job/Any23-trunk/ws/plugins/html-scraper/target/apache-any23-html-scraper-1.0.2-SNAPSHOT.zip>
[INFO] [install:install {execution: default-install}]
[INFO] Installing <https://builds.apache.org/job/Any23-trunk/ws/plugins/html-scraper/target/apache-any23-html-scraper-1.0.2-SNAPSHOT.jar>
to /export/home/hudson/hudson-slave/maven-repositories/1/org/apache/any23/plugins/apache-any23-html-scraper/1.0.2-SNAPSHOT/apache-any23-html-scraper-1.0.2-SNAPSHOT.jar
[INFO] Installing <https://builds.apache.org/job/Any23-trunk/ws/plugins/html-scraper/target/apache-any23-html-scraper-1.0.2-SNAPSHOT.tar.gz>
to /export/home/hudson/hudson-slave/maven-repositories/1/org/apache/any23/plugins/apache-any23-html-scraper/1.0.2-SNAPSHOT/apache-any23-html-scraper-1.0.2-SNAPSHOT.tar.gz
[INFO] Installing <https://builds.apache.org/job/Any23-trunk/ws/plugins/html-scraper/target/apache-any23-html-scraper-1.0.2-SNAPSHOT.zip>
to /export/home/hudson/hudson-slave/maven-repositories/1/org/apache/any23/plugins/apache-any23-html-scraper/1.0.2-SNAPSHOT/apache-any23-html-scraper-1.0.2-SNAPSHOT.zip
[INFO] [deploy:deploy {execution: default-deploy}]
[INFO] Retrieving previous build number from apache.snapshots.https
[WARNING] *** CHECKSUM FAILED - Checksum failed on download: local = '3ebb947b70ac8ade880475bdc607bef079e1b386';
remote = '0b4521539c253306878e787bc6ade60f15bd425b' - RETRYING
[WARNING] *** CHECKSUM FAILED - Checksum failed on download: local = '3ebb947b70ac8ade880475bdc607bef079e1b386';
remote = '0b4521539c253306878e787bc6ade60f15bd425b' - IGNORING
Uploading: https://repository.apache.org/content/repositories/snapshots/org/apache/any23/plugins/apache-any23-html-scraper/1.0.2-SNAPSHOT/apache-any23-html-scraper-1.0.2-20130227.072549-135.jar
12K uploaded  (apache-any23-html-scraper-1.0.2-20130227.072549-135.jar)
[INFO] Retrieving previous metadata from apache.snapshots.https
[WARNING] *** CHECKSUM FAILED - Checksum failed on download: local = '3ebb947b70ac8ade880475bdc607bef079e1b386';
remote = '0b4521539c253306878e787bc6ade60f15bd425b' - RETRYING
[WARNING] *** CHECKSUM FAILED - Checksum failed on download: local = '3ebb947b70ac8ade880475bdc607bef079e1b386';
remote = '0b4521539c253306878e787bc6ade60f15bd425b' - IGNORING
[INFO] Uploading repository metadata for: 'snapshot org.apache.any23.plugins:apache-any23-html-scraper:1.0.2-SNAPSHOT'
[INFO] Uploading project information for apache-any23-html-scraper 1.0.2-20130227.072549-135
[INFO] Retrieving previous metadata from apache.snapshots.https
[WARNING] *** CHECKSUM FAILED - Checksum failed on download: local = 'f054f2a95af80d771df050dc390c987f75ff3eeb';
remote = '5261a0fd5f8b47dab68528223030b206e9b02e82' - RETRYING
[WARNING] *** CHECKSUM FAILED - Checksum failed on download: local = 'f054f2a95af80d771df050dc390c987f75ff3eeb';
remote = '5261a0fd5f8b47dab68528223030b206e9b02e82' - IGNORING
[INFO] Uploading repository metadata for: 'artifact org.apache.any23.plugins:apache-any23-html-scraper'
[INFO] Retrieving previous build number from apache.snapshots.https
Uploading: https://repository.apache.org/content/repositories/snapshots/org/apache/any23/plugins/apache-any23-html-scraper/1.0.2-SNAPSHOT/apache-any23-html-scraper-1.0.2-20130227.072549-135.tar.gz
99K uploaded  (apache-any23-html-scraper-1.0.2-20130227.072549-135.tar.gz)
[INFO] Retrieving previous build number from apache.snapshots.https
Uploading: https://repository.apache.org/content/repositories/snapshots/org/apache/any23/plugins/apache-any23-html-scraper/1.0.2-SNAPSHOT/apache-any23-html-scraper-1.0.2-20130227.072549-135.zip
100K uploaded  (apache-any23-html-scraper-1.0.2-20130227.072549-135.zip)
[JENKINS] Archiving <https://builds.apache.org/job/Any23-trunk/ws/plugins/html-scraper/pom.xml>
to /home/hudson/hudson/jobs/Any23-trunk/modules/org.apache.any23.plugins$apache-any23-html-scraper/builds/2013-02-27_07-19-56/archive/org.apache.any23.plugins/apache-any23-html-scraper/1.0.2-SNAPSHOT/apache-any23-html-scraper-1.0.2-SNAPSHOT.pom
[JENKINS] Archiving <https://builds.apache.org/job/Any23-trunk/ws/plugins/html-scraper/target/apache-any23-html-scraper-1.0.2-SNAPSHOT.jar>
to /home/hudson/hudson/jobs/Any23-trunk/modules/org.apache.any23.plugins$apache-any23-html-scraper/builds/2013-02-27_07-19-56/archive/org.apache.any23.plugins/apache-any23-html-scraper/1.0.2-20130227.072549-135/apache-any23-html-scraper-1.0.2-20130227.072549-135.jar
[JENKINS] Archiving <https://builds.apache.org/job/Any23-trunk/ws/plugins/html-scraper/target/apache-any23-html-scraper-1.0.2-SNAPSHOT.tar.gz>
to /home/hudson/hudson/jobs/Any23-trunk/modules/org.apache.any23.plugins$apache-any23-html-scraper/builds/2013-02-27_07-19-56/archive/org.apache.any23.plugins/apache-any23-html-scraper/1.0.2-20130227.072549-135/apache-any23-html-scraper-1.0.2-20130227.072549-135.tar.gz
[JENKINS] Archiving <https://builds.apache.org/job/Any23-trunk/ws/plugins/html-scraper/target/apache-any23-html-scraper-1.0.2-SNAPSHOT.zip>
to /home/hudson/hudson/jobs/Any23-trunk/modules/org.apache.any23.plugins$apache-any23-html-scraper/builds/2013-02-27_07-19-56/archive/org.apache.any23.plugins/apache-any23-html-scraper/1.0.2-20130227.072549-135/apache-any23-html-scraper-1.0.2-20130227.072549-135.zip
[INFO] ------------------------------------------------------------------------
[INFO] Building Apache Any23 :: Plugins :: Office Scraper
[INFO]    task-segment: [clean, deploy]
[INFO] ------------------------------------------------------------------------
[INFO] [clean:clean {execution: default-clean}]
[INFO] [cobertura:clean {execution: default}]
[INFO] [buildnumber:create {execution: default}]
[INFO] Checking for local modifications: skipped.
[INFO] Updating project files from SCM: skipped.
[INFO] Executing: /bin/sh -c cd <https://builds.apache.org/job/Any23-trunk/ws/plugins/office-scraper>
&& svn --non-interactive info
[INFO] Working directory: <https://builds.apache.org/job/Any23-trunk/ws/plugins/office-scraper>
[INFO] Storing buildNumber: 1435999 at timestamp: 1361952996029
[INFO] Executing: /bin/sh -c cd <https://builds.apache.org/job/Any23-trunk/ws/plugins/office-scraper>
&& svn --non-interactive info
[INFO] Working directory: <https://builds.apache.org/job/Any23-trunk/ws/plugins/office-scraper>
[INFO] Storing buildScmBranch: trunk
[debug] execute contextualize
[INFO] [resources:resources {execution: default-resources}]
[INFO] Using 'UTF-8' encoding to copy filtered resources.
[INFO] Copying 2 resources to META-INF
[INFO] [compiler:compile {execution: default-compile}]
[INFO] Compiling 4 source files to <https://builds.apache.org/job/Any23-trunk/ws/plugins/office-scraper/target/classes>
[debug] execute contextualize
[INFO] [resources:testResources {execution: default-testResources}]
[INFO] Using 'UTF-8' encoding to copy filtered resources.
[INFO] Copying 2 resources
[INFO] [compiler:testCompile {execution: default-testCompile}]
[INFO] Compiling 2 source files to <https://builds.apache.org/job/Any23-trunk/ws/plugins/office-scraper/target/test-classes>
[INFO] [surefire:test {execution: default-test}]
[INFO] Surefire report directory: <https://builds.apache.org/job/Any23-trunk/ws/plugins/office-scraper/target/surefire-reports>

-------------------------------------------------------
 T E S T S
-------------------------------------------------------
Running org.apache.any23.plugin.officescraper.ExcelExtractorTest
SLF4J: Failed to load class "org.slf4j.impl.StaticLoggerBinder".
SLF4J: Defaulting to no-operation (NOP) logger implementation
SLF4J: See http://www.slf4j.org/codes.html#StaticLoggerBinder for further details.
Tests run: 3, Failures: 0, Errors: 0, Skipped: 0, Time elapsed: 4.805 sec
Running org.apache.any23.plugin.officescraper.XSSFWorkbookTest
Tests run: 2, Failures: 0, Errors: 0, Skipped: 0, Time elapsed: 0.052 sec

Results :

Tests run: 5, Failures: 0, Errors: 0, Skipped: 0

[JENKINS] Recording test results
[INFO] [jar:jar {execution: default-jar}]
[INFO] Building jar: <https://builds.apache.org/job/Any23-trunk/ws/plugins/office-scraper/target/apache-any23-office-scraper-1.0.1-SNAPSHOT.jar>
[INFO] [assembly:single {execution: assembly}]
[INFO] Reading assembly descriptor: <https://builds.apache.org/job/Any23-trunk/ws/plugins/office-scraper/src/main/assembly/bin.xml>
[INFO] Building tar: <https://builds.apache.org/job/Any23-trunk/ws/plugins/office-scraper/target/apache-any23-office-scraper-1.0.1-SNAPSHOT.tar.gz>
[INFO] Building zip: <https://builds.apache.org/job/Any23-trunk/ws/plugins/office-scraper/target/apache-any23-office-scraper-1.0.1-SNAPSHOT.zip>
[INFO] [install:install {execution: default-install}]
[INFO] Installing <https://builds.apache.org/job/Any23-trunk/ws/plugins/office-scraper/target/apache-any23-office-scraper-1.0.1-SNAPSHOT.jar>
to /export/home/hudson/hudson-slave/maven-repositories/1/org/apache/any23/plugins/apache-any23-office-scraper/1.0.1-SNAPSHOT/apache-any23-office-scraper-1.0.1-SNAPSHOT.jar
[INFO] Installing <https://builds.apache.org/job/Any23-trunk/ws/plugins/office-scraper/target/apache-any23-office-scraper-1.0.1-SNAPSHOT.tar.gz>
to /export/home/hudson/hudson-slave/maven-repositories/1/org/apache/any23/plugins/apache-any23-office-scraper/1.0.1-SNAPSHOT/apache-any23-office-scraper-1.0.1-SNAPSHOT.tar.gz
[INFO] Installing <https://builds.apache.org/job/Any23-trunk/ws/plugins/office-scraper/target/apache-any23-office-scraper-1.0.1-SNAPSHOT.zip>
to /export/home/hudson/hudson-slave/maven-repositories/1/org/apache/any23/plugins/apache-any23-office-scraper/1.0.1-SNAPSHOT/apache-any23-office-scraper-1.0.1-SNAPSHOT.zip
[INFO] [deploy:deploy {execution: default-deploy}]
[INFO] Retrieving previous build number from apache.snapshots.https
[WARNING] *** CHECKSUM FAILED - Checksum failed on download: local = 'dec67d2d5977374c824bc9ac373398dc3f3459e5';
remote = '3722fdc202563abf63df3a53b47741dafc0e651b' - RETRYING
[WARNING] *** CHECKSUM FAILED - Checksum failed on download: local = 'dec67d2d5977374c824bc9ac373398dc3f3459e5';
remote = '3722fdc202563abf63df3a53b47741dafc0e651b' - IGNORING
Uploading: https://repository.apache.org/content/repositories/snapshots/org/apache/any23/plugins/apache-any23-office-scraper/1.0.1-SNAPSHOT/apache-any23-office-scraper-1.0.1-20130227.072549-134.jar
13K uploaded  (apache-any23-office-scraper-1.0.1-20130227.072549-134.jar)
[INFO] Retrieving previous metadata from apache.snapshots.https
[WARNING] *** CHECKSUM FAILED - Checksum failed on download: local = 'dec67d2d5977374c824bc9ac373398dc3f3459e5';
remote = '3722fdc202563abf63df3a53b47741dafc0e651b' - RETRYING
[WARNING] *** CHECKSUM FAILED - Checksum failed on download: local = 'dec67d2d5977374c824bc9ac373398dc3f3459e5';
remote = '3722fdc202563abf63df3a53b47741dafc0e651b' - IGNORING
[INFO] Uploading repository metadata for: 'snapshot org.apache.any23.plugins:apache-any23-office-scraper:1.0.1-SNAPSHOT'
[INFO] Uploading project information for apache-any23-office-scraper 1.0.1-20130227.072549-134
[INFO] Retrieving previous metadata from apache.snapshots.https
[WARNING] *** CHECKSUM FAILED - Checksum failed on download: local = '57d4517f1c33fb4b470789a70f0639c206add15a';
remote = '93653b9b819b9b9872f1341599c42e0c5c920b38' - RETRYING
[WARNING] *** CHECKSUM FAILED - Checksum failed on download: local = '57d4517f1c33fb4b470789a70f0639c206add15a';
remote = '93653b9b819b9b9872f1341599c42e0c5c920b38' - IGNORING
[INFO] Uploading repository metadata for: 'artifact org.apache.any23.plugins:apache-any23-office-scraper'
[INFO] Retrieving previous build number from apache.snapshots.https
Uploading: https://repository.apache.org/content/repositories/snapshots/org/apache/any23/plugins/apache-any23-office-scraper/1.0.1-SNAPSHOT/apache-any23-office-scraper-1.0.1-20130227.072549-134.tar.gz
1636K uploaded  (apache-any23-office-scraper-1.0.1-20130227.072549-134.tar.gz)
[INFO] Retrieving previous build number from apache.snapshots.https
Uploading: https://repository.apache.org/content/repositories/snapshots/org/apache/any23/plugins/apache-any23-office-scraper/1.0.1-SNAPSHOT/apache-any23-office-scraper-1.0.1-20130227.072549-134.zip
1636K uploaded  (apache-any23-office-scraper-1.0.1-20130227.072549-134.zip)
[JENKINS] Archiving <https://builds.apache.org/job/Any23-trunk/ws/plugins/office-scraper/pom.xml>
to /home/hudson/hudson/jobs/Any23-trunk/modules/org.apache.any23.plugins$apache-any23-office-scraper/builds/2013-02-27_07-19-56/archive/org.apache.any23.plugins/apache-any23-office-scraper/1.0.1-SNAPSHOT/apache-any23-office-scraper-1.0.1-SNAPSHOT.pom
[JENKINS] Archiving <https://builds.apache.org/job/Any23-trunk/ws/plugins/office-scraper/target/apache-any23-office-scraper-1.0.1-SNAPSHOT.jar>
to /home/hudson/hudson/jobs/Any23-trunk/modules/org.apache.any23.plugins$apache-any23-office-scraper/builds/2013-02-27_07-19-56/archive/org.apache.any23.plugins/apache-any23-office-scraper/1.0.1-20130227.072549-134/apache-any23-office-scraper-1.0.1-20130227.072549-134.jar
[JENKINS] Archiving <https://builds.apache.org/job/Any23-trunk/ws/plugins/office-scraper/target/apache-any23-office-scraper-1.0.1-SNAPSHOT.tar.gz>
to /home/hudson/hudson/jobs/Any23-trunk/modules/org.apache.any23.plugins$apache-any23-office-scraper/builds/2013-02-27_07-19-56/archive/org.apache.any23.plugins/apache-any23-office-scraper/1.0.1-20130227.072549-134/apache-any23-office-scraper-1.0.1-20130227.072549-134.tar.gz
[JENKINS] Archiving <https://builds.apache.org/job/Any23-trunk/ws/plugins/office-scraper/target/apache-any23-office-scraper-1.0.1-SNAPSHOT.zip>
to /home/hudson/hudson/jobs/Any23-trunk/modules/org.apache.any23.plugins$apache-any23-office-scraper/builds/2013-02-27_07-19-56/archive/org.apache.any23.plugins/apache-any23-office-scraper/1.0.1-20130227.072549-134/apache-any23-office-scraper-1.0.1-20130227.072549-134.zip
[INFO] ------------------------------------------------------------------------
[INFO] Building Apache Any23 :: Plugins :: Integration Test
[INFO]    task-segment: [clean, deploy]
[INFO] ------------------------------------------------------------------------
[INFO] [clean:clean {execution: default-clean}]
[INFO] [cobertura:clean {execution: default}]
[INFO] [buildnumber:create {execution: default}]
[INFO] Checking for local modifications: skipped.
[INFO] Updating project files from SCM: skipped.
[INFO] Executing: /bin/sh -c cd <https://builds.apache.org/job/Any23-trunk/ws/plugins/integration-test>
&& svn --non-interactive info
[INFO] Working directory: <https://builds.apache.org/job/Any23-trunk/ws/plugins/integration-test>
[INFO] Storing buildNumber: 1448870 at timestamp: 1361953170759
[INFO] Executing: /bin/sh -c cd <https://builds.apache.org/job/Any23-trunk/ws/plugins/integration-test>
&& svn --non-interactive info
[INFO] Working directory: <https://builds.apache.org/job/Any23-trunk/ws/plugins/integration-test>
[INFO] Storing buildScmBranch: trunk
[debug] execute contextualize
[INFO] [resources:resources {execution: default-resources}]
[INFO] Using 'UTF-8' encoding to copy filtered resources.
[INFO] Copying 2 resources to META-INF
[INFO] [compiler:compile {execution: default-compile}]
[INFO] Nothing to compile - all classes are up to date
[debug] execute contextualize
[INFO] [resources:testResources {execution: default-testResources}]
[INFO] Using 'UTF-8' encoding to copy filtered resources.
[INFO] Copying 1 resource
[INFO] [compiler:testCompile {execution: default-testCompile}]
[INFO] Compiling 1 source file to <https://builds.apache.org/job/Any23-trunk/ws/plugins/integration-test/target/test-classes>
[INFO] [surefire:test {execution: default-test}]
[INFO] Surefire report directory: <https://builds.apache.org/job/Any23-trunk/ws/plugins/integration-test/target/surefire-reports>

-------------------------------------------------------
 T E S T S
-------------------------------------------------------
There are no tests to run.

Results :

Tests run: 0, Failures: 0, Errors: 0, Skipped: 0

[JENKINS] Recording test results
[INFO] [jar:jar {execution: default-jar}]
[INFO] Building jar: <https://builds.apache.org/job/Any23-trunk/ws/plugins/integration-test/target/apache-any23-integration-test-0.8.0-SNAPSHOT.jar>
[INFO] [assembly:single {execution: assembly}]
[INFO] Assemblies have been skipped per configuration of the skipAssembly parameter.
[INFO] [invoker:run {execution: default}]
[INFO] Building: basic-crawler/pom.xml
[INFO] ..FAILED (93.6 s)
[INFO]   The build exited with code 1. See <https://builds.apache.org/job/Any23-trunk/ws/plugins/integration-test/target/plugins-build/basic-crawler/build.log>
for details.
[INFO] Building: html-scraper/pom.xml
[INFO] ..SUCCESS (57.0 s)
[INFO] Building: office-scraper/pom.xml
[INFO] ..SUCCESS (22.9 s)
[INFO] -------------------------------------------------
[INFO] Build Summary:
[INFO]   Passed: 2, Failed: 1, Errors: 0, Skipped: 0
[INFO] -------------------------------------------------
[ERROR] The following builds failed:
[ERROR] *  basic-crawler/pom.xml
[INFO] -------------------------------------------------
[JENKINS] Archiving <https://builds.apache.org/job/Any23-trunk/ws/plugins/integration-test/pom.xml>
to /home/hudson/hudson/jobs/Any23-trunk/modules/org.apache.any23.plugins$apache-any23-integration-test/builds/2013-02-27_07-19-57/archive/org.apache.any23.plugins/apache-any23-integration-test/0.8.0-SNAPSHOT/apache-any23-integration-test-0.8.0-SNAPSHOT.pom
[JENKINS] Archiving <https://builds.apache.org/job/Any23-trunk/ws/plugins/integration-test/target/apache-any23-integration-test-0.8.0-SNAPSHOT.jar>
to /home/hudson/hudson/jobs/Any23-trunk/modules/org.apache.any23.plugins$apache-any23-integration-test/builds/2013-02-27_07-19-57/archive/org.apache.any23.plugins/apache-any23-integration-test/0.8.0-SNAPSHOT/apache-any23-integration-test-0.8.0-SNAPSHOT.jar
[INFO] ------------------------------------------------------------------------
[ERROR] BUILD FAILURE
[INFO] ------------------------------------------------------------------------
[INFO] : org.apache.maven.plugin.invoker.InvokerSession@1e4b118
1 build failed.
[INFO] ------------------------------------------------------------------------
[INFO] For more information, run Maven with the -e switch
[INFO] ------------------------------------------------------------------------
[INFO] Total time: 58 minutes 26 seconds
[INFO] Finished at: Wed Feb 27 08:22:56 GMT+00:00 2013
[INFO] Final Memory: 79M/439M
[INFO] ------------------------------------------------------------------------
Maven failed with error.
Sending e-mails to: any23-dev@apache.org
Sending e-mails to: any23-dev@apache.org
Sending e-mails to: any23-dev@apache.org
channel stopped

Mime
View raw message