any23-dev mailing list archives

Site index · List index
Message view « Date » · « Thread »
Top « Date » · « Thread »
From Apache Jenkins Server <jenk...@builds.apache.org>
Subject Build failed in Jenkins: Any23-trunk #335
Date Thu, 27 Sep 2012 07:11:03 GMT
See <https://builds.apache.org/job/Any23-trunk/335/>

------------------------------------------
[...truncated 4784 lines...]
[INFO] [INFO] Building jar: <https://builds.apache.org/job/Any23-trunk/ws/plugins/office-scraper/target/apache-any23-office-scraper-1.0.1-SNAPSHOT.jar>

[INFO] --- maven-jar-plugin:2.3.1:jar (default-jar) @ apache-any23-office-scraper ---
mojoSucceeded org.apache.maven.plugins:maven-jar-plugin:2.3.1(default-jar)
mojoStarted org.apache.maven.plugins:maven-site-plugin:3.0(attach-descriptor)
[INFO] 
[INFO] --- maven-site-plugin:3.0:attach-descriptor (attach-descriptor) @ apache-any23-office-scraper
---
mojoSucceeded org.apache.maven.plugins:maven-site-plugin:3.0(attach-descriptor)
mojoStarted org.apache.maven.plugins:maven-assembly-plugin:2.3(assembly)[INFO] Reading assembly
descriptor: <https://builds.apache.org/job/Any23-trunk/ws/plugins/office-scraper/src/main/assembly/bin.xml>

[INFO] 
[INFO] --- maven-assembly-plugin:2.3:single (assembly) @ apache-any23-office-scraper ---
[INFO] Building tar: <https://builds.apache.org/job/Any23-trunk/ws/plugins/office-scraper/target/apache-any23-office-scraper-1.0.1-SNAPSHOT.tar.gz>
[INFO] Building zip: <https://builds.apache.org/job/Any23-trunk/ws/plugins/office-scraper/target/apache-any23-office-scraper-1.0.1-SNAPSHOT.zip>
mojoSucceeded org.apache.maven.plugins:maven-assembly-plugin:2.3(assembly)
mojoStarted org.apache.maven.plugins:maven-install-plugin:2.3.1(default-install)[INFO] Installing
<https://builds.apache.org/job/Any23-trunk/ws/plugins/office-scraper/target/apache-any23-office-scraper-1.0.1-SNAPSHOT.jar>
to /home/hudson/hudson-slave/maven-repositories/0/org/apache/any23/plugins/apache-any23-office-scraper/1.0.1-SNAPSHOT/apache-any23-office-scraper-1.0.1-SNAPSHOT.jar
[INFO] Installing <https://builds.apache.org/job/Any23-trunk/ws/plugins/office-scraper/pom.xml>
to /home/hudson/hudson-slave/maven-repositories/0/org/apache/any23/plugins/apache-any23-office-scraper/1.0.1-SNAPSHOT/apache-any23-office-scraper-1.0.1-SNAPSHOT.pom

[INFO] 
[INFO] --- maven-install-plugin:2.3.1:install (default-install) @ apache-any23-office-scraper
---
[INFO] Installing <https://builds.apache.org/job/Any23-trunk/ws/plugins/office-scraper/target/apache-any23-office-scraper-1.0.1-SNAPSHOT.tar.gz>
to /home/hudson/hudson-slave/maven-repositories/0/org/apache/any23/plugins/apache-any23-office-scraper/1.0.1-SNAPSHOT/apache-any23-office-scraper-1.0.1-SNAPSHOT.tar.gz
[INFO] Installing <https://builds.apache.org/job/Any23-trunk/ws/plugins/office-scraper/target/apache-any23-office-scraper-1.0.1-SNAPSHOT.zip>
to /home/hudson/hudson-slave/maven-repositories/0/org/apache/any23/plugins/apache-any23-office-scraper/1.0.1-SNAPSHOT/apache-any23-office-scraper-1.0.1-SNAPSHOT.zip
mojoSucceeded org.apache.maven.plugins:maven-install-plugin:2.3.1(default-install)
mojoStarted org.apache.maven.plugins:maven-deploy-plugin:2.7(default-deploy)Downloading: https://repository.apache.org/content/repositories/snapshots/org/apache/any23/plugins/apache-any23-office-scraper/1.0.1-SNAPSHOT/maven-metadata.xml

[INFO] 
[INFO] --- maven-deploy-plugin:2.7:deploy (default-deploy) @ apache-any23-office-scraper ---
Downloaded: https://repository.apache.org/content/repositories/snapshots/org/apache/any23/plugins/apache-any23-office-scraper/1.0.1-SNAPSHOT/maven-metadata.xml
(2 KB at 0.9 KB/sec)
Uploading: https://repository.apache.org/content/repositories/snapshots/org/apache/any23/plugins/apache-any23-office-scraper/1.0.1-SNAPSHOT/apache-any23-office-scraper-1.0.1-20120927.070555-16.jar
Uploaded: https://repository.apache.org/content/repositories/snapshots/org/apache/any23/plugins/apache-any23-office-scraper/1.0.1-SNAPSHOT/apache-any23-office-scraper-1.0.1-20120927.070555-16.jar
(14 KB at 52.7 KB/sec)
Uploading: https://repository.apache.org/content/repositories/snapshots/org/apache/any23/plugins/apache-any23-office-scraper/1.0.1-SNAPSHOT/apache-any23-office-scraper-1.0.1-20120927.070555-16.pom
Uploaded: https://repository.apache.org/content/repositories/snapshots/org/apache/any23/plugins/apache-any23-office-scraper/1.0.1-SNAPSHOT/apache-any23-office-scraper-1.0.1-20120927.070555-16.pom
(4 KB at 1.6 KB/sec)
Downloading: https://repository.apache.org/content/repositories/snapshots/org/apache/any23/plugins/apache-any23-office-scraper/maven-metadata.xml
Downloaded: https://repository.apache.org/content/repositories/snapshots/org/apache/any23/plugins/apache-any23-office-scraper/maven-metadata.xml
(433 B at 0.5 KB/sec)
Uploading: https://repository.apache.org/content/repositories/snapshots/org/apache/any23/plugins/apache-any23-office-scraper/1.0.1-SNAPSHOT/maven-metadata.xml
Uploaded: https://repository.apache.org/content/repositories/snapshots/org/apache/any23/plugins/apache-any23-office-scraper/1.0.1-SNAPSHOT/maven-metadata.xml
(2 KB at 2.5 KB/sec)
Uploading: https://repository.apache.org/content/repositories/snapshots/org/apache/any23/plugins/apache-any23-office-scraper/maven-metadata.xml
Uploaded: https://repository.apache.org/content/repositories/snapshots/org/apache/any23/plugins/apache-any23-office-scraper/maven-metadata.xml
(433 B at 0.4 KB/sec)
Uploading: https://repository.apache.org/content/repositories/snapshots/org/apache/any23/plugins/apache-any23-office-scraper/1.0.1-SNAPSHOT/apache-any23-office-scraper-1.0.1-20120927.070555-16.tar.gz
Uploaded: https://repository.apache.org/content/repositories/snapshots/org/apache/any23/plugins/apache-any23-office-scraper/1.0.1-SNAPSHOT/apache-any23-office-scraper-1.0.1-20120927.070555-16.tar.gz
(1502 KB at 762.4 KB/sec)
Uploading: https://repository.apache.org/content/repositories/snapshots/org/apache/any23/plugins/apache-any23-office-scraper/1.0.1-SNAPSHOT/maven-metadata.xml
Uploaded: https://repository.apache.org/content/repositories/snapshots/org/apache/any23/plugins/apache-any23-office-scraper/1.0.1-SNAPSHOT/maven-metadata.xml
(2 KB at 7.4 KB/sec)
Uploading: https://repository.apache.org/content/repositories/snapshots/org/apache/any23/plugins/apache-any23-office-scraper/1.0.1-SNAPSHOT/apache-any23-office-scraper-1.0.1-20120927.070555-16.zip
Uploaded: https://repository.apache.org/content/repositories/snapshots/org/apache/any23/plugins/apache-any23-office-scraper/1.0.1-SNAPSHOT/apache-any23-office-scraper-1.0.1-20120927.070555-16.zip
(1503 KB at 920.8 KB/sec)
Uploading: https://repository.apache.org/content/repositories/snapshots/org/apache/any23/plugins/apache-any23-office-scraper/1.0.1-SNAPSHOT/maven-metadata.xml
Uploaded: https://repository.apache.org/content/repositories/snapshots/org/apache/any23/plugins/apache-any23-office-scraper/1.0.1-SNAPSHOT/maven-metadata.xml
(2 KB at 7.1 KB/sec)
mojoSucceeded org.apache.maven.plugins:maven-deploy-plugin:2.7(default-deploy)
projectSucceeded org.apache.any23.plugins:apache-any23-office-scraper:1.0.1-SNAPSHOT
projectStarted org.apache.any23.plugins:apache-any23-integration-test:0.7.1-SNAPSHOT
[INFO]                                                                         
[INFO] ------------------------------------------------------------------------
[INFO] Building Apache Any23 :: Plugins :: Integration Test 0.7.1-SNAPSHOT
[INFO] ------------------------------------------------------------------------
mojoStarted org.codehaus.mojo:buildnumber-maven-plugin:1.0(default)[INFO] Checking for local
modifications: skipped.
[INFO] Updating project files from SCM: skipped.
[INFO] Executing: /bin/sh -c cd <https://builds.apache.org/job/Any23-trunk/ws/plugins/integration-test>
&& svn --non-interactive info
[INFO] Working directory: <https://builds.apache.org/job/Any23-trunk/ws/plugins/integration-test>
[INFO] Storing buildNumber: 1383906 at timestamp: 1348729564994
[INFO] Executing: /bin/sh -c cd <https://builds.apache.org/job/Any23-trunk/ws/plugins/integration-test>
&& svn --non-interactive info
[INFO] Working directory: <https://builds.apache.org/job/Any23-trunk/ws/plugins/integration-test>
[INFO] Storing buildScmBranch: trunk

[INFO] 
[INFO] --- buildnumber-maven-plugin:1.0:create (default) @ apache-any23-integration-test ---
mojoSucceeded org.codehaus.mojo:buildnumber-maven-plugin:1.0(default)
[debug] execute contextualize
mojoStarted org.apache.maven.plugins:maven-resources-plugin:2.5(default-resources)[INFO] Using
'UTF-8' encoding to copy filtered resources.
[INFO] Copying 2 resources to META-INF

[INFO] 
[INFO] --- maven-resources-plugin:2.5:resources (default-resources) @ apache-any23-integration-test
---
mojoSucceeded org.apache.maven.plugins:maven-resources-plugin:2.5(default-resources)
mojoStarted org.apache.maven.plugins:maven-compiler-plugin:2.5.1(default-compile)[INFO] Nothing
to compile - all classes are up to date

[INFO] 
[INFO] --- maven-compiler-plugin:2.5.1:compile (default-compile) @ apache-any23-integration-test
---
mojoSucceeded org.apache.maven.plugins:maven-compiler-plugin:2.5.1(default-compile)
[debug] execute contextualize
mojoStarted org.apache.maven.plugins:maven-resources-plugin:2.5(default-testResources)[INFO]
Using 'UTF-8' encoding to copy filtered resources.
[INFO] Copying 0 resource

[INFO] 
[INFO] --- maven-resources-plugin:2.5:testResources (default-testResources) @ apache-any23-integration-test
---
mojoSucceeded org.apache.maven.plugins:maven-resources-plugin:2.5(default-testResources)
mojoStarted org.apache.maven.plugins:maven-compiler-plugin:2.5.1(default-testCompile)[INFO]
Compiling 1 source file to <https://builds.apache.org/job/Any23-trunk/ws/plugins/integration-test/target/test-classes>

[INFO] 
[INFO] --- maven-compiler-plugin:2.5.1:testCompile (default-testCompile) @ apache-any23-integration-test
---
mojoSucceeded org.apache.maven.plugins:maven-compiler-plugin:2.5.1(default-testCompile)
mojoStarted org.apache.maven.plugins:maven-surefire-plugin:2.4.3(default-test)
[INFO] 
[INFO] --- maven-surefire-plugin:2.4.3:test (default-test) @ apache-any23-integration-test
---
[INFO] Surefire report directory: <https://builds.apache.org/job/Any23-trunk/ws/plugins/integration-test/target/surefire-reports>

-------------------------------------------------------
 T E S T S
-------------------------------------------------------
There are no tests to run.

Results :

Tests run: 0, Failures: 0, Errors: 0, Skipped: 0

mojoSucceeded org.apache.maven.plugins:maven-surefire-plugin:2.4.3(default-test)
[JENKINS] Recording test results
mojoStarted org.apache.maven.plugins:maven-jar-plugin:2.3.1(default-jar)
[INFO] [INFO] Building jar: <https://builds.apache.org/job/Any23-trunk/ws/plugins/integration-test/target/apache-any23-integration-test-0.7.1-SNAPSHOT.jar>

[INFO] --- maven-jar-plugin:2.3.1:jar (default-jar) @ apache-any23-integration-test ---
mojoSucceeded org.apache.maven.plugins:maven-jar-plugin:2.3.1(default-jar)
mojoStarted org.apache.maven.plugins:maven-site-plugin:3.0(attach-descriptor)
[INFO] 
[INFO] --- maven-site-plugin:3.0:attach-descriptor (attach-descriptor) @ apache-any23-integration-test
---
mojoSucceeded org.apache.maven.plugins:maven-site-plugin:3.0(attach-descriptor)
mojoStarted org.apache.maven.plugins:maven-assembly-plugin:2.3(assembly)[INFO] Assemblies
have been skipped per configuration of the skipAssembly parameter.

[INFO] 
[INFO] --- maven-assembly-plugin:2.3:single (assembly) @ apache-any23-integration-test ---
mojoSucceeded org.apache.maven.plugins:maven-assembly-plugin:2.3(assembly)
mojoStarted org.apache.maven.plugins:maven-invoker-plugin:1.5(default)
[INFO] 
[INFO] --- maven-invoker-plugin:1.5:run (default) @ apache-any23-integration-test ---
[INFO] Building: basic-crawler/pom.xml
[INFO] ..FAILED (34.7 s)
[INFO]   The build exited with code 1. See <https://builds.apache.org/job/Any23-trunk/ws/plugins/integration-test/target/plugins-build/basic-crawler/build.log>
for details.
[INFO] Building: office-scraper/pom.xml
[INFO] ..SUCCESS (8.1 s)
[INFO] Building: html-scraper/pom.xml
[INFO] ..SUCCESS (6.6 s)
[INFO] -------------------------------------------------
[INFO] Build Summary:
[INFO]   Passed: 2, Failed: 1, Errors: 0, Skipped: 0
[INFO] -------------------------------------------------
[ERROR] The following builds failed:
[ERROR] *  basic-crawler/pom.xml
[INFO] -------------------------------------------------
mojoFailed org.apache.maven.plugins:maven-invoker-plugin:1.5(default)
MavenInvokerArchiver
found reports:[<https://builds.apache.org/job/Any23-trunk/ws/plugins/integration-test/target/invoker-reports/BUILD-office-scraper.xml,>
<https://builds.apache.org/job/Any23-trunk/ws/plugins/integration-test/target/invoker-reports/BUILD-basic-crawler.xml,>
<https://builds.apache.org/job/Any23-trunk/ws/plugins/integration-test/target/invoker-reports/BUILD-html-scraper.xml]>
mavenInvokerResult:MavenInvokerResult{project='office-scraper/pom.xml', name='', description='',
result='success', failureMessage='null', time=8.089, type='null', buildLog='null'}
mavenInvokerResult:MavenInvokerResult{project='basic-crawler/pom.xml', name='', description='',
result='failure-build', failureMessage='The build exited with code 1. See <https://builds.apache.org/job/Any23-trunk/ws/plugins/integration-test/target/plugins-build/basic-crawler/build.log>
for details.', time=34.74, type='null', buildLog='null'}
mavenInvokerResult:MavenInvokerResult{project='html-scraper/pom.xml', name='', description='',
result='success', failureMessage='null', time=6.581, type='null', buildLog='null'}
projectFailed org.apache.any23.plugins:apache-any23-integration-test:0.7.1-SNAPSHOT
sessionEnded
[INFO] ------------------------------------------------------------------------
[INFO] Reactor Summary:
[INFO] 
[INFO] Apache Any23 ...................................... SUCCESS [42.430s]
[INFO] Apache Any23 :: Base API .......................... SUCCESS [9.812s]
[INFO] Apache Any23 :: Test Resources .................... SUCCESS [6.130s]
[INFO] Apache Any23 :: NQuads Parser and Writer .......... SUCCESS [12.060s]
[INFO] Apache Any23 :: CSV Utilities ..................... SUCCESS [3.144s]
[INFO] Apache Any23 :: Mime Type Detection ............... SUCCESS [7.062s]
[INFO] Apache Any23 :: Encoding Detection ................ SUCCESS [8.952s]
[INFO] Apache Any23 :: Core .............................. SUCCESS [50.650s]
[INFO] Apache Any23 :: Plugins :: Basic Crawler .......... SUCCESS [38.099s]
[INFO] Apache Any23 :: Plugins :: HTML Scraper ........... SUCCESS [8.032s]
[INFO] Apache Any23 :: Plugins :: Office Scraper ......... SUCCESS [15.669s]
[INFO] Apache Any23 :: Plugins :: Integration Test ....... FAILURE [57.800s]
[INFO] Apache Any23 :: Service ........................... SKIPPED
[INFO] ------------------------------------------------------------------------
[INFO] BUILD FAILURE
[INFO] ------------------------------------------------------------------------
[INFO] Total time: 4:23.865s
[INFO] Finished at: Thu Sep 27 07:07:02 UTC 2012
[INFO] Final Memory: 25M/221M
[INFO] ------------------------------------------------------------------------
Projects to build: [MavenProject: org.apache.any23:apache-any23:0.7.1-SNAPSHOT @ <https://builds.apache.org/job/Any23-trunk/ws/pom.xml,>
MavenProject: org.apache.any23:apache-any23-api:0.7.1-SNAPSHOT @ <https://builds.apache.org/job/Any23-trunk/ws/api/pom.xml,>
MavenProject: org.apache.any23:apache-any23-test-resources:0.7.1-SNAPSHOT @ <https://builds.apache.org/job/Any23-trunk/ws/test-resources/pom.xml,>
MavenProject: org.apache.any23:apache-any23-nquads:0.7.1-SNAPSHOT @ <https://builds.apache.org/job/Any23-trunk/ws/nquads/pom.xml,>
MavenProject: org.apache.any23:apache-any23-csvutils:0.7.1-SNAPSHOT @ <https://builds.apache.org/job/Any23-trunk/ws/csvutils/pom.xml,>
MavenProject: org.apache.any23:apache-any23-mime:0.7.1-SNAPSHOT @ <https://builds.apache.org/job/Any23-trunk/ws/mime/pom.xml,>
MavenProject: org.apache.any23:apache-any23-encoding:0.7.1-SNAPSHOT @ <https://builds.apache.org/job/Any23-trunk/ws/encoding/pom.xml,>
MavenProject: org.apache.any23:apache-any23-core:0.7.1-SNAPSHOT @ <https://builds.apache.org/job/Any23-trunk/ws/core/pom.xml,>
MavenProject: org.apache.any23.plugins:apache-any23-basic-crawler:1.0.1-SNAPSHOT @ <https://builds.apache.org/job/Any23-trunk/ws/plugins/basic-crawler/pom.xml,>
MavenProject: org.apache.any23.plugins:apache-any23-html-scraper:1.0.2-SNAPSHOT @ <https://builds.apache.org/job/Any23-trunk/ws/plugins/html-scraper/pom.xml,>
MavenProject: org.apache.any23.plugins:apache-any23-office-scraper:1.0.1-SNAPSHOT @ <https://builds.apache.org/job/Any23-trunk/ws/plugins/office-scraper/pom.xml,>
MavenProject: org.apache.any23.plugins:apache-any23-integration-test:0.7.1-SNAPSHOT @ <https://builds.apache.org/job/Any23-trunk/ws/plugins/integration-test/pom.xml,>
MavenProject: org.apache.any23:apache-any23-service:0.7.1-SNAPSHOT @ <https://builds.apache.org/job/Any23-trunk/ws/service/pom.xml]>
[JENKINS] Archiving <https://builds.apache.org/job/Any23-trunk/ws/plugins/basic-crawler/pom.xml>
to /home/hudson/hudson/jobs/Any23-trunk/modules/org.apache.any23.plugins$apache-any23-basic-crawler/builds/2012-09-27_07-02-20/archive/org.apache.any23.plugins/apache-any23-basic-crawler/1.0.1-SNAPSHOT/apache-any23-basic-crawler-1.0.1-SNAPSHOT.pom
[JENKINS] Archiving <https://builds.apache.org/job/Any23-trunk/ws/plugins/basic-crawler/target/apache-any23-basic-crawler-1.0.1-SNAPSHOT.jar>
to /home/hudson/hudson/jobs/Any23-trunk/modules/org.apache.any23.plugins$apache-any23-basic-crawler/builds/2012-09-27_07-02-20/archive/org.apache.any23.plugins/apache-any23-basic-crawler/1.0.1-20120927.070534-16/apache-any23-basic-crawler-1.0.1-20120927.070534-16.jar
[JENKINS] Archiving <https://builds.apache.org/job/Any23-trunk/ws/plugins/basic-crawler/target/apache-any23-basic-crawler-1.0.1-SNAPSHOT.tar.gz>
to /home/hudson/hudson/jobs/Any23-trunk/modules/org.apache.any23.plugins$apache-any23-basic-crawler/builds/2012-09-27_07-02-20/archive/org.apache.any23.plugins/apache-any23-basic-crawler/1.0.1-20120927.070534-16/apache-any23-basic-crawler-1.0.1-20120927.070534-16.tar.gz
[JENKINS] Archiving <https://builds.apache.org/job/Any23-trunk/ws/plugins/basic-crawler/target/apache-any23-basic-crawler-1.0.1-SNAPSHOT.zip>
to /home/hudson/hudson/jobs/Any23-trunk/modules/org.apache.any23.plugins$apache-any23-basic-crawler/builds/2012-09-27_07-02-20/archive/org.apache.any23.plugins/apache-any23-basic-crawler/1.0.1-20120927.070534-16/apache-any23-basic-crawler-1.0.1-20120927.070534-16.zip
[JENKINS] Archiving <https://builds.apache.org/job/Any23-trunk/ws/plugins/basic-crawler/target/apache-any23-basic-crawler-1.0.1-SNAPSHOT-tests.jar>
to /home/hudson/hudson/jobs/Any23-trunk/modules/org.apache.any23.plugins$apache-any23-basic-crawler/builds/2012-09-27_07-02-20/archive/org.apache.any23.plugins/apache-any23-basic-crawler/1.0.1-20120927.070534-16/apache-any23-basic-crawler-1.0.1-20120927.070534-16-tests.jar
[JENKINS] Archiving <https://builds.apache.org/job/Any23-trunk/ws/core/pom.xml> to /home/hudson/hudson/jobs/Any23-trunk/modules/org.apache.any23$apache-any23-core/builds/2012-09-27_07-02-20/archive/org.apache.any23/apache-any23-core/0.7.1-SNAPSHOT/apache-any23-core-0.7.1-SNAPSHOT.pom
[JENKINS] Archiving <https://builds.apache.org/job/Any23-trunk/ws/core/target/apache-any23-core-0.7.1-SNAPSHOT.jar>
to /home/hudson/hudson/jobs/Any23-trunk/modules/org.apache.any23$apache-any23-core/builds/2012-09-27_07-02-20/archive/org.apache.any23/apache-any23-core/0.7.1-20120927.070450-16/apache-any23-core-0.7.1-20120927.070450-16.jar
[JENKINS] Archiving <https://builds.apache.org/job/Any23-trunk/ws/core/target/apache-any23-core-0.7.1-SNAPSHOT.tar.gz>
to /home/hudson/hudson/jobs/Any23-trunk/modules/org.apache.any23$apache-any23-core/builds/2012-09-27_07-02-20/archive/org.apache.any23/apache-any23-core/0.7.1-20120927.070450-16/apache-any23-core-0.7.1-20120927.070450-16.tar.gz
[JENKINS] Archiving <https://builds.apache.org/job/Any23-trunk/ws/core/target/apache-any23-core-0.7.1-SNAPSHOT.zip>
to /home/hudson/hudson/jobs/Any23-trunk/modules/org.apache.any23$apache-any23-core/builds/2012-09-27_07-02-20/archive/org.apache.any23/apache-any23-core/0.7.1-20120927.070450-16/apache-any23-core-0.7.1-20120927.070450-16.zip
[JENKINS] Archiving <https://builds.apache.org/job/Any23-trunk/ws/core/target/apache-any23-core-0.7.1-SNAPSHOT-tests.jar>
to /home/hudson/hudson/jobs/Any23-trunk/modules/org.apache.any23$apache-any23-core/builds/2012-09-27_07-02-20/archive/org.apache.any23/apache-any23-core/0.7.1-20120927.070450-16/apache-any23-core-0.7.1-20120927.070450-16-tests.jar
[JENKINS] Archiving <https://builds.apache.org/job/Any23-trunk/ws/pom.xml> to /home/hudson/hudson/jobs/Any23-trunk/modules/org.apache.any23$apache-any23/builds/2012-09-27_07-02-20/archive/org.apache.any23/apache-any23/0.7.1-SNAPSHOT/apache-any23-0.7.1-SNAPSHOT.pom
[JENKINS] Archiving <https://builds.apache.org/job/Any23-trunk/ws/target/apache-any23-0.7.1-SNAPSHOT-site.xml>
to /home/hudson/hudson/jobs/Any23-trunk/modules/org.apache.any23$apache-any23/builds/2012-09-27_07-02-20/archive/org.apache.any23/apache-any23/0.7.1-20120927.070318-25/apache-any23-0.7.1-20120927.070318-25-site.xml
[JENKINS] Archiving <https://builds.apache.org/job/Any23-trunk/ws/target/apache-any23-0.7.1-SNAPSHOT-src.tar.gz>
to /home/hudson/hudson/jobs/Any23-trunk/modules/org.apache.any23$apache-any23/builds/2012-09-27_07-02-20/archive/org.apache.any23/apache-any23/0.7.1-20120927.070318-25/apache-any23-0.7.1-20120927.070318-25-src.tar.gz
[JENKINS] Archiving <https://builds.apache.org/job/Any23-trunk/ws/target/apache-any23-0.7.1-SNAPSHOT-src.zip>
to /home/hudson/hudson/jobs/Any23-trunk/modules/org.apache.any23$apache-any23/builds/2012-09-27_07-02-20/archive/org.apache.any23/apache-any23/0.7.1-20120927.070318-25/apache-any23-0.7.1-20120927.070318-25-src.zip
[JENKINS] Archiving <https://builds.apache.org/job/Any23-trunk/ws/plugins/office-scraper/pom.xml>
to /home/hudson/hudson/jobs/Any23-trunk/modules/org.apache.any23.plugins$apache-any23-office-scraper/builds/2012-09-27_07-02-20/archive/org.apache.any23.plugins/apache-any23-office-scraper/1.0.1-SNAPSHOT/apache-any23-office-scraper-1.0.1-SNAPSHOT.pom
[JENKINS] Archiving <https://builds.apache.org/job/Any23-trunk/ws/plugins/office-scraper/target/apache-any23-office-scraper-1.0.1-SNAPSHOT.jar>
to /home/hudson/hudson/jobs/Any23-trunk/modules/org.apache.any23.plugins$apache-any23-office-scraper/builds/2012-09-27_07-02-20/archive/org.apache.any23.plugins/apache-any23-office-scraper/1.0.1-20120927.070555-16/apache-any23-office-scraper-1.0.1-20120927.070555-16.jar
[JENKINS] Archiving <https://builds.apache.org/job/Any23-trunk/ws/plugins/office-scraper/target/apache-any23-office-scraper-1.0.1-SNAPSHOT.tar.gz>
to /home/hudson/hudson/jobs/Any23-trunk/modules/org.apache.any23.plugins$apache-any23-office-scraper/builds/2012-09-27_07-02-20/archive/org.apache.any23.plugins/apache-any23-office-scraper/1.0.1-20120927.070555-16/apache-any23-office-scraper-1.0.1-20120927.070555-16.tar.gz
[JENKINS] Archiving <https://builds.apache.org/job/Any23-trunk/ws/plugins/office-scraper/target/apache-any23-office-scraper-1.0.1-SNAPSHOT.zip>
to /home/hudson/hudson/jobs/Any23-trunk/modules/org.apache.any23.plugins$apache-any23-office-scraper/builds/2012-09-27_07-02-20/archive/org.apache.any23.plugins/apache-any23-office-scraper/1.0.1-20120927.070555-16/apache-any23-office-scraper-1.0.1-20120927.070555-16.zip
[JENKINS] Archiving <https://builds.apache.org/job/Any23-trunk/ws/service/pom.xml> to
/home/hudson/hudson/jobs/Any23-trunk/modules/org.apache.any23$apache-any23-service/builds/2012-09-27_07-02-20/archive/org.apache.any23/apache-any23-service/0.7.1-SNAPSHOT/apache-any23-service-0.7.1-SNAPSHOT.pom
[JENKINS] Archiving <https://builds.apache.org/job/Any23-trunk/ws/nquads/pom.xml> to
/home/hudson/hudson/jobs/Any23-trunk/modules/org.apache.any23$apache-any23-nquads/builds/2012-09-27_07-02-20/archive/org.apache.any23/apache-any23-nquads/0.7.1-SNAPSHOT/apache-any23-nquads-0.7.1-SNAPSHOT.pom
[JENKINS] Archiving <https://builds.apache.org/job/Any23-trunk/ws/nquads/target/apache-any23-nquads-0.7.1-SNAPSHOT.jar>
to /home/hudson/hudson/jobs/Any23-trunk/modules/org.apache.any23$apache-any23-nquads/builds/2012-09-27_07-02-20/archive/org.apache.any23/apache-any23-nquads/0.7.1-20120927.070349-21/apache-any23-nquads-0.7.1-20120927.070349-21.jar
[JENKINS] Archiving <https://builds.apache.org/job/Any23-trunk/ws/test-resources/pom.xml>
to /home/hudson/hudson/jobs/Any23-trunk/modules/org.apache.any23$apache-any23-test-resources/builds/2012-09-27_07-02-20/archive/org.apache.any23/apache-any23-test-resources/0.7.1-SNAPSHOT/apache-any23-test-resources-0.7.1-SNAPSHOT.pom
[JENKINS] Archiving <https://builds.apache.org/job/Any23-trunk/ws/test-resources/target/apache-any23-test-resources-0.7.1-SNAPSHOT.jar>
to /home/hudson/hudson/jobs/Any23-trunk/modules/org.apache.any23$apache-any23-test-resources/builds/2012-09-27_07-02-20/archive/org.apache.any23/apache-any23-test-resources/0.7.1-20120927.070336-21/apache-any23-test-resources-0.7.1-20120927.070336-21.jar
[JENKINS] Archiving <https://builds.apache.org/job/Any23-trunk/ws/test-resources/target/apache-any23-test-resources-0.7.1-SNAPSHOT-tests.jar>
to /home/hudson/hudson/jobs/Any23-trunk/modules/org.apache.any23$apache-any23-test-resources/builds/2012-09-27_07-02-20/archive/org.apache.any23/apache-any23-test-resources/0.7.1-20120927.070336-21/apache-any23-test-resources-0.7.1-20120927.070336-21-tests.jar
[JENKINS] Archiving <https://builds.apache.org/job/Any23-trunk/ws/plugins/html-scraper/pom.xml>
to /home/hudson/hudson/jobs/Any23-trunk/modules/org.apache.any23.plugins$apache-any23-html-scraper/builds/2012-09-27_07-02-20/archive/org.apache.any23.plugins/apache-any23-html-scraper/1.0.2-SNAPSHOT/apache-any23-html-scraper-1.0.2-SNAPSHOT.pom
[JENKINS] Archiving <https://builds.apache.org/job/Any23-trunk/ws/plugins/html-scraper/target/apache-any23-html-scraper-1.0.2-SNAPSHOT.jar>
to /home/hudson/hudson/jobs/Any23-trunk/modules/org.apache.any23.plugins$apache-any23-html-scraper/builds/2012-09-27_07-02-20/archive/org.apache.any23.plugins/apache-any23-html-scraper/1.0.2-20120927.070543-16/apache-any23-html-scraper-1.0.2-20120927.070543-16.jar
[JENKINS] Archiving <https://builds.apache.org/job/Any23-trunk/ws/plugins/html-scraper/target/apache-any23-html-scraper-1.0.2-SNAPSHOT.tar.gz>
to /home/hudson/hudson/jobs/Any23-trunk/modules/org.apache.any23.plugins$apache-any23-html-scraper/builds/2012-09-27_07-02-20/archive/org.apache.any23.plugins/apache-any23-html-scraper/1.0.2-20120927.070543-16/apache-any23-html-scraper-1.0.2-20120927.070543-16.tar.gz
[JENKINS] Archiving <https://builds.apache.org/job/Any23-trunk/ws/plugins/html-scraper/target/apache-any23-html-scraper-1.0.2-SNAPSHOT.zip>
to /home/hudson/hudson/jobs/Any23-trunk/modules/org.apache.any23.plugins$apache-any23-html-scraper/builds/2012-09-27_07-02-20/archive/org.apache.any23.plugins/apache-any23-html-scraper/1.0.2-20120927.070543-16/apache-any23-html-scraper-1.0.2-20120927.070543-16.zip
[JENKINS] Archiving <https://builds.apache.org/job/Any23-trunk/ws/encoding/pom.xml>
to /home/hudson/hudson/jobs/Any23-trunk/modules/org.apache.any23$apache-any23-encoding/builds/2012-09-27_07-02-20/archive/org.apache.any23/apache-any23-encoding/0.7.1-SNAPSHOT/apache-any23-encoding-0.7.1-SNAPSHOT.pom
[JENKINS] Archiving <https://builds.apache.org/job/Any23-trunk/ws/encoding/target/apache-any23-encoding-0.7.1-SNAPSHOT.jar>
to /home/hudson/hudson/jobs/Any23-trunk/modules/org.apache.any23$apache-any23-encoding/builds/2012-09-27_07-02-20/archive/org.apache.any23/apache-any23-encoding/0.7.1-20120927.070408-21/apache-any23-encoding-0.7.1-20120927.070408-21.jar
[JENKINS] Archiving <https://builds.apache.org/job/Any23-trunk/ws/mime/pom.xml> to /home/hudson/hudson/jobs/Any23-trunk/modules/org.apache.any23$apache-any23-mime/builds/2012-09-27_07-02-20/archive/org.apache.any23/apache-any23-mime/0.7.1-SNAPSHOT/apache-any23-mime-0.7.1-SNAPSHOT.pom
[JENKINS] Archiving <https://builds.apache.org/job/Any23-trunk/ws/mime/target/apache-any23-mime-0.7.1-SNAPSHOT.jar>
to /home/hudson/hudson/jobs/Any23-trunk/modules/org.apache.any23$apache-any23-mime/builds/2012-09-27_07-02-20/archive/org.apache.any23/apache-any23-mime/0.7.1-20120927.070359-21/apache-any23-mime-0.7.1-20120927.070359-21.jar
[JENKINS] Archiving <https://builds.apache.org/job/Any23-trunk/ws/api/pom.xml> to /home/hudson/hudson/jobs/Any23-trunk/modules/org.apache.any23$apache-any23-api/builds/2012-09-27_07-02-20/archive/org.apache.any23/apache-any23-api/0.7.1-SNAPSHOT/apache-any23-api-0.7.1-SNAPSHOT.pom
[JENKINS] Archiving <https://builds.apache.org/job/Any23-trunk/ws/api/target/apache-any23-api-0.7.1-SNAPSHOT.jar>
to /home/hudson/hudson/jobs/Any23-trunk/modules/org.apache.any23$apache-any23-api/builds/2012-09-27_07-02-20/archive/org.apache.any23/apache-any23-api/0.7.1-20120927.070331-21/apache-any23-api-0.7.1-20120927.070331-21.jar
[JENKINS] Archiving <https://builds.apache.org/job/Any23-trunk/ws/plugins/integration-test/pom.xml>
to /home/hudson/hudson/jobs/Any23-trunk/modules/org.apache.any23.plugins$apache-any23-integration-test/builds/2012-09-27_07-02-20/archive/org.apache.any23.plugins/apache-any23-integration-test/0.7.1-SNAPSHOT/apache-any23-integration-test-0.7.1-SNAPSHOT.pom
[JENKINS] Archiving <https://builds.apache.org/job/Any23-trunk/ws/plugins/integration-test/target/apache-any23-integration-test-0.7.1-SNAPSHOT.jar>
to /home/hudson/hudson/jobs/Any23-trunk/modules/org.apache.any23.plugins$apache-any23-integration-test/builds/2012-09-27_07-02-20/archive/org.apache.any23.plugins/apache-any23-integration-test/0.7.1-SNAPSHOT/apache-any23-integration-test-0.7.1-SNAPSHOT.jar
[JENKINS] Archiving <https://builds.apache.org/job/Any23-trunk/ws/csvutils/pom.xml>
to /home/hudson/hudson/jobs/Any23-trunk/modules/org.apache.any23$apache-any23-csvutils/builds/2012-09-27_07-02-20/archive/org.apache.any23/apache-any23-csvutils/0.7.1-SNAPSHOT/apache-any23-csvutils-0.7.1-SNAPSHOT.pom
[JENKINS] Archiving <https://builds.apache.org/job/Any23-trunk/ws/csvutils/target/apache-any23-csvutils-0.7.1-SNAPSHOT.jar>
to /home/hudson/hudson/jobs/Any23-trunk/modules/org.apache.any23$apache-any23-csvutils/builds/2012-09-27_07-02-20/archive/org.apache.any23/apache-any23-csvutils/0.7.1-20120927.070353-21/apache-any23-csvutils-0.7.1-20120927.070353-21.jar
Waiting for Jenkins to finish collecting data
mavenExecutionResult exceptions not empty
message : Failed to execute goal org.apache.maven.plugins:maven-invoker-plugin:1.5:run (default)
on project apache-any23-integration-test: 1 build failed.
cause : 1 build failed.
Stack trace : 
org.apache.maven.lifecycle.LifecycleExecutionException: Failed to execute goal org.apache.maven.plugins:maven-invoker-plugin:1.5:run
(default) on project apache-any23-integration-test: 1 build failed.
	at org.apache.maven.lifecycle.internal.MojoExecutor.execute(MojoExecutor.java:213)
	at org.apache.maven.lifecycle.internal.MojoExecutor.execute(MojoExecutor.java:153)
	at org.apache.maven.lifecycle.internal.MojoExecutor.execute(MojoExecutor.java:145)
	at org.apache.maven.lifecycle.internal.LifecycleModuleBuilder.buildProject(LifecycleModuleBuilder.java:84)
	at org.apache.maven.lifecycle.internal.LifecycleModuleBuilder.buildProject(LifecycleModuleBuilder.java:59)
	at org.apache.maven.lifecycle.internal.LifecycleStarter.singleThreadedBuild(LifecycleStarter.java:183)
	at org.apache.maven.lifecycle.internal.LifecycleStarter.execute(LifecycleStarter.java:161)
	at org.apache.maven.DefaultMaven.doExecute(DefaultMaven.java:319)
	at org.apache.maven.DefaultMaven.execute(DefaultMaven.java:156)
	at org.jvnet.hudson.maven3.launcher.Maven3Launcher.main(Maven3Launcher.java:79)
	at sun.reflect.NativeMethodAccessorImpl.invoke0(Native Method)
	at sun.reflect.NativeMethodAccessorImpl.invoke(NativeMethodAccessorImpl.java:39)
	at sun.reflect.DelegatingMethodAccessorImpl.invoke(DelegatingMethodAccessorImpl.java:25)
	at java.lang.reflect.Method.invoke(Method.java:597)
	at org.codehaus.plexus.classworlds.launcher.Launcher.launchStandard(Launcher.java:329)
	at org.codehaus.plexus.classworlds.launcher.Launcher.launch(Launcher.java:239)
	at org.jvnet.hudson.maven3.agent.Maven3Main.launch(Maven3Main.java:158)
	at hudson.maven.Maven3Builder.call(Maven3Builder.java:98)
	at hudson.maven.Maven3Builder.call(Maven3Builder.java:64)
	at hudson.remoting.UserRequest.perform(UserRequest.java:118)
	at hudson.remoting.UserRequest.perform(UserRequest.java:48)
	at hudson.remoting.Request$2.run(Request.java:326)
	at hudson.remoting.InterceptingExecutorService$1.call(InterceptingExecutorService.java:72)
	at java.util.concurrent.FutureTask$Sync.innerRun(FutureTask.java:303)
	at java.util.concurrent.FutureTask.run(FutureTask.java:138)
	at java.util.concurrent.ThreadPoolExecutor$Worker.runTask(ThreadPoolExecutor.java:886)
	at java.util.concurrent.ThreadPoolExecutor$Worker.run(ThreadPoolExecutor.java:908)
	at java.lang.Thread.run(Thread.java:662)
Caused by: org.apache.maven.plugin.MojoFailureException: 1 build failed.
	at org.apache.maven.plugin.invoker.InvokerSession.handleFailures(InvokerSession.java:263)
	at org.apache.maven.plugin.invoker.InvokerMojo.processResults(InvokerMojo.java:58)
	at org.apache.maven.plugin.invoker.AbstractInvokerMojo.execute(AbstractInvokerMojo.java:620)
	at org.apache.maven.plugin.DefaultBuildPluginManager.executeMojo(DefaultBuildPluginManager.java:101)
	at org.apache.maven.lifecycle.internal.MojoExecutor.execute(MojoExecutor.java:209)
	... 27 more
Sending e-mails to: any23-dev@apache.org
channel stopped

Mime
View raw message