ant-user mailing list archives

Site index · List index
Message view « Date » · « Thread »
Top « Date » · « Thread »
From "Eduardo B. Santilli - SICREDI Servi├žos" <santi...@sicredi.com.br>
Subject jspc compilation problem
Date Fri, 02 Aug 2002 17:08:21 GMT
Hi, 
    I was compiling the jsp file with the jspc tag and this erros appears...

BUILD FAILED
C:\eclipse\workspace\seguro\script\build.xml:119: java.io.IOException: CreateProcess: C:\j2sdk1.4.0\
jre\bin\java.exe -classpath C:\eclipse\workspace\seguro\lib\common\activation.jar;C:\eclipse\workspa
ce\seguro\lib\common\classes12.jar;C:\eclipse\workspace\seguro\lib\common\itext-0.92.jar;C:\eclipse\
workspace\seguro\lib\common\jakarta-regexp-1.2.jar;C:\eclipse\workspace\seguro\lib\common\localedata
.jar;C:\eclipse\workspace\seguro\lib\common\log4j-1.2beta4.jar;C:\eclipse\workspace\seguro\lib\commo
n\oreilly.jar;C:\eclipse\workspace\seguro\lib\common\servlet-2_3-fcs-classfiles.jar;C:\eclipse\works
pace\seguro\lib\meta_fw\fw_meta.jar;C:\eclipse\workspace\seguro\lib\oc4j\ejb.jar;C:\eclipse\workspac
e\seguro\lib\oc4j\j2ee.jar;C:\eclipse\workspace\seguro\lib\oc4j\jndi.jar;C:\eclipse\workspace\seguro
\lib\oc4j\oc4j.jar;C:\eclipse\workspace\seguro\lib\oc4j\oc4jclient.jar;C:\eclipse\workspace\seguro\l
ib\oc4j\orion.jar;C:\eclipse\workspace\seguro\lib\sis-java.jar;C:\eclipse\workspace\seguro\classes
o
rg.apache.jasper.JspC -d C:\eclipse\workspace\seguro\build\jsp -v0 -die9 C:\eclipse\workspace\s?
        at org.apache.tools.ant.taskdefs.Java.run(Java.java:459)
        at org.apache.tools.ant.taskdefs.Java.executeJava(Java.java:160)
        at org.apache.tools.ant.taskdefs.Java.execute(Java.java:108)
        at org.apache.tools.ant.taskdefs.optional.jsp.compilers.JasperC.execute(JasperC.java:104)
        at org.apache.tools.ant.taskdefs.optional.jsp.JspC.doCompilation(JspC.java:460)
        at org.apache.tools.ant.taskdefs.optional.jsp.JspC.execute(JspC.java:424)
        at org.apache.tools.ant.Task.perform(Task.java:313)
        at org.apache.tools.ant.Target.execute(Target.java:309)
        at org.apache.tools.ant.Target.performTasks(Target.java:334)
        at org.apache.tools.ant.Project.executeTarget(Project.java:1216)
        at org.apache.tools.ant.Project.executeTargets(Project.java:1160)
        at org.apache.tools.ant.Main.runBuild(Main.java:605)
        at org.apache.tools.ant.Main.start(Main.java:195)
        at org.apache.tools.ant.Main.main(Main.java:234)
--- Nested Exception ---
java.io.IOException: CreateProcess: C:\j2sdk1.4.0\jre\bin\java.exe -classpath C:\eclipse\workspace\s
eguro\lib\common\activation.jar;C:\eclipse\workspace\seguro\lib\common\classes12.jar;C:\eclipse\work
space\seguro\lib\common\itext-0.92.jar;C:\eclipse\workspace\seguro\lib\common\jakarta-regexp-1.2.jar
;C:\eclipse\workspace\seguro\lib\common\localedata.jar;C:\eclipse\workspace\seguro\lib\common\log4j-
1.2beta4.jar;C:\eclipse\workspace\seguro\lib\common\oreilly.jar;C:\eclipse\workspace\seguro\lib\comm
on\servlet-2_3-fcs-classfiles.jar;C:\eclipse\workspace\seguro\lib\meta_fw\fw_meta.jar;C:\eclipse\wor
kspace\seguro\lib\oc4j\ejb.jar;C:\eclipse\workspace\seguro\lib\oc4j\j2ee.jar;C:\eclipse\workspace\se
guro\lib\oc4j\jndi.jar;C:\eclipse\workspace\seguro\lib\oc4j\oc4j.jar;C:\eclipse\workspace\seguro\lib
\oc4j\oc4jclient.jar;C:\eclipse\workspace\seguro\lib\oc4j\orion.jar;C:\eclipse\workspace\seguro\lib\
sis-java.jar;C:\eclipse\workspace\seguro\classes org.apache.jasper.JspC -d C:\eclipse\workspace\segu
ro\build\jsp -v0 -die9 C:\eclipse\workspace\s?
        at java.lang.Win32Process.create(Native Method)
        at java.lang.Win32Process.<init>(Win32Process.java:63)
        at java.lang.Runtime.execInternal(Native Method)
        at java.lang.Runtime.exec(Runtime.java:550)
        at sun.reflect.NativeMethodAccessorImpl.invoke0(Native Method)
        at sun.reflect.NativeMethodAccessorImpl.invoke(NativeMethodAccessorImpl.java:39)
        at sun.reflect.DelegatingMethodAccessorImpl.invoke(DelegatingMethodAccessorImpl.java:25)
        at java.lang.reflect.Method.invoke(Method.java:324)
        at org.apache.tools.ant.taskdefs.Execute$Java13CommandLauncher.exec(Execute.java:624)
        at org.apache.tools.ant.taskdefs.Execute.launch(Execute.java:396)
        at org.apache.tools.ant.taskdefs.Execute.execute(Execute.java:407)
        at org.apache.tools.ant.taskdefs.Java.run(Java.java:453)
        at org.apache.tools.ant.taskdefs.Java.executeJava(Java.java:160)
        at org.apache.tools.ant.taskdefs.Java.execute(Java.java:108)
        at org.apache.tools.ant.taskdefs.optional.jsp.compilers.JasperC.execute(JasperC.java:104)
        at org.apache.tools.ant.taskdefs.optional.jsp.JspC.doCompilation(JspC.java:460)
        at org.apache.tools.ant.taskdefs.optional.jsp.JspC.execute(JspC.java:424)
        at org.apache.tools.ant.Task.perform(Task.java:313)
        at org.apache.tools.ant.Target.execute(Target.java:309)
        at org.apache.tools.ant.Target.performTasks(Target.java:334)
        at org.apache.tools.ant.Project.executeTarget(Project.java:1216)
        at org.apache.tools.ant.Project.executeTargets(Project.java:1160)
        at org.apache.tools.ant.Main.runBuild(Main.java:605)
        at org.apache.tools.ant.Main.start(Main.java:195)
        at org.apache.tools.ant.Main.main(Main.java:234)


    Some one know how to solve this problem?

Thanks.....

eduardo santilli

Mime
  • Unnamed multipart/alternative (inline, None, 0 bytes)
View raw message