ant-notifications mailing list archives

Site index · List index
Message view « Date » · « Thread »
Top « Date » · « Thread »
From Apache Jenkins Server <jenk...@builds.apache.org>
Subject Build failed in Jenkins: AntLib-svn #22
Date Mon, 17 Dec 2018 17:43:59 GMT
See <https://builds.apache.org/job/AntLib-svn/22/display/redirect>

------------------------------------------
Started by upstream project "AntLib-common" build number 22
originally caused by:
 Started by an SCM change
[EnvInject] - Loading node environment variables.
Building remotely on H42 (ubuntu xenial) in workspace <https://builds.apache.org/job/AntLib-svn/ws/>
Cloning the remote Git repository
Cloning repository https://gitbox.apache.org/repos/asf/ant-antlibs-svn.git
 > git init <https://builds.apache.org/job/AntLib-svn/ws/> # timeout=10
Fetching upstream changes from https://gitbox.apache.org/repos/asf/ant-antlibs-svn.git
 > git --version # timeout=10
 > git fetch --tags --progress https://gitbox.apache.org/repos/asf/ant-antlibs-svn.git
+refs/heads/*:refs/remotes/origin/*
 > git config remote.origin.url https://gitbox.apache.org/repos/asf/ant-antlibs-svn.git
# timeout=10
 > git config --add remote.origin.fetch +refs/heads/*:refs/remotes/origin/* # timeout=10
 > git config remote.origin.url https://gitbox.apache.org/repos/asf/ant-antlibs-svn.git
# timeout=10
Fetching upstream changes from https://gitbox.apache.org/repos/asf/ant-antlibs-svn.git
 > git fetch --tags --progress https://gitbox.apache.org/repos/asf/ant-antlibs-svn.git
+refs/heads/*:refs/remotes/origin/*
 > git rev-parse refs/remotes/origin/master^{commit} # timeout=10
 > git rev-parse refs/remotes/origin/origin/master^{commit} # timeout=10
Checking out Revision e4eee689fd04a99f3543bfe8a30496f624c13bb1 (refs/remotes/origin/master)
 > git config core.sparsecheckout # timeout=10
 > git checkout -f e4eee689fd04a99f3543bfe8a30496f624c13bb1
Commit message: "moved to gitbox"
First time build. Skipping changelog.
 > git remote # timeout=10
 > git submodule init # timeout=10
 > git submodule sync # timeout=10
 > git config --get remote.origin.url # timeout=10
 > git submodule init # timeout=10
 > git config -f .gitmodules --get-regexp ^submodule\.(.+)\.url # timeout=10
 > git config --get submodule.common.url # timeout=10
 > git config -f .gitmodules --get submodule.common.path # timeout=10
 > git submodule update --init --recursive common
[AntLib-svn] $ /home/jenkins/tools/ant/apache-ant-1.9.9/bin/ant -file prepare.xml bootstrap
Buildfile: <https://builds.apache.org/job/AntLib-svn/ws/prepare.xml>

update-prepare-script:
     [echo] updating prepare.xml
     [copy] Copying 1 file to <https://builds.apache.org/job/AntLib-svn/ws/>

bootstrap:
     [echo] Bootstrap done. Next step:
     [echo]   ant -f prepare.xml prepare

BUILD SUCCESSFUL
Total time: 0 seconds
[AntLib-svn] $ /home/jenkins/tools/ant/apache-ant-1.9.9/bin/ant -file prepare.xml prepare
Buildfile: <https://builds.apache.org/job/AntLib-svn/ws/prepare.xml>

get-antunit:
     [echo] updating AntUnit
      [get] Getting: http://repo1.maven.org/maven2/org/apache/ant/ant-antunit/1.3/ant-antunit-1.3.jar
      [get] To: <https://builds.apache.org/job/AntLib-svn/ws/ant-antunit.jar>

prepare:
     [echo] Preparation done. Next steps:
     [echo]  ant clean distribution
     [echo]  ant -lib ant-antunit.jar -lib build/lib test

BUILD SUCCESSFUL
Total time: 0 seconds
[AntLib-svn] $ /home/jenkins/tools/ant/apache-ant-1.9.9/bin/ant clean distribution
Buildfile: <https://builds.apache.org/job/AntLib-svn/ws/build.xml>

setup-properties:

common.clean:

clean:

setup-properties:

setup:
    [mkdir] Created dir: <https://builds.apache.org/job/AntLib-svn/ws/build/classes>
    [mkdir] Created dir: <https://builds.apache.org/job/AntLib-svn/ws/build/test-classes>
    [mkdir] Created dir: <https://builds.apache.org/job/AntLib-svn/ws/build/lib>
     [copy] Copying 1 file to <https://builds.apache.org/job/AntLib-svn/ws/docs>

download-ivy:
    [mkdir] Created dir: <https://builds.apache.org/job/AntLib-svn/ws/ivy>
     [echo] installing ivy...
      [get] Getting: http://repo1.maven.org/maven2/org/apache/ivy/ivy/2.4.0/ivy-2.4.0.jar
      [get] To: <https://builds.apache.org/job/AntLib-svn/ws/ivy/ivy.jar>

install-ivy:

-no-resolve:

resolve:
[ivy:resolve] :: Apache Ivy 2.4.0 - 20141213170938 :: http://ant.apache.org/ivy/ ::
[ivy:resolve] :: loading settings :: url = jar:<https://builds.apache.org/job/AntLib-svn/ws/ivy/ivy.jar!/org/apache/ivy/core/settings/ivysettings.xml>
[ivy:resolve] :: resolving dependencies :: Apache Ant#ant-svn;0.1-SNAPSHOT
[ivy:resolve] 	confs: [default, test]
[ivy:resolve] :: resolution report :: resolve 557ms :: artifacts dl 0ms
	---------------------------------------------------------------------
	|                  |            modules            ||   artifacts   |
	|       conf       | number| search|dwnlded|evicted|| number|dwnlded|
	---------------------------------------------------------------------
	|      default     |   0   |   0   |   0   |   0   ||   0   |   0   |
	|       test       |   1   |   0   |   0   |   0   ||   0   |   0   |
	---------------------------------------------------------------------
[ivy:resolve] 
[ivy:resolve] :: problems summary ::
[ivy:resolve] :::: WARNINGS
[ivy:resolve] 		module not found: junit#junit;4.11
[ivy:resolve] 	==== local: tried
[ivy:resolve] 	  /home/jenkins/.ivy2/local/junit/junit/4.11/ivys/ivy.xml
[ivy:resolve] 	  -- artifact junit#junit;4.11!junit.jar:
[ivy:resolve] 	  /home/jenkins/.ivy2/local/junit/junit/4.11/jars/junit.jar
[ivy:resolve] 	==== shared: tried
[ivy:resolve] 	  /home/jenkins/.ivy2/shared/junit/junit/4.11/ivys/ivy.xml
[ivy:resolve] 	  -- artifact junit#junit;4.11!junit.jar:
[ivy:resolve] 	  /home/jenkins/.ivy2/shared/junit/junit/4.11/jars/junit.jar
[ivy:resolve] 	==== public: tried
[ivy:resolve] 	  https://repo1.maven.org/maven2/junit/junit/4.11/junit-4.11.pom
[ivy:resolve] 	  -- artifact junit#junit;4.11!junit.jar:
[ivy:resolve] 	  https://repo1.maven.org/maven2/junit/junit/4.11/junit-4.11.jar
[ivy:resolve] 		::::::::::::::::::::::::::::::::::::::::::::::
[ivy:resolve] 		::          UNRESOLVED DEPENDENCIES         ::
[ivy:resolve] 		::::::::::::::::::::::::::::::::::::::::::::::
[ivy:resolve] 		:: junit#junit;4.11: not found
[ivy:resolve] 		::::::::::::::::::::::::::::::::::::::::::::::
[ivy:resolve] :::: ERRORS
[ivy:resolve] 	Server access error at url https://repo1.maven.org/maven2/junit/junit/4.11/junit-4.11.pom
(javax.net.ssl.SSLException: Received fatal alert: protocol_version)
[ivy:resolve] 	Server access error at url https://repo1.maven.org/maven2/junit/junit/4.11/junit-4.11.jar
(javax.net.ssl.SSLException: Received fatal alert: protocol_version)
[ivy:resolve] 
[ivy:resolve] :: USE VERBOSE OR DEBUG MESSAGE LEVEL FOR MORE DETAILS

BUILD FAILED
<https://builds.apache.org/job/AntLib-svn/ws/common/ivy.xml>:147: impossible to resolve
dependencies:
	resolve failed - see output for details

Total time: 1 second
Build step 'Invoke Ant' marked build as failure
[WARNINGS] Skipping publisher since build result is FAILURE
[TASKS] Skipping publisher since build result is FAILURE
Archiving artifacts
Recording test results
ERROR: Step ?Publish JUnit test result report? failed: No test report files were found. Configuration
error?
Publishing Javadoc

Mime
View raw message